mesos-builds mailing list archives

Site index · List index
Message view « Date » · « Thread »
Top « Date » · « Thread »
From Apache Jenkins Server <jenk...@builds.apache.org>
Subject Build failed in Jenkins: Mesos-Reviewbot #18628
Date Fri, 28 Jul 2017 17:40:49 GMT
See <https://builds.apache.org/job/Mesos-Reviewbot/18628/display/redirect?page=changes>

Changes:

[alexr] Minor style cleanups in process.cpp.

[alexr] Removed almost identical master and slave metrics tests.

------------------------------------------
[...truncated 30.53 MB...]
W0728 17:40:41.774648  5107 backend.cpp:76] Failed to create 'overlay' backend: OverlayBackend
requires root privileges
W0728 17:40:41.774811  5107 backend.cpp:76] Failed to create 'bind' backend: BindBackend requires
root privileges
I0728 17:40:41.774852  5107 provisioner.cpp:255] Using default backend 'copy'
I0728 17:40:41.780035  5127 slave.cpp:250] Mesos agent started on (795)@172.17.0.3:46155
I0728 17:40:41.780077  5127 slave.cpp:251] Flags at startup: --acls="" --appc_simple_discovery_uri_prefix="http://"
--appc_store_dir="/tmp/Endpoint_SlaveEndpointTest_AuthorizedRequest_2_EIXR3j/store/appc" --authenticate_http_readonly="true"
--authenticate_http_readwrite="true" --authenticatee="crammd5" --authentication_backoff_factor="1secs"
--authorizer="local" --cgroups_cpu_enable_pids_and_tids_count="false" --cgroups_enable_cfs="false"
--cgroups_hierarchy="/sys/fs/cgroup" --cgroups_limit_swap="false" --cgroups_root="mesos" --container_disk_watch_interval="15secs"
--containerizers="mesos" --credential="/tmp/Endpoint_SlaveEndpointTest_AuthorizedRequest_2_EIXR3j/credential"
--default_role="*" --disk_watch_interval="1mins" --docker="docker" --docker_kill_orphans="true"
--docker_registry="https://registry-1.docker.io" --docker_remove_delay="6hrs" --docker_socket="/var/run/docker.sock"
--docker_stop_timeout="0ns" --docker_store_dir="/tmp/Endpoint_SlaveEndpointTest_AuthorizedRequest_2_EIXR3j/store/docker"
--docker_volume_checkpoint_dir="/var/run/mesos/isolators/docker/volume" --enforce_container_disk_quota="false"
--executor_registration_timeout="1mins" --executor_reregistration_timeout="2secs" --executor_shutdown_grace_period="5secs"
--fetcher_cache_dir="/tmp/Endpoint_SlaveEndpointTest_AuthorizedRequest_2_EIXR3j/fetch" --fetcher_cache_size="2GB"
--frameworks_home="" --gc_delay="1weeks" --gc_disk_headroom="0.1" --hadoop_home="" --help="false"
--hostname_lookup="true" --http_command_executor="false" --http_credentials="/tmp/Endpoint_SlaveEndpointTest_AuthorizedRequest_2_EIXR3j/http_credentials"
--http_heartbeat_interval="30secs" --initialize_driver_logging="true" --isolation="posix/cpu,posix/mem"
--launcher="posix" --launcher_dir="/mesos/mesos-1.4.0/_build/src" --logbufsecs="0" --logging_level="INFO"
--max_completed_executors_per_framework="150" --oversubscribed_resources_interval="15secs"
--perf_duration="10secs" --perf_interval="1mins" --port="5051" --qos_correction_interval_min="0ns"
--quiet="false" --recover="reconnect" --recovery_timeout="15mins" --registration_backoff_factor="10ms"
--resources="cpus:2;gpus:0;mem:1024;disk:1024;ports:[31000-32000]" --revocable_cpu_low_priority="true"
--runtime_dir="/tmp/Endpoint_SlaveEndpointTest_AuthorizedRequest_2_EIXR3j" --sandbox_directory="/mnt/mesos/sandbox"
--strict="true" --switch_user="true" --systemd_enable_support="true" --systemd_runtime_directory="/run/systemd/system"
--version="false" --work_dir="/tmp/Endpoint_SlaveEndpointTest_AuthorizedRequest_2_1pZHBI"
I0728 17:40:41.780786  5127 credentials.hpp:86] Loading credential for authentication from
'/tmp/Endpoint_SlaveEndpointTest_AuthorizedRequest_2_EIXR3j/credential'
I0728 17:40:41.781044  5127 slave.cpp:283] Agent using credential for: test-principal
I0728 17:40:41.781071  5127 credentials.hpp:37] Loading credentials for authentication from
'/tmp/Endpoint_SlaveEndpointTest_AuthorizedRequest_2_EIXR3j/http_credentials'
I0728 17:40:41.781445  5127 http.cpp:993] Creating default 'basic' HTTP authenticator for
realm 'mesos-agent-readonly'
I0728 17:40:41.781702  5127 http.cpp:993] Creating default 'basic' HTTP authenticator for
realm 'mesos-agent-readwrite'
I0728 17:40:41.783864  5127 slave.cpp:565] Agent resources: [{"name":"cpus","scalar":{"value":2.0},"type":"SCALAR"},{"name":"mem","scalar":{"value":1024.0},"type":"SCALAR"},{"name":"disk","scalar":{"value":1024.0},"type":"SCALAR"},{"name":"ports","ranges":{"range":[{"begin":31000,"end":32000}]},"type":"RANGES"}]
I0728 17:40:41.784297  5127 slave.cpp:573] Agent attributes: [  ]
I0728 17:40:41.784317  5127 slave.cpp:582] Agent hostname: c8cdc29ab7a1
I0728 17:40:41.784719  5132 status_update_manager.cpp:177] Pausing sending status updates
I0728 17:40:41.786603  5130 state.cpp:64] Recovering state from '/tmp/Endpoint_SlaveEndpointTest_AuthorizedRequest_2_1pZHBI/meta'
I0728 17:40:41.787278  5133 status_update_manager.cpp:203] Recovering status update manager
I0728 17:40:41.787796  5128 containerizer.cpp:582] Recovering containerizer
I0728 17:40:41.789865  5128 provisioner.cpp:416] Provisioner recovery complete
I0728 17:40:41.790531  5133 slave.cpp:6207] Finished recovery
I0728 17:40:41.791322  5133 slave.cpp:6389] Querying resource estimator for oversubscribable
resources
I0728 17:40:41.791684  5130 slave.cpp:6403] Received oversubscribable resources {} from the
resource estimator
I0728 17:40:41.795696  5130 process.cpp:3836] Handling HTTP event for process 'slave(795)'
with path: '/slave(795)/containers'
I0728 17:40:41.797848  5133 http.cpp:1133] HTTP GET for /slave(795)/containers from 172.17.0.3:41200
I0728 17:40:41.798033  5133 http.cpp:957] Authorizing principal 'test-principal' to GET the
'/containers' endpoint
I0728 17:40:41.804807  5127 slave.cpp:843] Agent terminating
[       OK ] Endpoint/SlaveEndpointTest.AuthorizedRequest/2 (47 ms)
[ RUN      ] Endpoint/SlaveEndpointTest.UnauthorizedRequest/0
I0728 17:40:41.822353  5107 containerizer.cpp:230] Using isolation: posix/cpu,posix/mem,filesystem/posix,network/cni,environment_secret
W0728 17:40:41.823120  5107 backend.cpp:76] Failed to create 'overlay' backend: OverlayBackend
requires root privileges
W0728 17:40:41.823279  5107 backend.cpp:76] Failed to create 'bind' backend: BindBackend requires
root privileges
I0728 17:40:41.823321  5107 provisioner.cpp:255] Using default backend 'copy'
I0728 17:40:41.828414  5126 slave.cpp:250] Mesos agent started on (796)@172.17.0.3:46155
I0728 17:40:41.828459  5126 slave.cpp:251] Flags at startup: --acls="" --appc_simple_discovery_uri_prefix="http://"
--appc_store_dir="/tmp/Endpoint_SlaveEndpointTest_UnauthorizedRequest_0_CF30iK/store/appc"
--authenticate_http_readonly="true" --authenticate_http_readwrite="true" --authenticatee="crammd5"
--authentication_backoff_factor="1secs" --authorizer="local" --cgroups_cpu_enable_pids_and_tids_count="false"
--cgroups_enable_cfs="false" --cgroups_hierarchy="/sys/fs/cgroup" --cgroups_limit_swap="false"
--cgroups_root="mesos" --container_disk_watch_interval="15secs" --containerizers="mesos" --credential="/tmp/Endpoint_SlaveEndpointTest_UnauthorizedRequest_0_CF30iK/credential"
--default_role="*" --disk_watch_interval="1mins" --docker="docker" --docker_kill_orphans="true"
--docker_registry="https://registry-1.docker.io" --docker_remove_delay="6hrs" --docker_socket="/var/run/docker.sock"
--docker_stop_timeout="0ns" --docker_store_dir="/tmp/Endpoint_SlaveEndpointTest_UnauthorizedRequest_0_CF30iK/store/docker"
--docker_volume_checkpoint_dir="/var/run/mesos/isolators/docker/volume" --enforce_container_disk_quota="false"
--executor_registration_timeout="1mins" --executor_reregistration_timeout="2secs" --executor_shutdown_grace_period="5secs"
--fetcher_cache_dir="/tmp/Endpoint_SlaveEndpointTest_UnauthorizedRequest_0_CF30iK/fetch" --fetcher_cache_size="2GB"
--frameworks_home="" --gc_delay="1weeks" --gc_disk_headroom="0.1" --hadoop_home="" --help="false"
--hostname_lookup="true" --http_command_executor="false" --http_credentials="/tmp/Endpoint_SlaveEndpointTest_UnauthorizedRequest_0_CF30iK/http_credentials"
--http_heartbeat_interval="30secs" --initialize_driver_logging="true" --isolation="posix/cpu,posix/mem"
--launcher="posix" --launcher_dir="/mesos/mesos-1.4.0/_build/src" --logbufsecs="0" --logging_level="INFO"
--max_completed_executors_per_framework="150" --oversubscribed_resources_interval="15secs"
--perf_duration="10secs" --perf_interval="1mins" --port="5051" --qos_correction_interval_min="0ns"
--quiet="false" --recover="reconnect" --recovery_timeout="15mins" --registration_backoff_factor="10ms"
--resources="cpus:2;gpus:0;mem:1024;disk:1024;ports:[31000-32000]" --revocable_cpu_low_priority="true"
--runtime_dir="/tmp/Endpoint_SlaveEndpointTest_UnauthorizedRequest_0_CF30iK" --sandbox_directory="/mnt/mesos/sandbox"
--strict="true" --switch_user="true" --systemd_enable_support="true" --systemd_runtime_directory="/run/systemd/system"
--version="false" --work_dir="/tmp/Endpoint_SlaveEndpointTest_UnauthorizedRequest_0_32n1I8"
I0728 17:40:41.829604  5126 credentials.hpp:86] Loading credential for authentication from
'/tmp/Endpoint_SlaveEndpointTest_UnauthorizedRequest_0_CF30iK/credential'
I0728 17:40:41.830077  5126 slave.cpp:283] Agent using credential for: test-principal
I0728 17:40:41.830118  5126 credentials.hpp:37] Loading credentials for authentication from
'/tmp/Endpoint_SlaveEndpointTest_UnauthorizedRequest_0_CF30iK/http_credentials'
I0728 17:40:41.830864  5126 http.cpp:993] Creating default 'basic' HTTP authenticator for
realm 'mesos-agent-readonly'
I0728 17:40:41.831306  5126 http.cpp:993] Creating default 'basic' HTTP authenticator for
realm 'mesos-agent-readwrite'
I0728 17:40:41.833735  5126 slave.cpp:565] Agent resources: [{"name":"cpus","scalar":{"value":2.0},"type":"SCALAR"},{"name":"mem","scalar":{"value":1024.0},"type":"SCALAR"},{"name":"disk","scalar":{"value":1024.0},"type":"SCALAR"},{"name":"ports","ranges":{"range":[{"begin":31000,"end":32000}]},"type":"RANGES"}]
I0728 17:40:41.834192  5126 slave.cpp:573] Agent attributes: [  ]
I0728 17:40:41.834280  5126 slave.cpp:582] Agent hostname: c8cdc29ab7a1
I0728 17:40:41.834736  5132 status_update_manager.cpp:177] Pausing sending status updates
I0728 17:40:41.836786  5130 state.cpp:64] Recovering state from '/tmp/Endpoint_SlaveEndpointTest_UnauthorizedRequest_0_32n1I8/meta'
I0728 17:40:41.837347  5132 status_update_manager.cpp:203] Recovering status update manager
I0728 17:40:41.837800  5127 containerizer.cpp:582] Recovering containerizer
I0728 17:40:41.839923  5130 provisioner.cpp:416] Provisioner recovery complete
I0728 17:40:41.840531  5132 slave.cpp:6207] Finished recovery
I0728 17:40:41.841431  5132 slave.cpp:6389] Querying resource estimator for oversubscribable
resources
I0728 17:40:41.841876  5131 slave.cpp:6403] Received oversubscribable resources {} from the
resource estimator
I0728 17:40:41.846211  5131 process.cpp:3836] Handling HTTP event for process 'slave(796)'
with path: '/slave(796)/monitor/statistics'
I0728 17:40:41.848325  5132 http.cpp:1133] HTTP GET for /slave(796)/monitor/statistics from
172.17.0.3:41202
I0728 17:40:41.848460  5132 http.cpp:957] Authorizing principal 'test-principal' to GET the
'/monitor/statistics' endpoint
I0728 17:40:41.852197  5126 slave.cpp:843] Agent terminating
[       OK ] Endpoint/SlaveEndpointTest.UnauthorizedRequest/0 (47 ms)
[ RUN      ] Endpoint/SlaveEndpointTest.UnauthorizedRequest/1
I0728 17:40:41.869596  5107 containerizer.cpp:230] Using isolation: posix/cpu,posix/mem,filesystem/posix,network/cni,environment_secret
W0728 17:40:41.870357  5107 backend.cpp:76] Failed to create 'overlay' backend: OverlayBackend
requires root privileges
W0728 17:40:41.870522  5107 backend.cpp:76] Failed to create 'bind' backend: BindBackend requires
root privileges
I0728 17:40:41.870563  5107 provisioner.cpp:255] Using default backend 'copy'
I0728 17:40:41.875545  5131 slave.cpp:250] Mesos agent started on (797)@172.17.0.3:46155
I0728 17:40:41.875586  5131 slave.cpp:251] Flags at startup: --acls="" --appc_simple_discovery_uri_prefix="http://"
--appc_store_dir="/tmp/Endpoint_SlaveEndpointTest_UnauthorizedRequest_1_Imnd3a/store/appc"
--authenticate_http_readonly="true" --authenticate_http_readwrite="true" --authenticatee="crammd5"
--authentication_backoff_factor="1secs" --authorizer="local" --cgroups_cpu_enable_pids_and_tids_count="false"
--cgroups_enable_cfs="false" --cgroups_hierarchy="/sys/fs/cgroup" --cgroups_limit_swap="false"
--cgroups_root="mesos" --container_disk_watch_interval="15secs" --containerizers="mesos" --credential="/tmp/Endpoint_SlaveEndpointTest_UnauthorizedRequest_1_Imnd3a/credential"
--default_role="*" --disk_watch_interval="1mins" --docker="docker" --docker_kill_orphans="true"
--docker_registry="https://registry-1.docker.io" --docker_remove_delay="6hrs" --docker_socket="/var/run/docker.sock"
--docker_stop_timeout="0ns" --docker_store_dir="/tmp/Endpoint_SlaveEndpointTest_UnauthorizedRequest_1_Imnd3a/store/docker"
--docker_volume_checkpoint_dir="/var/run/mesos/isolators/docker/volume" --enforce_container_disk_quota="false"
--executor_registration_timeout="1mins" --executor_reregistration_timeout="2secs" --executor_shutdown_grace_period="5secs"
--fetcher_cache_dir="/tmp/Endpoint_SlaveEndpointTest_UnauthorizedRequest_1_Imnd3a/fetch" --fetcher_cache_size="2GB"
--frameworks_home="" --gc_delay="1weeks" --gc_disk_headroom="0.1" --hadoop_home="" --help="false"
--hostname_lookup="true" --http_command_executor="false" --http_credentials="/tmp/Endpoint_SlaveEndpointTest_UnauthorizedRequest_1_Imnd3a/http_credentials"
--http_heartbeat_interval="30secs" --initialize_driver_logging="true" --isolation="posix/cpu,posix/mem"
--launcher="posix" --launcher_dir="/mesos/mesos-1.4.0/_build/src" --logbufsecs="0" --logging_level="INFO"
--max_completed_executors_per_framework="150" --oversubscribed_resources_interval="15secs"
--perf_duration="10secs" --perf_interval="1mins" --port="5051" --qos_correction_interval_min="0ns"
--quiet="false" --recover="reconnect" --recovery_timeout="15mins" --registration_backoff_factor="10ms"
--resources="cpus:2;gpus:0;mem:1024;disk:1024;ports:[31000-32000]" --revocable_cpu_low_priority="true"
--runtime_dir="/tmp/Endpoint_SlaveEndpointTest_UnauthorizedRequest_1_Imnd3a" --sandbox_directory="/mnt/mesos/sandbox"
--strict="true" --switch_user="true" --systemd_enable_support="true" --systemd_runtime_directory="/run/systemd/system"
--version="false" --work_dir="/tmp/Endpoint_SlaveEndpointTest_UnauthorizedRequest_1_tMBzlz"
I0728 17:40:41.876407  5131 credentials.hpp:86] Loading credential for authentication from
'/tmp/Endpoint_SlaveEndpointTest_UnauthorizedRequest_1_Imnd3a/credential'
I0728 17:40:41.876776  5131 slave.cpp:283] Agent using credential for: test-principal
I0728 17:40:41.876807  5131 credentials.hpp:37] Loading credentials for authentication from
'/tmp/Endpoint_SlaveEndpointTest_UnauthorizedRequest_1_Imnd3a/http_credentials'
I0728 17:40:41.877231  5131 http.cpp:993] Creating default 'basic' HTTP authenticator for
realm 'mesos-agent-readonly'
I0728 17:40:41.877521  5131 http.cpp:993] Creating default 'basic' HTTP authenticator for
realm 'mesos-agent-readwrite'
I0728 17:40:41.879734  5131 slave.cpp:565] Agent resources: [{"name":"cpus","scalar":{"value":2.0},"type":"SCALAR"},{"name":"mem","scalar":{"value":1024.0},"type":"SCALAR"},{"name":"disk","scalar":{"value":1024.0},"type":"SCALAR"},{"name":"ports","ranges":{"range":[{"begin":31000,"end":32000}]},"type":"RANGES"}]
I0728 17:40:41.880235  5131 slave.cpp:573] Agent attributes: [  ]
I0728 17:40:41.880259  5131 slave.cpp:582] Agent hostname: c8cdc29ab7a1
I0728 17:40:41.880532  5133 status_update_manager.cpp:177] Pausing sending status updates
I0728 17:40:41.882417  5130 state.cpp:64] Recovering state from '/tmp/Endpoint_SlaveEndpointTest_UnauthorizedRequest_1_tMBzlz/meta'
I0728 17:40:41.883033  5128 status_update_manager.cpp:203] Recovering status update manager
I0728 17:40:41.883322  5132 containerizer.cpp:582] Recovering containerizer
I0728 17:40:41.885668  5130 provisioner.cpp:416] Provisioner recovery complete
I0728 17:40:41.886273  5126 slave.cpp:6207] Finished recovery
I0728 17:40:41.887015  5126 slave.cpp:6389] Querying resource estimator for oversubscribable
resources
I0728 17:40:41.887454  5133 slave.cpp:6403] Received oversubscribable resources {} from the
resource estimator
I0728 17:40:41.891659  5130 process.cpp:3836] Handling HTTP event for process 'slave(797)'
with path: '/slave(797)/monitor/statistics.json'
I0728 17:40:41.893831  5133 http.cpp:1133] HTTP GET for /slave(797)/monitor/statistics.json
from 172.17.0.3:41204
I0728 17:40:41.893980  5133 http.cpp:957] Authorizing principal 'test-principal' to GET the
'/monitor/statistics.json' endpoint
I0728 17:40:41.897683  5107 slave.cpp:843] Agent terminating
[       OK ] Endpoint/SlaveEndpointTest.UnauthorizedRequest/1 (50 ms)
[ RUN      ] Endpoint/SlaveEndpointTest.UnauthorizedRequest/2
I0728 17:40:41.920243  5107 containerizer.cpp:230] Using isolation: posix/cpu,posix/mem,filesystem/posix,network/cni,environment_secret
W0728 17:40:41.921005  5107 backend.cpp:76] Failed to create 'overlay' backend: OverlayBackend
requires root privileges
W0728 17:40:41.921162  5107 backend.cpp:76] Failed to create 'bind' backend: BindBackend requires
root privileges
I0728 17:40:41.921205  5107 provisioner.cpp:255] Using default backend 'copy'
I0728 17:40:41.926266  5127 slave.cpp:250] Mesos agent started on (798)@172.17.0.3:46155
I0728 17:40:41.926342  5127 slave.cpp:251] Flags at startup: --acls="" --appc_simple_discovery_uri_prefix="http://"
--appc_store_dir="/tmp/Endpoint_SlaveEndpointTest_UnauthorizedRequest_2_89iujC/store/appc"
--authenticate_http_readonly="true" --authenticate_http_readwrite="true" --authenticatee="crammd5"
--authentication_backoff_factor="1secs" --authorizer="local" --cgroups_cpu_enable_pids_and_tids_count="false"
--cgroups_enable_cfs="false" --cgroups_hierarchy="/sys/fs/cgroup" --cgroups_limit_swap="false"
--cgroups_root="mesos" --container_disk_watch_interval="15secs" --containerizers="mesos" --credential="/tmp/Endpoint_SlaveEndpointTest_UnauthorizedRequest_2_89iujC/credential"
--default_role="*" --disk_watch_interval="1mins" --docker="docker" --docker_kill_orphans="true"
--docker_registry="https://registry-1.docker.io" --docker_remove_delay="6hrs" --docker_socket="/var/run/docker.sock"
--docker_stop_timeout="0ns" --docker_store_dir="/tmp/Endpoint_SlaveEndpointTest_UnauthorizedRequest_2_89iujC/store/docker"
--docker_volume_checkpoint_dir="/var/run/mesos/isolators/docker/volume" --enforce_container_disk_quota="false"
--executor_registration_timeout="1mins" --executor_reregistration_timeout="2secs" --executor_shutdown_grace_period="5secs"
--fetcher_cache_dir="/tmp/Endpoint_SlaveEndpointTest_UnauthorizedRequest_2_89iujC/fetch" --fetcher_cache_size="2GB"
--frameworks_home="" --gc_delay="1weeks" --gc_disk_headroom="0.1" --hadoop_home="" --help="false"
--hostname_lookup="true" --http_command_executor="false" --http_credentials="/tmp/Endpoint_SlaveEndpointTest_UnauthorizedRequest_2_89iujC/http_credentials"
--http_heartbeat_interval="30secs" --initialize_driver_logging="true" --isolation="posix/cpu,posix/mem"
--launcher="posix" --launcher_dir="/mesos/mesos-1.4.0/_build/src" --logbufsecs="0" --logging_level="INFO"
--max_completed_executors_per_framework="150" --oversubscribed_resources_interval="15secs"
--perf_duration="10secs" --perf_interval="1mins" --port="5051" --qos_correction_interval_min="0ns"
--quiet="false" --recover="reconnect" --recovery_timeout="15mins" --registration_backoff_factor="10ms"
--resources="cpus:2;gpus:0;mem:1024;disk:1024;ports:[31000-32000]" --revocable_cpu_low_priority="true"
--runtime_dir="/tmp/Endpoint_SlaveEndpointTest_UnauthorizedRequest_2_89iujC" --sandbox_directory="/mnt/mesos/sandbox"
--strict="true" --switch_user="true" --systemd_enable_support="true" --systemd_runtime_directory="/run/systemd/system"
--version="false" --work_dir="/tmp/Endpoint_SlaveEndpointTest_UnauthorizedRequest_2_BSfCt0"
I0728 17:40:41.927278  5127 credentials.hpp:86] Loading credential for authentication from
'/tmp/Endpoint_SlaveEndpointTest_UnauthorizedRequest_2_89iujC/credential'
I0728 17:40:41.927865  5127 slave.cpp:283] Agent using credential for: test-principal
I0728 17:40:41.927989  5127 credentials.hpp:37] Loading credentials for authentication from
'/tmp/Endpoint_SlaveEndpointTest_UnauthorizedRequest_2_89iujC/http_credentials'
I0728 17:40:41.928618  5127 http.cpp:993] Creating default 'basic' HTTP authenticator for
realm 'mesos-agent-readonly'
I0728 17:40:41.929080  5127 http.cpp:993] Creating default 'basic' HTTP authenticator for
realm 'mesos-agent-readwrite'
I0728 17:40:41.931438  5127 slave.cpp:565] Agent resources: [{"name":"cpus","scalar":{"value":2.0},"type":"SCALAR"},{"name":"mem","scalar":{"value":1024.0},"type":"SCALAR"},{"name":"disk","scalar":{"value":1024.0},"type":"SCALAR"},{"name":"ports","ranges":{"range":[{"begin":31000,"end":32000}]},"type":"RANGES"}]
I0728 17:40:41.931990  5127 slave.cpp:573] Agent attributes: [  ]
I0728 17:40:41.932302  5127 slave.cpp:582] Agent hostname: c8cdc29ab7a1
I0728 17:40:41.932641  5130 status_update_manager.cpp:177] Pausing sending status updates
I0728 17:40:41.935138  5126 state.cpp:64] Recovering state from '/tmp/Endpoint_SlaveEndpointTest_UnauthorizedRequest_2_BSfCt0/meta'
I0728 17:40:41.935679  5132 status_update_manager.cpp:203] Recovering status update manager
I0728 17:40:41.935953  5132 containerizer.cpp:582] Recovering containerizer
I0728 17:40:41.938076  5128 provisioner.cpp:416] Provisioner recovery complete
I0728 17:40:41.938732  5129 slave.cpp:6207] Finished recovery
I0728 17:40:41.939380  5129 slave.cpp:6389] Querying resource estimator for oversubscribable
resources
I0728 17:40:41.939898  5130 slave.cpp:6403] Received oversubscribable resources {} from the
resource estimator
I0728 17:40:41.943955  5129 process.cpp:3836] Handling HTTP event for process 'slave(798)'
with path: '/slave(798)/containers'
I0728 17:40:41.946112  5131 http.cpp:1133] HTTP GET for /slave(798)/containers from 172.17.0.3:41208
I0728 17:40:41.946306  5131 http.cpp:957] Authorizing principal 'test-principal' to GET the
'/containers' endpoint
I0728 17:40:41.950126  5133 slave.cpp:843] Agent terminating
[       OK ] Endpoint/SlaveEndpointTest.UnauthorizedRequest/2 (46 ms)
[ RUN      ] Endpoint/SlaveEndpointTest.NoAuthorizer/0
I0728 17:40:41.967515  5107 containerizer.cpp:230] Using isolation: posix/cpu,posix/mem,filesystem/posix,network/cni,environment_secret
W0728 17:40:41.968273  5107 backend.cpp:76] Failed to create 'overlay' backend: OverlayBackend
requires root privileges
W0728 17:40:41.968436  5107 backend.cpp:76] Failed to create 'bind' backend: BindBackend requires
root privileges
I0728 17:40:41.968477  5107 provisioner.cpp:255] Using default backend 'copy'
I0728 17:40:41.970899  5107 cluster.cpp:448] Creating default 'local' authorizer
I0728 17:40:41.973557  5128 slave.cpp:250] Mesos agent started on (799)@172.17.0.3:46155
I0728 17:40:41.973598  5128 slave.cpp:251] Flags at startup: --acls="" --appc_simple_discovery_uri_prefix="http://"
--appc_store_dir="/tmp/Endpoint_SlaveEndpointTest_NoAuthorizer_0_AGhX43/store/appc" --authenticate_http_readonly="true"
--authenticate_http_readwrite="true" --authenticatee="crammd5" --authentication_backoff_factor="1secs"
--authorizer="local" --cgroups_cpu_enable_pids_and_tids_count="false" --cgroups_enable_cfs="false"
--cgroups_hierarchy="/sys/fs/cgroup" --cgroups_limit_swap="false" --cgroups_root="mesos" --container_disk_watch_interval="15secs"
--containerizers="mesos" --credential="/tmp/Endpoint_SlaveEndpointTest_NoAuthorizer_0_AGhX43/credential"
--default_role="*" --disk_watch_interval="1mins" --docker="docker" --docker_kill_orphans="true"
--docker_registry="https://registry-1.docker.io" --docker_remove_delay="6hrs" --docker_socket="/var/run/docker.sock"
--docker_stop_timeout="0ns" --docker_store_dir="/tmp/Endpoint_SlaveEndpointTest_NoAuthorizer_0_AGhX43/store/docker"
--docker_volume_checkpoint_dir="/var/run/mesos/isolators/docker/volume" --enforce_container_disk_quota="false"
--executor_registration_timeout="1mins" --executor_reregistration_timeout="2secs" --executor_shutdown_grace_period="5secs"
--fetcher_cache_dir="/tmp/Endpoint_SlaveEndpointTest_NoAuthorizer_0_AGhX43/fetch" --fetcher_cache_size="2GB"
--frameworks_home="" --gc_delay="1weeks" --gc_disk_headroom="0.1" --hadoop_home="" --help="false"
--hostname_lookup="true" --http_command_executor="false" --http_credentials="/tmp/Endpoint_SlaveEndpointTest_NoAuthorizer_0_AGhX43/http_credentials"
--http_heartbeat_interval="30secs" --initialize_driver_logging="true" --isolation="posix/cpu,posix/mem"
--launcher="posix" --launcher_dir="/mesos/mesos-1.4.0/_build/src" --logbufsecs="0" --logging_level="INFO"
--max_completed_executors_per_framework="150" --oversubscribed_resources_interval="15secs"
--perf_duration="10secs" --perf_interval="1mins" --port="5051" --qos_correction_interval_min="0ns"
--quiet="false" --recover="reconnect" --recovery_timeout="15mins" --registration_backoff_factor="10ms"
--resources="cpus:2;gpus:0;mem:1024;disk:1024;ports:[31000-32000]" --revocable_cpu_low_priority="true"
--runtime_dir="/tmp/Endpoint_SlaveEndpointTest_NoAuthorizer_0_AGhX43" --sandbox_directory="/mnt/mesos/sandbox"
--strict="true" --switch_user="true" --systemd_enable_support="true" --systemd_runtime_directory="/run/systemd/system"
--version="false" --work_dir="/tmp/Endpoint_SlaveEndpointTest_NoAuthorizer_0_b59v7r"
I0728 17:40:41.974334  5128 credentials.hpp:86] Loading credential for authentication from
'/tmp/Endpoint_SlaveEndpointTest_NoAuthorizer_0_AGhX43/credential'
I0728 17:40:41.974601  5128 slave.cpp:283] Agent using credential for: test-principal
I0728 17:40:41.974630  5128 credentials.hpp:37] Loading credentials for authentication from
'/tmp/Endpoint_SlaveEndpointTest_NoAuthorizer_0_AGhX43/http_credentials'
I0728 17:40:41.974984  5128 http.cpp:993] Creating default 'basic' HTTP authenticator for
realm 'mesos-agent-readonly'
I0728 17:40:41.975186  5128 http.cpp:993] Creating default 'basic' HTTP authenticator for
realm 'mesos-agent-readwrite'
I0728 17:40:41.977306  5128 slave.cpp:565] Agent resources: [{"name":"cpus","scalar":{"value":2.0},"type":"SCALAR"},{"name":"mem","scalar":{"value":1024.0},"type":"SCALAR"},{"name":"disk","scalar":{"value":1024.0},"type":"SCALAR"},{"name":"ports","ranges":{"range":[{"begin":31000,"end":32000}]},"type":"RANGES"}]
I0728 17:40:41.977732  5128 slave.cpp:573] Agent attributes: [  ]
I0728 17:40:41.977754  5128 slave.cpp:582] Agent hostname: c8cdc29ab7a1
I0728 17:40:41.977970  5129 status_update_manager.cpp:177] Pausing sending status updates
I0728 17:40:41.979864  5131 state.cpp:64] Recovering state from '/tmp/Endpoint_SlaveEndpointTest_NoAuthorizer_0_b59v7r/meta'
I0728 17:40:41.980353  5130 status_update_manager.cpp:203] Recovering status update manager
I0728 17:40:41.980685  5127 containerizer.cpp:582] Recovering containerizer
I0728 17:40:41.983037  5131 provisioner.cpp:416] Provisioner recovery complete
I0728 17:40:41.983572  5129 slave.cpp:6207] Finished recovery
I0728 17:40:41.984385  5129 slave.cpp:6389] Querying resource estimator for oversubscribable
resources
I0728 17:40:41.984773  5129 slave.cpp:6403] Received oversubscribable resources {} from the
resource estimator
I0728 17:40:41.988879  5129 process.cpp:3836] Handling HTTP event for process 'slave(799)'
with path: '/slave(799)/monitor/statistics'
I0728 17:40:41.991152  5128 http.cpp:1133] HTTP GET for /slave(799)/monitor/statistics from
172.17.0.3:41210
I0728 17:40:41.991279  5128 http.cpp:957] Authorizing principal 'test-principal' to GET the
'/monitor/statistics' endpoint
I0728 17:40:41.996742  5132 slave.cpp:843] Agent terminating
[       OK ] Endpoint/SlaveEndpointTest.NoAuthorizer/0 (47 ms)
[ RUN      ] Endpoint/SlaveEndpointTest.NoAuthorizer/1
I0728 17:40:42.014874  5107 containerizer.cpp:230] Using isolation: posix/cpu,posix/mem,filesystem/posix,network/cni,environment_secret
W0728 17:40:42.015625  5107 backend.cpp:76] Failed to create 'overlay' backend: OverlayBackend
requires root privileges
W0728 17:40:42.015785  5107 backend.cpp:76] Failed to create 'bind' backend: BindBackend requires
root privileges
I0728 17:40:42.015827  5107 provisioner.cpp:255] Using default backend 'copy'
I0728 17:40:42.018246  5107 cluster.cpp:448] Creating default 'local' authorizer
I0728 17:40:42.020882  5129 slave.cpp:250] Mesos agent started on (800)@172.17.0.3:46155
I0728 17:40:42.020922  5129 slave.cpp:251] Flags at startup: --acls="" --appc_simple_discovery_uri_prefix="http://"
--appc_store_dir="/tmp/Endpoint_SlaveEndpointTest_NoAuthorizer_1_SNFIkw/store/appc" --authenticate_http_readonly="true"
--authenticate_http_readwrite="true" --authenticatee="crammd5" --authentication_backoff_factor="1secs"
--authorizer="local" --cgroups_cpu_enable_pids_and_tids_count="false" --cgroups_enable_cfs="false"
--cgroups_hierarchy="/sys/fs/cgroup" --cgroups_limit_swap="false" --cgroups_root="mesos" --container_disk_watch_interval="15secs"
--containerizers="mesos" --credential="/tmp/Endpoint_SlaveEndpointTest_NoAuthorizer_1_SNFIkw/credential"
--default_role="*" --disk_watch_interval="1mins" --docker="docker" --docker_kill_orphans="true"
--docker_registry="https://registry-1.docker.io" --docker_remove_delay="6hrs" --docker_socket="/var/run/docker.sock"
--docker_stop_timeout="0ns" --docker_store_dir="/tmp/Endpoint_SlaveEndpointTest_NoAuthorizer_1_SNFIkw/store/docker"
--docker_volume_checkpoint_dir="/var/run/mesos/isolators/docker/volume" --enforce_container_disk_quota="false"
--executor_registration_timeout="1mins" --executor_reregistration_timeout="2secs" --executor_shutdown_grace_period="5secs"
--fetcher_cache_dir="/tmp/Endpoint_SlaveEndpointTest_NoAuthorizer_1_SNFIkw/fetch" --fetcher_cache_size="2GB"
--frameworks_home="" --gc_delay="1weeks" --gc_disk_headroom="0.1" --hadoop_home="" --help="false"
--hostname_lookup="true" --http_command_executor="false" --http_credentials="/tmp/Endpoint_SlaveEndpointTest_NoAuthorizer_1_SNFIkw/http_credentials"
--http_heartbeat_interval="30secs" --initialize_driver_logging="true" --isolation="posix/cpu,posix/mem"
--launcher="posix" --launcher_dir="/mesos/mesos-1.4.0/_build/src" --logbufsecs="0" --logging_level="INFO"
--max_completed_executors_per_framework="150" --oversubscribed_resources_interval="15secs"
--perf_duration="10secs" --perf_interval="1mins" --port="5051" --qos_correction_interval_min="0ns"
--quiet="false" --recover="reconnect" --recovery_timeout="15mins" --registration_backoff_factor="10ms"
--resources="cpus:2;gpus:0;mem:1024;disk:1024;ports:[31000-32000]" --revocable_cpu_low_priority="true"
--runtime_dir="/tmp/Endpoint_SlaveEndpointTest_NoAuthorizer_1_SNFIkw" --sandbox_directory="/mnt/mesos/sandbox"
--strict="true" --switch_user="true" --systemd_enable_support="true" --systemd_runtime_directory="/run/systemd/system"
--version="false" --work_dir="/tmp/Endpoint_SlaveEndpointTest_NoAuthorizer_1_dAcCfU"
I0728 17:40:42.021761  5129 credentials.hpp:86] Loading credential for authentication from
'/tmp/Endpoint_SlaveEndpointTest_NoAuthorizer_1_SNFIkw/credential'
I0728 17:40:42.022228  5129 slave.cpp:283] Agent using credential for: test-principal
I0728 17:40:42.022263  5129 credentials.hpp:37] Loading credentials for authentication from
'/tmp/Endpoint_SlaveEndpointTest_NoAuthorizer_1_SNFIkw/http_credentials'
I0728 17:40:42.022816  5129 http.cpp:993] Creating default 'basic' HTTP authenticator for
realm 'mesos-agent-readonly'
I0728 17:40:42.023200  5129 http.cpp:993] Creating default 'basic' HTTP authenticator for
realm 'mesos-agent-readwrite'
I0728 17:40:42.025553  5129 slave.cpp:565] Agent resources: [{"name":"cpus","scalar":{"value":2.0},"type":"SCALAR"},{"name":"mem","scalar":{"value":1024.0},"type":"SCALAR"},{"name":"disk","scalar":{"value":1024.0},"type":"SCALAR"},{"name":"ports","ranges":{"range":[{"begin":31000,"end":32000}]},"type":"RANGES"}]
I0728 17:40:42.025986  5129 slave.cpp:573] Agent attributes: [  ]
I0728 17:40:42.026012  5129 slave.cpp:582] Agent hostname: c8cdc29ab7a1
I0728 17:40:42.026412  5132 status_update_manager.cpp:177] Pausing sending status updates
I0728 17:40:42.028503  5126 state.cpp:64] Recovering state from '/tmp/Endpoint_SlaveEndpointTest_NoAuthorizer_1_dAcCfU/meta'
I0728 17:40:42.029150  5130 status_update_manager.cpp:203] Recovering status update manager
I0728 17:40:42.029476  5129 containerizer.cpp:582] Recovering containerizer
I0728 17:40:42.031615  5128 provisioner.cpp:416] Provisioner recovery complete
I0728 17:40:42.032390  5131 slave.cpp:6207] Finished recovery
I0728 17:40:42.033038  5131 slave.cpp:6389] Querying resource estimator for oversubscribable
resources
I0728 17:40:42.033422  5133 slave.cpp:6403] Received oversubscribable resources {} from the
resource estimator
I0728 17:40:42.037482  5133 process.cpp:3836] Handling HTTP event for process 'slave(800)'
with path: '/slave(800)/monitor/statistics.json'
I0728 17:40:42.039484  5133 http.cpp:1133] HTTP GET for /slave(800)/monitor/statistics.json
from 172.17.0.3:41212
I0728 17:40:42.039685  5133 http.cpp:957] Authorizing principal 'test-principal' to GET the
'/monitor/statistics.json' endpoint
I0728 17:40:42.044662  5132 slave.cpp:843] Agent terminating
[       OK ] Endpoint/SlaveEndpointTest.NoAuthorizer/1 (52 ms)
[ RUN      ] Endpoint/SlaveEndpointTest.NoAuthorizer/2
I0728 17:40:42.069607  5107 containerizer.cpp:230] Using isolation: posix/cpu,posix/mem,filesystem/posix,network/cni,environment_secret
W0728 17:40:42.070679  5107 backend.cpp:76] Failed to create 'overlay' backend: OverlayBackend
requires root privileges
W0728 17:40:42.070901  5107 backend.cpp:76] Failed to create 'bind' backend: BindBackend requires
root privileges
I0728 17:40:42.070982  5107 provisioner.cpp:255] Using default backend 'copy'
I0728 17:40:42.073632  5107 cluster.cpp:448] Creating default 'local' authorizer
I0728 17:40:42.076442  5126 slave.cpp:250] Mesos agent started on (801)@172.17.0.3:46155
I0728 17:40:42.076485  5126 slave.cpp:251] Flags at startup: --acls="" --appc_simple_discovery_uri_prefix="http://"
--appc_store_dir="/tmp/Endpoint_SlaveEndpointTest_NoAuthorizer_2_Qc4t8Y/store/appc" --authenticate_http_readonly="true"
--authenticate_http_readwrite="true" --authenticatee="crammd5" --authentication_backoff_factor="1secs"
--authorizer="local" --cgroups_cpu_enable_pids_and_tids_count="false" --cgroups_enable_cfs="false"
--cgroups_hierarchy="/sys/fs/cgroup" --cgroups_limit_swap="false" --cgroups_root="mesos" --container_disk_watch_interval="15secs"
--containerizers="mesos" --credential="/tmp/Endpoint_SlaveEndpointTest_NoAuthorizer_2_Qc4t8Y/credential"
--default_role="*" --disk_watch_interval="1mins" --docker="docker" --docker_kill_orphans="true"
--docker_registry="https://registry-1.docker.io" --docker_remove_delay="6hrs" --docker_socket="/var/run/docker.sock"
--docker_stop_timeout="0ns" --docker_store_dir="/tmp/Endpoint_SlaveEndpointTest_NoAuthorizer_2_Qc4t8Y/store/docker"
--docker_volume_checkpoint_dir="/var/run/mesos/isolators/docker/volume" --enforce_container_disk_quota="false"
--executor_registration_timeout="1mins" --executor_reregistration_timeout="2secs" --executor_shutdown_grace_period="5secs"
--fetcher_cache_dir="/tmp/Endpoint_SlaveEndpointTest_NoAuthorizer_2_Qc4t8Y/fetch" --fetcher_cache_size="2GB"
--frameworks_home="" --gc_delay="1weeks" --gc_disk_headroom="0.1" --hadoop_home="" --help="false"
--hostname_lookup="true" --http_command_executor="false" --http_credentials="/tmp/Endpoint_SlaveEndpointTest_NoAuthorizer_2_Qc4t8Y/http_credentials"
--http_heartbeat_interval="30secs" --initialize_driver_logging="true" --isolation="posix/cpu,posix/mem"
--launcher="posix" --launcher_dir="/mesos/mesos-1.4.0/_build/src" --logbufsecs="0" --logging_level="INFO"
--max_completed_executors_per_framework="150" --oversubscribed_resources_interval="15secs"
--perf_duration="10secs" --perf_interval="1mins" --port="5051" --qos_correction_interval_min="0ns"
--quiet="false" --recover="reconnect" --recovery_timeout="15mins" --registration_backoff_factor="10ms"
--resources="cpus:2;gpus:0;mem:1024;disk:1024;ports:[31000-32000]" --revocable_cpu_low_priority="true"
--runtime_dir="/tmp/Endpoint_SlaveEndpointTest_NoAuthorizer_2_Qc4t8Y" --sandbox_directory="/mnt/mesos/sandbox"
--strict="true" --switch_user="true" --systemd_enable_support="true" --systemd_runtime_directory="/run/systemd/system"
--version="false" --work_dir="/tmp/Endpoint_SlaveEndpointTest_NoAuthorizer_2_BuaCUm"
I0728 17:40:42.077563  5126 credentials.hpp:86] Loading credential for authentication from
'/tmp/Endpoint_SlaveEndpointTest_NoAuthorizer_2_Qc4t8Y/credential'
I0728 17:40:42.077904  5126 slave.cpp:283] Agent using credential for: test-principal
I0728 17:40:42.077930  5126 credentials.hpp:37] Loading credentials for authentication from
'/tmp/Endpoint_SlaveEndpointTest_NoAuthorizer_2_Qc4t8Y/http_credentials'
I0728 17:40:42.078387  5126 http.cpp:993] Creating default 'basic' HTTP authenticator for
realm 'mesos-agent-readonly'
I0728 17:40:42.078719  5126 http.cpp:993] Creating default 'basic' HTTP authenticator for
realm 'mesos-agent-readwrite'
I0728 17:40:42.081001  5126 slave.cpp:565] Agent resources: [{"name":"cpus","scalar":{"value":2.0},"type":"SCALAR"},{"name":"mem","scalar":{"value":1024.0},"type":"SCALAR"},{"name":"disk","scalar":{"value":1024.0},"type":"SCALAR"},{"name":"ports","ranges":{"range":[{"begin":31000,"end":32000}]},"type":"RANGES"}]
I0728 17:40:42.081465  5126 slave.cpp:573] Agent attributes: [  ]
I0728 17:40:42.081509  5126 slave.cpp:582] Agent hostname: c8cdc29ab7a1
I0728 17:40:42.081851  5131 status_update_manager.cpp:177] Pausing sending status updates
I0728 17:40:42.083947  5132 state.cpp:64] Recovering state from '/tmp/Endpoint_SlaveEndpointTest_NoAuthorizer_2_BuaCUm/meta'
I0728 17:40:42.084574  5133 status_update_manager.cpp:203] Recovering status update manager
I0728 17:40:42.084954  5130 containerizer.cpp:582] Recovering containerizer
I0728 17:40:42.087306  5129 provisioner.cpp:416] Provisioner recovery complete
I0728 17:40:42.087786  5126 slave.cpp:6207] Finished recovery
I0728 17:40:42.088671  5126 slave.cpp:6389] Querying resource estimator for oversubscribable
resources
I0728 17:40:42.089340  5128 slave.cpp:6403] Received oversubscribable resources {} from the
resource estimator
I0728 17:40:42.093793  5126 process.cpp:3836] Handling HTTP event for process 'slave(801)'
with path: '/slave(801)/containers'
I0728 17:40:42.095964  5129 http.cpp:1133] HTTP GET for /slave(801)/containers from 172.17.0.3:41214
I0728 17:40:42.096140  5129 http.cpp:957] Authorizing principal 'test-principal' to GET the
'/containers' endpoint
I0728 17:40:42.102865  5107 slave.cpp:843] Agent terminating
[       OK ] Endpoint/SlaveEndpointTest.NoAuthorizer/2 (52 ms)
[----------] 9 tests from Endpoint/SlaveEndpointTest (458 ms total)

[----------] Global test environment tear-down
[==========] 1649 tests from 181 test cases ran. (730443 ms total)
[  PASSED  ] 1644 tests.
[  FAILED  ] 5 tests, listed below:
[  FAILED  ] DefaultExecutorCheckTest.CommandCheckDeliveredAndReconciled
[  FAILED  ] DefaultExecutorCheckTest.CommandCheckStatusChange
[  FAILED  ] DefaultExecutorCheckTest.CommandCheckSeesParentsEnv
[  FAILED  ] DefaultExecutorCheckTest.CommandCheckSharesWorkDirWithTask
[  FAILED  ] ReconciliationTest.RemovalInProgress

 5 FAILED TESTS
  YOU HAVE 20 DISABLED TESTS

I0728 17:40:42.267797  5134 process.cpp:1006] Failed to accept socket: future discarded
make[4]: *** [check-local] Error 1
make[4]: Leaving directory `/mesos/mesos-1.4.0/_build/src'
make[3]: *** [check-am] Error 2
make[3]: Leaving directory `/mesos/mesos-1.4.0/_build/src'
make[2]: *** [check] Error 2
make[2]: Leaving directory `/mesos/mesos-1.4.0/_build/src'
make[1]: *** [check-recursive] Error 1
make[1]: Leaving directory `/mesos/mesos-1.4.0/_build'
make: *** [distcheck] Error 1
+ docker rmi mesos-1501257770-8455
Untagged: mesos-1501257770-8455:latest
Deleted: sha256:fd68c1eb21f97622e667b8e9566e230491f1e3638fed45e104f726a2c590c630
Deleted: sha256:9e138d81fd55844f7a3d6bd7f345c93a04f16899a4c02779a91d5bec3d724bc1
Deleted: sha256:4507fda35a9c81b287d192c20bcc83de4e69ae39967516281d53aae0d66e24e1
Deleted: sha256:1ad389b2de7f2385e621acc4efce51cb9ab59697a1ad027014357d5c84f27d64
Deleted: sha256:f7f259a54f3c9b8625a11dc9568b80d9f29de60d4c1f8cb036b3c091601a4424
Deleted: sha256:795ddeda174e9c508d8286ed21d4eafa1c1388a26f8ae5fdbd82dcc6ed6e00d4
Deleted: sha256:17158d10b041e45a7d5777f7b1d3af1a12f2c0046e9430969fb1b95c51aba15c
Deleted: sha256:787a91249e62c4732a2ca23f7088c30caf80aea83e9a18ae376c899be242db54
Deleted: sha256:78b61eb7513cb183e603d47b8d9352d8c7c7efe9f307c3dba06b48d97eb55bea
Deleted: sha256:b935d24b5617cd273ab75312dd28625b898842e6130882427863dd12cd1a7066
Deleted: sha256:1189da014ac9679934b72891385a4daa19f271ceed5ca32d39c4002bd66a2bac
Deleted: sha256:ef1de5fb38645fc0bf839d779664f74609cb56aedb7db1e0f3da526f894bc086
Deleted: sha256:912c5d91bbdaca74c17f11475897097e3c8f8d47f88b86fb64856eee3d66985f
Deleted: sha256:7d2236e2e4328fa4ce65a1d00d673061a8266a7ef4757d67976c82ada1591112
Deleted: sha256:a93bd3066e3e3712558e84525c202604deff6e025cb952d92ac6dc162db4b4a5
Deleted: sha256:017db12fe79dc9becf628410b4f499e02e6d83f0d93f5db7301ad99708ced919
Deleted: sha256:724caf6bad188092bc27b0190a15a0e2b198a8d730434a1d57f25f29f44465e2
Deleted: sha256:00ee784bc0915c2433f9ce6a32fe82e917d1b99adcf0a54a40bcbadcf3f4f904
Deleted: sha256:108cb195334b4771644bff670595c18c73e55b5f0e85097efa95709b9feefdab
Deleted: sha256:f4ee9cda9902274b6fd927def74fdab0fa48d2a6a3c4960ea1a4e6fda438cb03
Deleted: sha256:8ed8083dc04a8bfd5ec2840d4bc06370a6ae7e43c4bbf34f8f96b2d4047a9182
Deleted: sha256:8053516235f656ced1248d00ca962fe10b1e039101431555fbd2d189c4720b94
Deleted: sha256:a4f7174f14462c32a1f55f58212d95a7ecefbbc7eb5354463d4637598ecad52b
Deleted: sha256:6dd72be69e1528b4aeb83caa6374d4aaaa886af7882fa80877defb779add4de6
Build step 'Execute shell' marked build as failure

Mime
View raw message