mesos-builds mailing list archives

Site index · List index
Message view « Date » · « Thread »
Top « Date » · « Thread »
From Apache Jenkins Server <jenk...@builds.apache.org>
Subject Build failed in Jenkins: Mesos-Reviewbot #18563
Date Fri, 21 Jul 2017 11:08:49 GMT
See <https://builds.apache.org/job/Mesos-Reviewbot/18563/display/redirect>

------------------------------------------
[...truncated 30.16 MB...]
I0721 11:08:42.606397  5031 containerizer.cpp:230] Using isolation: posix/cpu,posix/mem,filesystem/posix,network/cni,environment_secret
W0721 11:08:42.607421  5031 backend.cpp:76] Failed to create 'overlay' backend: OverlayBackend
requires root privileges
W0721 11:08:42.607687  5031 backend.cpp:76] Failed to create 'bind' backend: BindBackend requires
root privileges
I0721 11:08:42.607800  5031 provisioner.cpp:255] Using default backend 'copy'
I0721 11:08:42.614186  5052 slave.cpp:250] Mesos agent started on (792)@172.17.0.2:34287
I0721 11:08:42.614228  5052 slave.cpp:251] Flags at startup: --acls="" --appc_simple_discovery_uri_prefix="http://"
--appc_store_dir="/tmp/Endpoint_SlaveEndpointTest_AuthorizedRequest_2_gATFet/store/appc" --authenticate_http_readonly="true"
--authenticate_http_readwrite="true" --authenticatee="crammd5" --authentication_backoff_factor="1secs"
--authorizer="local" --cgroups_cpu_enable_pids_and_tids_count="false" --cgroups_enable_cfs="false"
--cgroups_hierarchy="/sys/fs/cgroup" --cgroups_limit_swap="false" --cgroups_root="mesos" --container_disk_watch_interval="15secs"
--containerizers="mesos" --credential="/tmp/Endpoint_SlaveEndpointTest_AuthorizedRequest_2_gATFet/credential"
--default_role="*" --disk_watch_interval="1mins" --docker="docker" --docker_kill_orphans="true"
--docker_registry="https://registry-1.docker.io" --docker_remove_delay="6hrs" --docker_socket="/var/run/docker.sock"
--docker_stop_timeout="0ns" --docker_store_dir="/tmp/Endpoint_SlaveEndpointTest_AuthorizedRequest_2_gATFet/store/docker"
--docker_volume_checkpoint_dir="/var/run/mesos/isolators/docker/volume" --enforce_container_disk_quota="false"
--executor_registration_timeout="1mins" --executor_reregistration_timeout="2secs" --executor_shutdown_grace_period="5secs"
--fetcher_cache_dir="/tmp/Endpoint_SlaveEndpointTest_AuthorizedRequest_2_gATFet/fetch" --fetcher_cache_size="2GB"
--frameworks_home="" --gc_delay="1weeks" --gc_disk_headroom="0.1" --hadoop_home="" --help="false"
--hostname_lookup="true" --http_command_executor="false" --http_credentials="/tmp/Endpoint_SlaveEndpointTest_AuthorizedRequest_2_gATFet/http_credentials"
--http_heartbeat_interval="30secs" --initialize_driver_logging="true" --isolation="posix/cpu,posix/mem"
--launcher="posix" --launcher_dir="/mesos/mesos-1.4.0/_build/src" --logbufsecs="0" --logging_level="INFO"
--max_completed_executors_per_framework="150" --oversubscribed_resources_interval="15secs"
--perf_duration="10secs" --perf_interval="1mins" --port="5051" --qos_correction_interval_min="0ns"
--quiet="false" --recover="reconnect" --recovery_timeout="15mins" --registration_backoff_factor="10ms"
--resources="cpus:2;gpus:0;mem:1024;disk:1024;ports:[31000-32000]" --revocable_cpu_low_priority="true"
--runtime_dir="/tmp/Endpoint_SlaveEndpointTest_AuthorizedRequest_2_gATFet" --sandbox_directory="/mnt/mesos/sandbox"
--strict="true" --switch_user="true" --systemd_enable_support="true" --systemd_runtime_directory="/run/systemd/system"
--version="false" --work_dir="/tmp/Endpoint_SlaveEndpointTest_AuthorizedRequest_2_RwaRLx"
I0721 11:08:42.615082  5052 credentials.hpp:86] Loading credential for authentication from
'/tmp/Endpoint_SlaveEndpointTest_AuthorizedRequest_2_gATFet/credential'
I0721 11:08:42.615358  5052 slave.cpp:283] Agent using credential for: test-principal
I0721 11:08:42.615386  5052 credentials.hpp:37] Loading credentials for authentication from
'/tmp/Endpoint_SlaveEndpointTest_AuthorizedRequest_2_gATFet/http_credentials'
I0721 11:08:42.615758  5052 http.cpp:993] Creating default 'basic' HTTP authenticator for
realm 'mesos-agent-readonly'
I0721 11:08:42.616168  5052 http.cpp:993] Creating default 'basic' HTTP authenticator for
realm 'mesos-agent-readwrite'
I0721 11:08:42.618552  5052 slave.cpp:565] Agent resources: [{"name":"cpus","scalar":{"value":2.0},"type":"SCALAR"},{"name":"mem","scalar":{"value":1024.0},"type":"SCALAR"},{"name":"disk","scalar":{"value":1024.0},"type":"SCALAR"},{"name":"ports","ranges":{"range":[{"begin":31000,"end":32000}]},"type":"RANGES"}]
I0721 11:08:42.619037  5052 slave.cpp:573] Agent attributes: [  ]
I0721 11:08:42.619086  5052 slave.cpp:582] Agent hostname: 92b103b13a0d
I0721 11:08:42.619343  5056 status_update_manager.cpp:177] Pausing sending status updates
I0721 11:08:42.621495  5051 state.cpp:64] Recovering state from '/tmp/Endpoint_SlaveEndpointTest_AuthorizedRequest_2_RwaRLx/meta'
I0721 11:08:42.622160  5054 status_update_manager.cpp:203] Recovering status update manager
I0721 11:08:42.622403  5054 containerizer.cpp:582] Recovering containerizer
I0721 11:08:42.624827  5050 provisioner.cpp:416] Provisioner recovery complete
I0721 11:08:42.625444  5054 slave.cpp:6207] Finished recovery
I0721 11:08:42.626101  5054 slave.cpp:6389] Querying resource estimator for oversubscribable
resources
I0721 11:08:42.626410  5057 slave.cpp:6403] Received oversubscribable resources {} from the
resource estimator
I0721 11:08:42.630664  5057 process.cpp:3837] Handling HTTP event for process 'slave(792)'
with path: '/slave(792)/containers'
I0721 11:08:42.632951  5050 http.cpp:1133] HTTP GET for /slave(792)/containers from 172.17.0.2:54040
I0721 11:08:42.633102  5050 http.cpp:957] Authorizing principal 'test-principal' to GET the
'/containers' endpoint
I0721 11:08:42.639528  5052 slave.cpp:843] Agent terminating
[       OK ] Endpoint/SlaveEndpointTest.AuthorizedRequest/2 (53 ms)
[ RUN      ] Endpoint/SlaveEndpointTest.UnauthorizedRequest/0
I0721 11:08:42.661010  5031 containerizer.cpp:230] Using isolation: posix/cpu,posix/mem,filesystem/posix,network/cni,environment_secret
W0721 11:08:42.661945  5031 backend.cpp:76] Failed to create 'overlay' backend: OverlayBackend
requires root privileges
W0721 11:08:42.662135  5031 backend.cpp:76] Failed to create 'bind' backend: BindBackend requires
root privileges
I0721 11:08:42.662184  5031 provisioner.cpp:255] Using default backend 'copy'
I0721 11:08:42.668568  5053 slave.cpp:250] Mesos agent started on (793)@172.17.0.2:34287
I0721 11:08:42.668615  5053 slave.cpp:251] Flags at startup: --acls="" --appc_simple_discovery_uri_prefix="http://"
--appc_store_dir="/tmp/Endpoint_SlaveEndpointTest_UnauthorizedRequest_0_mDoUzb/store/appc"
--authenticate_http_readonly="true" --authenticate_http_readwrite="true" --authenticatee="crammd5"
--authentication_backoff_factor="1secs" --authorizer="local" --cgroups_cpu_enable_pids_and_tids_count="false"
--cgroups_enable_cfs="false" --cgroups_hierarchy="/sys/fs/cgroup" --cgroups_limit_swap="false"
--cgroups_root="mesos" --container_disk_watch_interval="15secs" --containerizers="mesos" --credential="/tmp/Endpoint_SlaveEndpointTest_UnauthorizedRequest_0_mDoUzb/credential"
--default_role="*" --disk_watch_interval="1mins" --docker="docker" --docker_kill_orphans="true"
--docker_registry="https://registry-1.docker.io" --docker_remove_delay="6hrs" --docker_socket="/var/run/docker.sock"
--docker_stop_timeout="0ns" --docker_store_dir="/tmp/Endpoint_SlaveEndpointTest_UnauthorizedRequest_0_mDoUzb/store/docker"
--docker_volume_checkpoint_dir="/var/run/mesos/isolators/docker/volume" --enforce_container_disk_quota="false"
--executor_registration_timeout="1mins" --executor_reregistration_timeout="2secs" --executor_shutdown_grace_period="5secs"
--fetcher_cache_dir="/tmp/Endpoint_SlaveEndpointTest_UnauthorizedRequest_0_mDoUzb/fetch" --fetcher_cache_size="2GB"
--frameworks_home="" --gc_delay="1weeks" --gc_disk_headroom="0.1" --hadoop_home="" --help="false"
--hostname_lookup="true" --http_command_executor="false" --http_credentials="/tmp/Endpoint_SlaveEndpointTest_UnauthorizedRequest_0_mDoUzb/http_credentials"
--http_heartbeat_interval="30secs" --initialize_driver_logging="true" --isolation="posix/cpu,posix/mem"
--launcher="posix" --launcher_dir="/mesos/mesos-1.4.0/_build/src" --logbufsecs="0" --logging_level="INFO"
--max_completed_executors_per_framework="150" --oversubscribed_resources_interval="15secs"
--perf_duration="10secs" --perf_interval="1mins" --port="5051" --qos_correction_interval_min="0ns"
--quiet="false" --recover="reconnect" --recovery_timeout="15mins" --registration_backoff_factor="10ms"
--resources="cpus:2;gpus:0;mem:1024;disk:1024;ports:[31000-32000]" --revocable_cpu_low_priority="true"
--runtime_dir="/tmp/Endpoint_SlaveEndpointTest_UnauthorizedRequest_0_mDoUzb" --sandbox_directory="/mnt/mesos/sandbox"
--strict="true" --switch_user="true" --systemd_enable_support="true" --systemd_runtime_directory="/run/systemd/system"
--version="false" --work_dir="/tmp/Endpoint_SlaveEndpointTest_UnauthorizedRequest_0_lqKeYf"
I0721 11:08:42.669667  5053 credentials.hpp:86] Loading credential for authentication from
'/tmp/Endpoint_SlaveEndpointTest_UnauthorizedRequest_0_mDoUzb/credential'
I0721 11:08:42.669950  5053 slave.cpp:283] Agent using credential for: test-principal
I0721 11:08:42.669984  5053 credentials.hpp:37] Loading credentials for authentication from
'/tmp/Endpoint_SlaveEndpointTest_UnauthorizedRequest_0_mDoUzb/http_credentials'
I0721 11:08:42.670419  5053 http.cpp:993] Creating default 'basic' HTTP authenticator for
realm 'mesos-agent-readonly'
I0721 11:08:42.670682  5053 http.cpp:993] Creating default 'basic' HTTP authenticator for
realm 'mesos-agent-readwrite'
I0721 11:08:42.673049  5053 slave.cpp:565] Agent resources: [{"name":"cpus","scalar":{"value":2.0},"type":"SCALAR"},{"name":"mem","scalar":{"value":1024.0},"type":"SCALAR"},{"name":"disk","scalar":{"value":1024.0},"type":"SCALAR"},{"name":"ports","ranges":{"range":[{"begin":31000,"end":32000}]},"type":"RANGES"}]
I0721 11:08:42.673509  5053 slave.cpp:573] Agent attributes: [  ]
I0721 11:08:42.673534  5053 slave.cpp:582] Agent hostname: 92b103b13a0d
I0721 11:08:42.673835  5050 status_update_manager.cpp:177] Pausing sending status updates
I0721 11:08:42.676028  5055 state.cpp:64] Recovering state from '/tmp/Endpoint_SlaveEndpointTest_UnauthorizedRequest_0_lqKeYf/meta'
I0721 11:08:42.676676  5052 status_update_manager.cpp:203] Recovering status update manager
I0721 11:08:42.676941  5057 containerizer.cpp:582] Recovering containerizer
I0721 11:08:42.679272  5056 provisioner.cpp:416] Provisioner recovery complete
I0721 11:08:42.679842  5051 slave.cpp:6207] Finished recovery
I0721 11:08:42.680546  5051 slave.cpp:6389] Querying resource estimator for oversubscribable
resources
I0721 11:08:42.680927  5057 slave.cpp:6403] Received oversubscribable resources {} from the
resource estimator
I0721 11:08:42.685585  5054 process.cpp:3837] Handling HTTP event for process 'slave(793)'
with path: '/slave(793)/monitor/statistics'
I0721 11:08:42.688125  5051 http.cpp:1133] HTTP GET for /slave(793)/monitor/statistics from
172.17.0.2:54042
I0721 11:08:42.688269  5051 http.cpp:957] Authorizing principal 'test-principal' to GET the
'/monitor/statistics' endpoint
I0721 11:08:42.692303  5050 slave.cpp:843] Agent terminating
[       OK ] Endpoint/SlaveEndpointTest.UnauthorizedRequest/0 (61 ms)
[ RUN      ] Endpoint/SlaveEndpointTest.UnauthorizedRequest/1
I0721 11:08:42.722466  5031 containerizer.cpp:230] Using isolation: posix/cpu,posix/mem,filesystem/posix,network/cni,environment_secret
W0721 11:08:42.723289  5031 backend.cpp:76] Failed to create 'overlay' backend: OverlayBackend
requires root privileges
W0721 11:08:42.723495  5031 backend.cpp:76] Failed to create 'bind' backend: BindBackend requires
root privileges
I0721 11:08:42.723541  5031 provisioner.cpp:255] Using default backend 'copy'
I0721 11:08:42.729852  5055 slave.cpp:250] Mesos agent started on (794)@172.17.0.2:34287
I0721 11:08:42.729926  5055 slave.cpp:251] Flags at startup: --acls="" --appc_simple_discovery_uri_prefix="http://"
--appc_store_dir="/tmp/Endpoint_SlaveEndpointTest_UnauthorizedRequest_1_UULPxU/store/appc"
--authenticate_http_readonly="true" --authenticate_http_readwrite="true" --authenticatee="crammd5"
--authentication_backoff_factor="1secs" --authorizer="local" --cgroups_cpu_enable_pids_and_tids_count="false"
--cgroups_enable_cfs="false" --cgroups_hierarchy="/sys/fs/cgroup" --cgroups_limit_swap="false"
--cgroups_root="mesos" --container_disk_watch_interval="15secs" --containerizers="mesos" --credential="/tmp/Endpoint_SlaveEndpointTest_UnauthorizedRequest_1_UULPxU/credential"
--default_role="*" --disk_watch_interval="1mins" --docker="docker" --docker_kill_orphans="true"
--docker_registry="https://registry-1.docker.io" --docker_remove_delay="6hrs" --docker_socket="/var/run/docker.sock"
--docker_stop_timeout="0ns" --docker_store_dir="/tmp/Endpoint_SlaveEndpointTest_UnauthorizedRequest_1_UULPxU/store/docker"
--docker_volume_checkpoint_dir="/var/run/mesos/isolators/docker/volume" --enforce_container_disk_quota="false"
--executor_registration_timeout="1mins" --executor_reregistration_timeout="2secs" --executor_shutdown_grace_period="5secs"
--fetcher_cache_dir="/tmp/Endpoint_SlaveEndpointTest_UnauthorizedRequest_1_UULPxU/fetch" --fetcher_cache_size="2GB"
--frameworks_home="" --gc_delay="1weeks" --gc_disk_headroom="0.1" --hadoop_home="" --help="false"
--hostname_lookup="true" --http_command_executor="false" --http_credentials="/tmp/Endpoint_SlaveEndpointTest_UnauthorizedRequest_1_UULPxU/http_credentials"
--http_heartbeat_interval="30secs" --initialize_driver_logging="true" --isolation="posix/cpu,posix/mem"
--launcher="posix" --launcher_dir="/mesos/mesos-1.4.0/_build/src" --logbufsecs="0" --logging_level="INFO"
--max_completed_executors_per_framework="150" --oversubscribed_resources_interval="15secs"
--perf_duration="10secs" --perf_interval="1mins" --port="5051" --qos_correction_interval_min="0ns"
--quiet="false" --recover="reconnect" --recovery_timeout="15mins" --registration_backoff_factor="10ms"
--resources="cpus:2;gpus:0;mem:1024;disk:1024;ports:[31000-32000]" --revocable_cpu_low_priority="true"
--runtime_dir="/tmp/Endpoint_SlaveEndpointTest_UnauthorizedRequest_1_UULPxU" --sandbox_directory="/mnt/mesos/sandbox"
--strict="true" --switch_user="true" --systemd_enable_support="true" --systemd_runtime_directory="/run/systemd/system"
--version="false" --work_dir="/tmp/Endpoint_SlaveEndpointTest_UnauthorizedRequest_1_nN6cMY"
I0721 11:08:42.730711  5055 credentials.hpp:86] Loading credential for authentication from
'/tmp/Endpoint_SlaveEndpointTest_UnauthorizedRequest_1_UULPxU/credential'
I0721 11:08:42.731075  5055 slave.cpp:283] Agent using credential for: test-principal
I0721 11:08:42.731128  5055 credentials.hpp:37] Loading credentials for authentication from
'/tmp/Endpoint_SlaveEndpointTest_UnauthorizedRequest_1_UULPxU/http_credentials'
I0721 11:08:42.731534  5055 http.cpp:993] Creating default 'basic' HTTP authenticator for
realm 'mesos-agent-readonly'
I0721 11:08:42.731848  5055 http.cpp:993] Creating default 'basic' HTTP authenticator for
realm 'mesos-agent-readwrite'
I0721 11:08:42.734139  5055 slave.cpp:565] Agent resources: [{"name":"cpus","scalar":{"value":2.0},"type":"SCALAR"},{"name":"mem","scalar":{"value":1024.0},"type":"SCALAR"},{"name":"disk","scalar":{"value":1024.0},"type":"SCALAR"},{"name":"ports","ranges":{"range":[{"begin":31000,"end":32000}]},"type":"RANGES"}]
I0721 11:08:42.734622  5055 slave.cpp:573] Agent attributes: [  ]
I0721 11:08:42.734670  5055 slave.cpp:582] Agent hostname: 92b103b13a0d
I0721 11:08:42.734987  5052 status_update_manager.cpp:177] Pausing sending status updates
I0721 11:08:42.736894  5053 state.cpp:64] Recovering state from '/tmp/Endpoint_SlaveEndpointTest_UnauthorizedRequest_1_nN6cMY/meta'
I0721 11:08:42.737385  5052 status_update_manager.cpp:203] Recovering status update manager
I0721 11:08:42.737910  5050 containerizer.cpp:582] Recovering containerizer
I0721 11:08:42.740422  5052 provisioner.cpp:416] Provisioner recovery complete
I0721 11:08:42.740986  5056 slave.cpp:6207] Finished recovery
I0721 11:08:42.741684  5056 slave.cpp:6389] Querying resource estimator for oversubscribable
resources
I0721 11:08:42.742171  5050 slave.cpp:6403] Received oversubscribable resources {} from the
resource estimator
I0721 11:08:42.746596  5050 process.cpp:3837] Handling HTTP event for process 'slave(794)'
with path: '/slave(794)/monitor/statistics.json'
I0721 11:08:42.748842  5052 http.cpp:1133] HTTP GET for /slave(794)/monitor/statistics.json
from 172.17.0.2:54044
I0721 11:08:42.748977  5052 http.cpp:957] Authorizing principal 'test-principal' to GET the
'/monitor/statistics.json' endpoint
I0721 11:08:42.753662  5031 slave.cpp:843] Agent terminating
[       OK ] Endpoint/SlaveEndpointTest.UnauthorizedRequest/1 (63 ms)
[ RUN      ] Endpoint/SlaveEndpointTest.UnauthorizedRequest/2
I0721 11:08:42.786007  5031 containerizer.cpp:230] Using isolation: posix/cpu,posix/mem,filesystem/posix,network/cni,environment_secret
W0721 11:08:42.786818  5031 backend.cpp:76] Failed to create 'overlay' backend: OverlayBackend
requires root privileges
W0721 11:08:42.786994  5031 backend.cpp:76] Failed to create 'bind' backend: BindBackend requires
root privileges
I0721 11:08:42.787037  5031 provisioner.cpp:255] Using default backend 'copy'
I0721 11:08:42.793319  5053 slave.cpp:250] Mesos agent started on (795)@172.17.0.2:34287
I0721 11:08:42.793359  5053 slave.cpp:251] Flags at startup: --acls="" --appc_simple_discovery_uri_prefix="http://"
--appc_store_dir="/tmp/Endpoint_SlaveEndpointTest_UnauthorizedRequest_2_qLvuaE/store/appc"
--authenticate_http_readonly="true" --authenticate_http_readwrite="true" --authenticatee="crammd5"
--authentication_backoff_factor="1secs" --authorizer="local" --cgroups_cpu_enable_pids_and_tids_count="false"
--cgroups_enable_cfs="false" --cgroups_hierarchy="/sys/fs/cgroup" --cgroups_limit_swap="false"
--cgroups_root="mesos" --container_disk_watch_interval="15secs" --containerizers="mesos" --credential="/tmp/Endpoint_SlaveEndpointTest_UnauthorizedRequest_2_qLvuaE/credential"
--default_role="*" --disk_watch_interval="1mins" --docker="docker" --docker_kill_orphans="true"
--docker_registry="https://registry-1.docker.io" --docker_remove_delay="6hrs" --docker_socket="/var/run/docker.sock"
--docker_stop_timeout="0ns" --docker_store_dir="/tmp/Endpoint_SlaveEndpointTest_UnauthorizedRequest_2_qLvuaE/store/docker"
--docker_volume_checkpoint_dir="/var/run/mesos/isolators/docker/volume" --enforce_container_disk_quota="false"
--executor_registration_timeout="1mins" --executor_reregistration_timeout="2secs" --executor_shutdown_grace_period="5secs"
--fetcher_cache_dir="/tmp/Endpoint_SlaveEndpointTest_UnauthorizedRequest_2_qLvuaE/fetch" --fetcher_cache_size="2GB"
--frameworks_home="" --gc_delay="1weeks" --gc_disk_headroom="0.1" --hadoop_home="" --help="false"
--hostname_lookup="true" --http_command_executor="false" --http_credentials="/tmp/Endpoint_SlaveEndpointTest_UnauthorizedRequest_2_qLvuaE/http_credentials"
--http_heartbeat_interval="30secs" --initialize_driver_logging="true" --isolation="posix/cpu,posix/mem"
--launcher="posix" --launcher_dir="/mesos/mesos-1.4.0/_build/src" --logbufsecs="0" --logging_level="INFO"
--max_completed_executors_per_framework="150" --oversubscribed_resources_interval="15secs"
--perf_duration="10secs" --perf_interval="1mins" --port="5051" --qos_correction_interval_min="0ns"
--quiet="false" --recover="reconnect" --recovery_timeout="15mins" --registration_backoff_factor="10ms"
--resources="cpus:2;gpus:0;mem:1024;disk:1024;ports:[31000-32000]" --revocable_cpu_low_priority="true"
--runtime_dir="/tmp/Endpoint_SlaveEndpointTest_UnauthorizedRequest_2_qLvuaE" --sandbox_directory="/mnt/mesos/sandbox"
--strict="true" --switch_user="true" --systemd_enable_support="true" --systemd_runtime_directory="/run/systemd/system"
--version="false" --work_dir="/tmp/Endpoint_SlaveEndpointTest_UnauthorizedRequest_2_zlAAeI"
I0721 11:08:42.794140  5053 credentials.hpp:86] Loading credential for authentication from
'/tmp/Endpoint_SlaveEndpointTest_UnauthorizedRequest_2_qLvuaE/credential'
I0721 11:08:42.794391  5053 slave.cpp:283] Agent using credential for: test-principal
I0721 11:08:42.794414  5053 credentials.hpp:37] Loading credentials for authentication from
'/tmp/Endpoint_SlaveEndpointTest_UnauthorizedRequest_2_qLvuaE/http_credentials'
I0721 11:08:42.794756  5053 http.cpp:993] Creating default 'basic' HTTP authenticator for
realm 'mesos-agent-readonly'
I0721 11:08:42.794981  5053 http.cpp:993] Creating default 'basic' HTTP authenticator for
realm 'mesos-agent-readwrite'
I0721 11:08:42.797410  5053 slave.cpp:565] Agent resources: [{"name":"cpus","scalar":{"value":2.0},"type":"SCALAR"},{"name":"mem","scalar":{"value":1024.0},"type":"SCALAR"},{"name":"disk","scalar":{"value":1024.0},"type":"SCALAR"},{"name":"ports","ranges":{"range":[{"begin":31000,"end":32000}]},"type":"RANGES"}]
I0721 11:08:42.797842  5053 slave.cpp:573] Agent attributes: [  ]
I0721 11:08:42.797863  5053 slave.cpp:582] Agent hostname: 92b103b13a0d
I0721 11:08:42.798115  5054 status_update_manager.cpp:177] Pausing sending status updates
I0721 11:08:42.800161  5056 state.cpp:64] Recovering state from '/tmp/Endpoint_SlaveEndpointTest_UnauthorizedRequest_2_zlAAeI/meta'
I0721 11:08:42.800789  5054 status_update_manager.cpp:203] Recovering status update manager
I0721 11:08:42.801185  5053 containerizer.cpp:582] Recovering containerizer
I0721 11:08:42.803375  5053 provisioner.cpp:416] Provisioner recovery complete
I0721 11:08:42.803957  5050 slave.cpp:6207] Finished recovery
I0721 11:08:42.804654  5050 slave.cpp:6389] Querying resource estimator for oversubscribable
resources
I0721 11:08:42.805101  5056 slave.cpp:6403] Received oversubscribable resources {} from the
resource estimator
I0721 11:08:42.809296  5052 process.cpp:3837] Handling HTTP event for process 'slave(795)'
with path: '/slave(795)/containers'
I0721 11:08:42.811463  5056 http.cpp:1133] HTTP GET for /slave(795)/containers from 172.17.0.2:54046
I0721 11:08:42.811647  5056 http.cpp:957] Authorizing principal 'test-principal' to GET the
'/containers' endpoint
I0721 11:08:42.815695  5056 slave.cpp:843] Agent terminating
[       OK ] Endpoint/SlaveEndpointTest.UnauthorizedRequest/2 (59 ms)
[ RUN      ] Endpoint/SlaveEndpointTest.NoAuthorizer/0
I0721 11:08:42.846034  5031 containerizer.cpp:230] Using isolation: posix/cpu,posix/mem,filesystem/posix,network/cni,environment_secret
W0721 11:08:42.846985  5031 backend.cpp:76] Failed to create 'overlay' backend: OverlayBackend
requires root privileges
W0721 11:08:42.847178  5031 backend.cpp:76] Failed to create 'bind' backend: BindBackend requires
root privileges
I0721 11:08:42.847231  5031 provisioner.cpp:255] Using default backend 'copy'
I0721 11:08:42.850533  5031 cluster.cpp:448] Creating default 'local' authorizer
I0721 11:08:42.853540  5056 slave.cpp:250] Mesos agent started on (796)@172.17.0.2:34287
I0721 11:08:42.853613  5056 slave.cpp:251] Flags at startup: --acls="" --appc_simple_discovery_uri_prefix="http://"
--appc_store_dir="/tmp/Endpoint_SlaveEndpointTest_NoAuthorizer_0_c2Sjqo/store/appc" --authenticate_http_readonly="true"
--authenticate_http_readwrite="true" --authenticatee="crammd5" --authentication_backoff_factor="1secs"
--authorizer="local" --cgroups_cpu_enable_pids_and_tids_count="false" --cgroups_enable_cfs="false"
--cgroups_hierarchy="/sys/fs/cgroup" --cgroups_limit_swap="false" --cgroups_root="mesos" --container_disk_watch_interval="15secs"
--containerizers="mesos" --credential="/tmp/Endpoint_SlaveEndpointTest_NoAuthorizer_0_c2Sjqo/credential"
--default_role="*" --disk_watch_interval="1mins" --docker="docker" --docker_kill_orphans="true"
--docker_registry="https://registry-1.docker.io" --docker_remove_delay="6hrs" --docker_socket="/var/run/docker.sock"
--docker_stop_timeout="0ns" --docker_store_dir="/tmp/Endpoint_SlaveEndpointTest_NoAuthorizer_0_c2Sjqo/store/docker"
--docker_volume_checkpoint_dir="/var/run/mesos/isolators/docker/volume" --enforce_container_disk_quota="false"
--executor_registration_timeout="1mins" --executor_reregistration_timeout="2secs" --executor_shutdown_grace_period="5secs"
--fetcher_cache_dir="/tmp/Endpoint_SlaveEndpointTest_NoAuthorizer_0_c2Sjqo/fetch" --fetcher_cache_size="2GB"
--frameworks_home="" --gc_delay="1weeks" --gc_disk_headroom="0.1" --hadoop_home="" --help="false"
--hostname_lookup="true" --http_command_executor="false" --http_credentials="/tmp/Endpoint_SlaveEndpointTest_NoAuthorizer_0_c2Sjqo/http_credentials"
--http_heartbeat_interval="30secs" --initialize_driver_logging="true" --isolation="posix/cpu,posix/mem"
--launcher="posix" --launcher_dir="/mesos/mesos-1.4.0/_build/src" --logbufsecs="0" --logging_level="INFO"
--max_completed_executors_per_framework="150" --oversubscribed_resources_interval="15secs"
--perf_duration="10secs" --perf_interval="1mins" --port="5051" --qos_correction_interval_min="0ns"
--quiet="false" --recover="reconnect" --recovery_timeout="15mins" --registration_backoff_factor="10ms"
--resources="cpus:2;gpus:0;mem:1024;disk:1024;ports:[31000-32000]" --revocable_cpu_low_priority="true"
--runtime_dir="/tmp/Endpoint_SlaveEndpointTest_NoAuthorizer_0_c2Sjqo" --sandbox_directory="/mnt/mesos/sandbox"
--strict="true" --switch_user="true" --systemd_enable_support="true" --systemd_runtime_directory="/run/systemd/system"
--version="false" --work_dir="/tmp/Endpoint_SlaveEndpointTest_NoAuthorizer_0_vZeLks"
I0721 11:08:42.854701  5056 credentials.hpp:86] Loading credential for authentication from
'/tmp/Endpoint_SlaveEndpointTest_NoAuthorizer_0_c2Sjqo/credential'
I0721 11:08:42.855017  5056 slave.cpp:283] Agent using credential for: test-principal
I0721 11:08:42.855079  5056 credentials.hpp:37] Loading credentials for authentication from
'/tmp/Endpoint_SlaveEndpointTest_NoAuthorizer_0_c2Sjqo/http_credentials'
I0721 11:08:42.855615  5056 http.cpp:993] Creating default 'basic' HTTP authenticator for
realm 'mesos-agent-readonly'
I0721 11:08:42.855912  5056 http.cpp:993] Creating default 'basic' HTTP authenticator for
realm 'mesos-agent-readwrite'
I0721 11:08:42.858279  5056 slave.cpp:565] Agent resources: [{"name":"cpus","scalar":{"value":2.0},"type":"SCALAR"},{"name":"mem","scalar":{"value":1024.0},"type":"SCALAR"},{"name":"disk","scalar":{"value":1024.0},"type":"SCALAR"},{"name":"ports","ranges":{"range":[{"begin":31000,"end":32000}]},"type":"RANGES"}]
I0721 11:08:42.858796  5056 slave.cpp:573] Agent attributes: [  ]
I0721 11:08:42.858862  5056 slave.cpp:582] Agent hostname: 92b103b13a0d
I0721 11:08:42.859192  5055 status_update_manager.cpp:177] Pausing sending status updates
I0721 11:08:42.861208  5053 state.cpp:64] Recovering state from '/tmp/Endpoint_SlaveEndpointTest_NoAuthorizer_0_vZeLks/meta'
I0721 11:08:42.862015  5057 status_update_manager.cpp:203] Recovering status update manager
I0721 11:08:42.862469  5054 containerizer.cpp:582] Recovering containerizer
I0721 11:08:42.864780  5057 provisioner.cpp:416] Provisioner recovery complete
I0721 11:08:42.865574  5050 slave.cpp:6207] Finished recovery
I0721 11:08:42.866355  5050 slave.cpp:6389] Querying resource estimator for oversubscribable
resources
I0721 11:08:42.866739  5055 slave.cpp:6403] Received oversubscribable resources {} from the
resource estimator
I0721 11:08:42.871054  5054 process.cpp:3837] Handling HTTP event for process 'slave(796)'
with path: '/slave(796)/monitor/statistics'
I0721 11:08:42.873138  5054 http.cpp:1133] HTTP GET for /slave(796)/monitor/statistics from
172.17.0.2:54048
I0721 11:08:42.873261  5054 http.cpp:957] Authorizing principal 'test-principal' to GET the
'/monitor/statistics' endpoint
I0721 11:08:42.878661  5050 slave.cpp:843] Agent terminating
[       OK ] Endpoint/SlaveEndpointTest.NoAuthorizer/0 (75 ms)
[ RUN      ] Endpoint/SlaveEndpointTest.NoAuthorizer/1
I0721 11:08:42.920688  5031 containerizer.cpp:230] Using isolation: posix/cpu,posix/mem,filesystem/posix,network/cni,environment_secret
W0721 11:08:42.921545  5031 backend.cpp:76] Failed to create 'overlay' backend: OverlayBackend
requires root privileges
W0721 11:08:42.921727  5031 backend.cpp:76] Failed to create 'bind' backend: BindBackend requires
root privileges
I0721 11:08:42.921772  5031 provisioner.cpp:255] Using default backend 'copy'
I0721 11:08:42.924517  5031 cluster.cpp:448] Creating default 'local' authorizer
I0721 11:08:42.927409  5056 slave.cpp:250] Mesos agent started on (797)@172.17.0.2:34287
I0721 11:08:42.927450  5056 slave.cpp:251] Flags at startup: --acls="" --appc_simple_discovery_uri_prefix="http://"
--appc_store_dir="/tmp/Endpoint_SlaveEndpointTest_NoAuthorizer_1_EW7Cq9/store/appc" --authenticate_http_readonly="true"
--authenticate_http_readwrite="true" --authenticatee="crammd5" --authentication_backoff_factor="1secs"
--authorizer="local" --cgroups_cpu_enable_pids_and_tids_count="false" --cgroups_enable_cfs="false"
--cgroups_hierarchy="/sys/fs/cgroup" --cgroups_limit_swap="false" --cgroups_root="mesos" --container_disk_watch_interval="15secs"
--containerizers="mesos" --credential="/tmp/Endpoint_SlaveEndpointTest_NoAuthorizer_1_EW7Cq9/credential"
--default_role="*" --disk_watch_interval="1mins" --docker="docker" --docker_kill_orphans="true"
--docker_registry="https://registry-1.docker.io" --docker_remove_delay="6hrs" --docker_socket="/var/run/docker.sock"
--docker_stop_timeout="0ns" --docker_store_dir="/tmp/Endpoint_SlaveEndpointTest_NoAuthorizer_1_EW7Cq9/store/docker"
--docker_volume_checkpoint_dir="/var/run/mesos/isolators/docker/volume" --enforce_container_disk_quota="false"
--executor_registration_timeout="1mins" --executor_reregistration_timeout="2secs" --executor_shutdown_grace_period="5secs"
--fetcher_cache_dir="/tmp/Endpoint_SlaveEndpointTest_NoAuthorizer_1_EW7Cq9/fetch" --fetcher_cache_size="2GB"
--frameworks_home="" --gc_delay="1weeks" --gc_disk_headroom="0.1" --hadoop_home="" --help="false"
--hostname_lookup="true" --http_command_executor="false" --http_credentials="/tmp/Endpoint_SlaveEndpointTest_NoAuthorizer_1_EW7Cq9/http_credentials"
--http_heartbeat_interval="30secs" --initialize_driver_logging="true" --isolation="posix/cpu,posix/mem"
--launcher="posix" --launcher_dir="/mesos/mesos-1.4.0/_build/src" --logbufsecs="0" --logging_level="INFO"
--max_completed_executors_per_framework="150" --oversubscribed_resources_interval="15secs"
--perf_duration="10secs" --perf_interval="1mins" --port="5051" --qos_correction_interval_min="0ns"
--quiet="false" --recover="reconnect" --recovery_timeout="15mins" --registration_backoff_factor="10ms"
--resources="cpus:2;gpus:0;mem:1024;disk:1024;ports:[31000-32000]" --revocable_cpu_low_priority="true"
--runtime_dir="/tmp/Endpoint_SlaveEndpointTest_NoAuthorizer_1_EW7Cq9" --sandbox_directory="/mnt/mesos/sandbox"
--strict="true" --switch_user="true" --systemd_enable_support="true" --systemd_runtime_directory="/run/systemd/system"
--version="false" --work_dir="/tmp/Endpoint_SlaveEndpointTest_NoAuthorizer_1_BicV8c"
I0721 11:08:42.928303  5056 credentials.hpp:86] Loading credential for authentication from
'/tmp/Endpoint_SlaveEndpointTest_NoAuthorizer_1_EW7Cq9/credential'
I0721 11:08:42.928750  5056 slave.cpp:283] Agent using credential for: test-principal
I0721 11:08:42.928786  5056 credentials.hpp:37] Loading credentials for authentication from
'/tmp/Endpoint_SlaveEndpointTest_NoAuthorizer_1_EW7Cq9/http_credentials'
I0721 11:08:42.929275  5056 http.cpp:993] Creating default 'basic' HTTP authenticator for
realm 'mesos-agent-readonly'
I0721 11:08:42.929662  5056 http.cpp:993] Creating default 'basic' HTTP authenticator for
realm 'mesos-agent-readwrite'
I0721 11:08:42.932001  5056 slave.cpp:565] Agent resources: [{"name":"cpus","scalar":{"value":2.0},"type":"SCALAR"},{"name":"mem","scalar":{"value":1024.0},"type":"SCALAR"},{"name":"disk","scalar":{"value":1024.0},"type":"SCALAR"},{"name":"ports","ranges":{"range":[{"begin":31000,"end":32000}]},"type":"RANGES"}]
I0721 11:08:42.932433  5056 slave.cpp:573] Agent attributes: [  ]
I0721 11:08:42.932456  5056 slave.cpp:582] Agent hostname: 92b103b13a0d
I0721 11:08:42.932646  5052 status_update_manager.cpp:177] Pausing sending status updates
I0721 11:08:42.934900  5055 state.cpp:64] Recovering state from '/tmp/Endpoint_SlaveEndpointTest_NoAuthorizer_1_BicV8c/meta'
I0721 11:08:42.935397  5050 status_update_manager.cpp:203] Recovering status update manager
I0721 11:08:42.935678  5054 containerizer.cpp:582] Recovering containerizer
I0721 11:08:42.937783  5053 provisioner.cpp:416] Provisioner recovery complete
I0721 11:08:42.938418  5052 slave.cpp:6207] Finished recovery
I0721 11:08:42.939047  5052 slave.cpp:6389] Querying resource estimator for oversubscribable
resources
I0721 11:08:42.939425  5051 slave.cpp:6403] Received oversubscribable resources {} from the
resource estimator
I0721 11:08:42.943470  5052 process.cpp:3837] Handling HTTP event for process 'slave(797)'
with path: '/slave(797)/monitor/statistics.json'
I0721 11:08:42.945547  5050 http.cpp:1133] HTTP GET for /slave(797)/monitor/statistics.json
from 172.17.0.2:54050
I0721 11:08:42.945770  5050 http.cpp:957] Authorizing principal 'test-principal' to GET the
'/monitor/statistics.json' endpoint
I0721 11:08:42.951310  5056 slave.cpp:843] Agent terminating
[       OK ] Endpoint/SlaveEndpointTest.NoAuthorizer/1 (56 ms)
[ RUN      ] Endpoint/SlaveEndpointTest.NoAuthorizer/2
I0721 11:08:42.976680  5031 containerizer.cpp:230] Using isolation: posix/cpu,posix/mem,filesystem/posix,network/cni,environment_secret
W0721 11:08:42.977448  5031 backend.cpp:76] Failed to create 'overlay' backend: OverlayBackend
requires root privileges
W0721 11:08:42.977609  5031 backend.cpp:76] Failed to create 'bind' backend: BindBackend requires
root privileges
I0721 11:08:42.977651  5031 provisioner.cpp:255] Using default backend 'copy'
I0721 11:08:42.980008  5031 cluster.cpp:448] Creating default 'local' authorizer
I0721 11:08:42.982800  5052 slave.cpp:250] Mesos agent started on (798)@172.17.0.2:34287
I0721 11:08:42.982841  5052 slave.cpp:251] Flags at startup: --acls="" --appc_simple_discovery_uri_prefix="http://"
--appc_store_dir="/tmp/Endpoint_SlaveEndpointTest_NoAuthorizer_2_QQO83U/store/appc" --authenticate_http_readonly="true"
--authenticate_http_readwrite="true" --authenticatee="crammd5" --authentication_backoff_factor="1secs"
--authorizer="local" --cgroups_cpu_enable_pids_and_tids_count="false" --cgroups_enable_cfs="false"
--cgroups_hierarchy="/sys/fs/cgroup" --cgroups_limit_swap="false" --cgroups_root="mesos" --container_disk_watch_interval="15secs"
--containerizers="mesos" --credential="/tmp/Endpoint_SlaveEndpointTest_NoAuthorizer_2_QQO83U/credential"
--default_role="*" --disk_watch_interval="1mins" --docker="docker" --docker_kill_orphans="true"
--docker_registry="https://registry-1.docker.io" --docker_remove_delay="6hrs" --docker_socket="/var/run/docker.sock"
--docker_stop_timeout="0ns" --docker_store_dir="/tmp/Endpoint_SlaveEndpointTest_NoAuthorizer_2_QQO83U/store/docker"
--docker_volume_checkpoint_dir="/var/run/mesos/isolators/docker/volume" --enforce_container_disk_quota="false"
--executor_registration_timeout="1mins" --executor_reregistration_timeout="2secs" --executor_shutdown_grace_period="5secs"
--fetcher_cache_dir="/tmp/Endpoint_SlaveEndpointTest_NoAuthorizer_2_QQO83U/fetch" --fetcher_cache_size="2GB"
--frameworks_home="" --gc_delay="1weeks" --gc_disk_headroom="0.1" --hadoop_home="" --help="false"
--hostname_lookup="true" --http_command_executor="false" --http_credentials="/tmp/Endpoint_SlaveEndpointTest_NoAuthorizer_2_QQO83U/http_credentials"
--http_heartbeat_interval="30secs" --initialize_driver_logging="true" --isolation="posix/cpu,posix/mem"
--launcher="posix" --launcher_dir="/mesos/mesos-1.4.0/_build/src" --logbufsecs="0" --logging_level="INFO"
--max_completed_executors_per_framework="150" --oversubscribed_resources_interval="15secs"
--perf_duration="10secs" --perf_interval="1mins" --port="5051" --qos_correction_interval_min="0ns"
--quiet="false" --recover="reconnect" --recovery_timeout="15mins" --registration_backoff_factor="10ms"
--resources="cpus:2;gpus:0;mem:1024;disk:1024;ports:[31000-32000]" --revocable_cpu_low_priority="true"
--runtime_dir="/tmp/Endpoint_SlaveEndpointTest_NoAuthorizer_2_QQO83U" --sandbox_directory="/mnt/mesos/sandbox"
--strict="true" --switch_user="true" --systemd_enable_support="true" --systemd_runtime_directory="/run/systemd/system"
--version="false" --work_dir="/tmp/Endpoint_SlaveEndpointTest_NoAuthorizer_2_v7WiDY"
I0721 11:08:42.983816  5052 credentials.hpp:86] Loading credential for authentication from
'/tmp/Endpoint_SlaveEndpointTest_NoAuthorizer_2_QQO83U/credential'
I0721 11:08:42.984324  5052 slave.cpp:283] Agent using credential for: test-principal
I0721 11:08:42.984360  5052 credentials.hpp:37] Loading credentials for authentication from
'/tmp/Endpoint_SlaveEndpointTest_NoAuthorizer_2_QQO83U/http_credentials'
I0721 11:08:42.984810  5052 http.cpp:993] Creating default 'basic' HTTP authenticator for
realm 'mesos-agent-readonly'
I0721 11:08:42.985146  5052 http.cpp:993] Creating default 'basic' HTTP authenticator for
realm 'mesos-agent-readwrite'
I0721 11:08:42.987416  5052 slave.cpp:565] Agent resources: [{"name":"cpus","scalar":{"value":2.0},"type":"SCALAR"},{"name":"mem","scalar":{"value":1024.0},"type":"SCALAR"},{"name":"disk","scalar":{"value":1024.0},"type":"SCALAR"},{"name":"ports","ranges":{"range":[{"begin":31000,"end":32000}]},"type":"RANGES"}]
I0721 11:08:42.987848  5052 slave.cpp:573] Agent attributes: [  ]
I0721 11:08:42.987869  5052 slave.cpp:582] Agent hostname: 92b103b13a0d
I0721 11:08:42.988294  5055 status_update_manager.cpp:177] Pausing sending status updates
I0721 11:08:42.990221  5054 state.cpp:64] Recovering state from '/tmp/Endpoint_SlaveEndpointTest_NoAuthorizer_2_v7WiDY/meta'
I0721 11:08:42.990646  5050 status_update_manager.cpp:203] Recovering status update manager
I0721 11:08:42.990985  5057 containerizer.cpp:582] Recovering containerizer
I0721 11:08:42.993070  5056 provisioner.cpp:416] Provisioner recovery complete
I0721 11:08:42.993669  5052 slave.cpp:6207] Finished recovery
I0721 11:08:42.994503  5052 slave.cpp:6389] Querying resource estimator for oversubscribable
resources
I0721 11:08:42.994966  5050 slave.cpp:6403] Received oversubscribable resources {} from the
resource estimator
I0721 11:08:42.998914  5057 process.cpp:3837] Handling HTTP event for process 'slave(798)'
with path: '/slave(798)/containers'
I0721 11:08:43.000900  5050 http.cpp:1133] HTTP GET for /slave(798)/containers from 172.17.0.2:54052
I0721 11:08:43.001034  5050 http.cpp:957] Authorizing principal 'test-principal' to GET the
'/containers' endpoint
I0721 11:08:43.007149  5054 slave.cpp:843] Agent terminating
[       OK ] Endpoint/SlaveEndpointTest.NoAuthorizer/2 (50 ms)
[----------] 9 tests from Endpoint/SlaveEndpointTest (525 ms total)

[----------] Global test environment tear-down
[==========] 1637 tests from 179 test cases ran. (716994 ms total)
[  PASSED  ] 1633 tests.
[  FAILED  ] 4 tests, listed below:
[  FAILED  ] DefaultExecutorCheckTest.CommandCheckDeliveredAndReconciled
[  FAILED  ] DefaultExecutorCheckTest.CommandCheckStatusChange
[  FAILED  ] DefaultExecutorCheckTest.CommandCheckSeesParentsEnv
[  FAILED  ] DefaultExecutorCheckTest.CommandCheckSharesWorkDirWithTask

 4 FAILED TESTS
  YOU HAVE 20 DISABLED TESTS

I0721 11:08:43.152734  5058 process.cpp:1006] Failed to accept socket: future discarded
make[4]: *** [check-local] Error 1
make[4]: Leaving directory `/mesos/mesos-1.4.0/_build/src'
make[3]: *** [check-am] Error 2
make[3]: Leaving directory `/mesos/mesos-1.4.0/_build/src'
make[2]: *** [check] Error 2
make[2]: Leaving directory `/mesos/mesos-1.4.0/_build/src'
make[1]: *** [check-recursive] Error 1
make[1]: Leaving directory `/mesos/mesos-1.4.0/_build'
make: *** [distcheck] Error 1
+ docker rmi mesos-1500629671-28115
Untagged: mesos-1500629671-28115:latest
Deleted: sha256:1dfcad1f8b008b28b21041c9ad4f21fbc2a41478b5839c64b0a02a29dd5b9bfc
Deleted: sha256:b103e05cde86dc425f6ce4dea7a987fb3a0c1fd1bada25c0740b6c296dc3475d
Deleted: sha256:b0fe743c2705df5ccce51993e82789c650289c65781cf0860a6cd67ff81e903a
Deleted: sha256:88eae51cb0bf5d4ba2dda40958b5957c3126db78701a5eacb784230465f0ca03
Deleted: sha256:d05b89d1d104bcceec6323f9ea94275cc02e55699b60e02738896add362ff4e0
Deleted: sha256:10f2a5bc01268b4ea3539a5a98f58440179d7de7d8d66714cf5cbacfe4c29801
Deleted: sha256:c210099d9cf58546372d068e65db2a3fb74bb9a063570a2a92b239332c8cd133
Deleted: sha256:c4d4d671493db787b783ca12ed280d0eb3f18ca03718c8731f8a4a46089a0e7e
Deleted: sha256:d32fb2c78c4cbc8c2e9200803675d3f2d5a6271b9616ac38131e09ff573371cd
Deleted: sha256:1911b4c147daff6a8ee2c419549091edb55e83d27aed6978c3fde2eaab7f8ed6
Deleted: sha256:23ab9a1d4c2313eb01a8fbc659ffede318f3597c7fd32dbd2aaa5aa402e780a2
Deleted: sha256:63694ceb0dc3a9989ce816c2d6173f1e6ec895d96f0619f1ceac4a3e6c7f0359
Deleted: sha256:f9d4e7db772223a1a4b4a7bb90127547bf4c83f76f92480991e82fb261eb934a
Deleted: sha256:d49dea14bacfd8412205d1ee0e96e53021a9fbbcf4bf3afa623bfe29833ea2ca
Deleted: sha256:56b3c0b141b4b765ebf63f26d7533b2107e14646b22c28060cab897149651b0e
Deleted: sha256:672c950ddc9b0924952aa1461bf315e507c3cf72b23c0f9cf51f659709e33f60
Deleted: sha256:3ef3ea9126a1ae399be6f3742cd1f25fde9c23f8a56ff6895506ede1d394d7ea
Deleted: sha256:7e1f4500691307f6fd5c25b2935739e2d4746be48b282a5e326a56d37d2f40b3
Deleted: sha256:26e6c9f9aa18cce8f20b406c21ded30f336c2972c9493e52f85177543a4bcc09
Deleted: sha256:1b73a161f5a60109167609cf92eb7ed0e06bf7a7a936d533f43d6cc44b7bc244
Deleted: sha256:78038b60ba3d2dd5eaf80836a50a270fb8b9d29a2db29ed3b4a4d7be40d92986
Deleted: sha256:d81c61421f7053f2439ba7b679eb940311aa04712ca52d5ba7184450fde0920f
Deleted: sha256:9d52e343acdc5410a5f498ccff77f9f2365eedad14697d3301ffebfe1a51e47c
Deleted: sha256:9baa4623f147dfe43a279d907debdbbe268d953529af10aec5946eb2b0ff73a5
Build step 'Execute shell' marked build as failure

Mime
View raw message