mesos-builds mailing list archives

Site index · List index
Message view « Date » · « Thread »
Top « Date » · « Thread »
From Apache Jenkins Server <jenk...@builds.apache.org>
Subject Build failed in Jenkins: Mesos-Reviewbot #18562
Date Fri, 21 Jul 2017 09:21:20 GMT
See <https://builds.apache.org/job/Mesos-Reviewbot/18562/display/redirect>

------------------------------------------
[...truncated 30.23 MB...]
I0721 09:21:13.475577  5019 containerizer.cpp:230] Using isolation: posix/cpu,posix/mem,filesystem/posix,network/cni,environment_secret
W0721 09:21:13.476331  5019 backend.cpp:76] Failed to create 'overlay' backend: OverlayBackend
requires root privileges
W0721 09:21:13.476495  5019 backend.cpp:76] Failed to create 'bind' backend: BindBackend requires
root privileges
I0721 09:21:13.476536  5019 provisioner.cpp:255] Using default backend 'copy'
I0721 09:21:13.481549  5044 slave.cpp:250] Mesos agent started on (792)@172.17.0.2:34355
I0721 09:21:13.481590  5044 slave.cpp:251] Flags at startup: --acls="" --appc_simple_discovery_uri_prefix="http://"
--appc_store_dir="/tmp/Endpoint_SlaveEndpointTest_AuthorizedRequest_2_qXeFo5/store/appc" --authenticate_http_readonly="true"
--authenticate_http_readwrite="true" --authenticatee="crammd5" --authentication_backoff_factor="1secs"
--authorizer="local" --cgroups_cpu_enable_pids_and_tids_count="false" --cgroups_enable_cfs="false"
--cgroups_hierarchy="/sys/fs/cgroup" --cgroups_limit_swap="false" --cgroups_root="mesos" --container_disk_watch_interval="15secs"
--containerizers="mesos" --credential="/tmp/Endpoint_SlaveEndpointTest_AuthorizedRequest_2_qXeFo5/credential"
--default_role="*" --disk_watch_interval="1mins" --docker="docker" --docker_kill_orphans="true"
--docker_registry="https://registry-1.docker.io" --docker_remove_delay="6hrs" --docker_socket="/var/run/docker.sock"
--docker_stop_timeout="0ns" --docker_store_dir="/tmp/Endpoint_SlaveEndpointTest_AuthorizedRequest_2_qXeFo5/store/docker"
--docker_volume_checkpoint_dir="/var/run/mesos/isolators/docker/volume" --enforce_container_disk_quota="false"
--executor_registration_timeout="1mins" --executor_reregistration_timeout="2secs" --executor_shutdown_grace_period="5secs"
--fetcher_cache_dir="/tmp/Endpoint_SlaveEndpointTest_AuthorizedRequest_2_qXeFo5/fetch" --fetcher_cache_size="2GB"
--frameworks_home="" --gc_delay="1weeks" --gc_disk_headroom="0.1" --hadoop_home="" --help="false"
--hostname_lookup="true" --http_command_executor="false" --http_credentials="/tmp/Endpoint_SlaveEndpointTest_AuthorizedRequest_2_qXeFo5/http_credentials"
--http_heartbeat_interval="30secs" --initialize_driver_logging="true" --isolation="posix/cpu,posix/mem"
--launcher="posix" --launcher_dir="/mesos/mesos-1.4.0/_build/src" --logbufsecs="0" --logging_level="INFO"
--max_completed_executors_per_framework="150" --oversubscribed_resources_interval="15secs"
--perf_duration="10secs" --perf_interval="1mins" --port="5051" --qos_correction_interval_min="0ns"
--quiet="false" --recover="reconnect" --recovery_timeout="15mins" --registration_backoff_factor="10ms"
--resources="cpus:2;gpus:0;mem:1024;disk:1024;ports:[31000-32000]" --revocable_cpu_low_priority="true"
--runtime_dir="/tmp/Endpoint_SlaveEndpointTest_AuthorizedRequest_2_qXeFo5" --sandbox_directory="/mnt/mesos/sandbox"
--strict="true" --switch_user="true" --systemd_enable_support="true" --systemd_runtime_directory="/run/systemd/system"
--version="false" --work_dir="/tmp/Endpoint_SlaveEndpointTest_AuthorizedRequest_2_znHlbY"
I0721 09:21:13.482316  5044 credentials.hpp:86] Loading credential for authentication from
'/tmp/Endpoint_SlaveEndpointTest_AuthorizedRequest_2_qXeFo5/credential'
I0721 09:21:13.482580  5044 slave.cpp:283] Agent using credential for: test-principal
I0721 09:21:13.482609  5044 credentials.hpp:37] Loading credentials for authentication from
'/tmp/Endpoint_SlaveEndpointTest_AuthorizedRequest_2_qXeFo5/http_credentials'
I0721 09:21:13.482991  5044 http.cpp:993] Creating default 'basic' HTTP authenticator for
realm 'mesos-agent-readonly'
I0721 09:21:13.483230  5044 http.cpp:993] Creating default 'basic' HTTP authenticator for
realm 'mesos-agent-readwrite'
I0721 09:21:13.485409  5044 slave.cpp:565] Agent resources: [{"name":"cpus","scalar":{"value":2.0},"type":"SCALAR"},{"name":"mem","scalar":{"value":1024.0},"type":"SCALAR"},{"name":"disk","scalar":{"value":1024.0},"type":"SCALAR"},{"name":"ports","ranges":{"range":[{"begin":31000,"end":32000}]},"type":"RANGES"}]
I0721 09:21:13.485841  5044 slave.cpp:573] Agent attributes: [  ]
I0721 09:21:13.485862  5044 slave.cpp:582] Agent hostname: d924d694434e
I0721 09:21:13.486064  5043 status_update_manager.cpp:177] Pausing sending status updates
I0721 09:21:13.487958  5038 state.cpp:64] Recovering state from '/tmp/Endpoint_SlaveEndpointTest_AuthorizedRequest_2_znHlbY/meta'
I0721 09:21:13.488454  5045 status_update_manager.cpp:203] Recovering status update manager
I0721 09:21:13.488732  5044 containerizer.cpp:582] Recovering containerizer
I0721 09:21:13.491189  5040 provisioner.cpp:416] Provisioner recovery complete
I0721 09:21:13.491689  5043 slave.cpp:6207] Finished recovery
I0721 09:21:13.492333  5043 slave.cpp:6389] Querying resource estimator for oversubscribable
resources
I0721 09:21:13.492674  5041 slave.cpp:6403] Received oversubscribable resources {} from the
resource estimator
I0721 09:21:13.496655  5041 process.cpp:3837] Handling HTTP event for process 'slave(792)'
with path: '/slave(792)/containers'
I0721 09:21:13.498531  5045 http.cpp:1133] HTTP GET for /slave(792)/containers from 172.17.0.2:60690
I0721 09:21:13.498670  5045 http.cpp:957] Authorizing principal 'test-principal' to GET the
'/containers' endpoint
I0721 09:21:13.504894  5044 slave.cpp:843] Agent terminating
[       OK ] Endpoint/SlaveEndpointTest.AuthorizedRequest/2 (52 ms)
[ RUN      ] Endpoint/SlaveEndpointTest.UnauthorizedRequest/0
I0721 09:21:13.527710  5019 containerizer.cpp:230] Using isolation: posix/cpu,posix/mem,filesystem/posix,network/cni,environment_secret
W0721 09:21:13.528460  5019 backend.cpp:76] Failed to create 'overlay' backend: OverlayBackend
requires root privileges
W0721 09:21:13.528621  5019 backend.cpp:76] Failed to create 'bind' backend: BindBackend requires
root privileges
I0721 09:21:13.528664  5019 provisioner.cpp:255] Using default backend 'copy'
I0721 09:21:13.533587  5045 slave.cpp:250] Mesos agent started on (793)@172.17.0.2:34355
I0721 09:21:13.533628  5045 slave.cpp:251] Flags at startup: --acls="" --appc_simple_discovery_uri_prefix="http://"
--appc_store_dir="/tmp/Endpoint_SlaveEndpointTest_UnauthorizedRequest_0_STQ3Hy/store/appc"
--authenticate_http_readonly="true" --authenticate_http_readwrite="true" --authenticatee="crammd5"
--authentication_backoff_factor="1secs" --authorizer="local" --cgroups_cpu_enable_pids_and_tids_count="false"
--cgroups_enable_cfs="false" --cgroups_hierarchy="/sys/fs/cgroup" --cgroups_limit_swap="false"
--cgroups_root="mesos" --container_disk_watch_interval="15secs" --containerizers="mesos" --credential="/tmp/Endpoint_SlaveEndpointTest_UnauthorizedRequest_0_STQ3Hy/credential"
--default_role="*" --disk_watch_interval="1mins" --docker="docker" --docker_kill_orphans="true"
--docker_registry="https://registry-1.docker.io" --docker_remove_delay="6hrs" --docker_socket="/var/run/docker.sock"
--docker_stop_timeout="0ns" --docker_store_dir="/tmp/Endpoint_SlaveEndpointTest_UnauthorizedRequest_0_STQ3Hy/store/docker"
--docker_volume_checkpoint_dir="/var/run/mesos/isolators/docker/volume" --enforce_container_disk_quota="false"
--executor_registration_timeout="1mins" --executor_reregistration_timeout="2secs" --executor_shutdown_grace_period="5secs"
--fetcher_cache_dir="/tmp/Endpoint_SlaveEndpointTest_UnauthorizedRequest_0_STQ3Hy/fetch" --fetcher_cache_size="2GB"
--frameworks_home="" --gc_delay="1weeks" --gc_disk_headroom="0.1" --hadoop_home="" --help="false"
--hostname_lookup="true" --http_command_executor="false" --http_credentials="/tmp/Endpoint_SlaveEndpointTest_UnauthorizedRequest_0_STQ3Hy/http_credentials"
--http_heartbeat_interval="30secs" --initialize_driver_logging="true" --isolation="posix/cpu,posix/mem"
--launcher="posix" --launcher_dir="/mesos/mesos-1.4.0/_build/src" --logbufsecs="0" --logging_level="INFO"
--max_completed_executors_per_framework="150" --oversubscribed_resources_interval="15secs"
--perf_duration="10secs" --perf_interval="1mins" --port="5051" --qos_correction_interval_min="0ns"
--quiet="false" --recover="reconnect" --recovery_timeout="15mins" --registration_backoff_factor="10ms"
--resources="cpus:2;gpus:0;mem:1024;disk:1024;ports:[31000-32000]" --revocable_cpu_low_priority="true"
--runtime_dir="/tmp/Endpoint_SlaveEndpointTest_UnauthorizedRequest_0_STQ3Hy" --sandbox_directory="/mnt/mesos/sandbox"
--strict="true" --switch_user="true" --systemd_enable_support="true" --systemd_runtime_directory="/run/systemd/system"
--version="false" --work_dir="/tmp/Endpoint_SlaveEndpointTest_UnauthorizedRequest_0_zzckmr"
I0721 09:21:13.534379  5045 credentials.hpp:86] Loading credential for authentication from
'/tmp/Endpoint_SlaveEndpointTest_UnauthorizedRequest_0_STQ3Hy/credential'
I0721 09:21:13.534631  5045 slave.cpp:283] Agent using credential for: test-principal
I0721 09:21:13.534653  5045 credentials.hpp:37] Loading credentials for authentication from
'/tmp/Endpoint_SlaveEndpointTest_UnauthorizedRequest_0_STQ3Hy/http_credentials'
I0721 09:21:13.534996  5045 http.cpp:993] Creating default 'basic' HTTP authenticator for
realm 'mesos-agent-readonly'
I0721 09:21:13.535198  5045 http.cpp:993] Creating default 'basic' HTTP authenticator for
realm 'mesos-agent-readwrite'
I0721 09:21:13.537317  5045 slave.cpp:565] Agent resources: [{"name":"cpus","scalar":{"value":2.0},"type":"SCALAR"},{"name":"mem","scalar":{"value":1024.0},"type":"SCALAR"},{"name":"disk","scalar":{"value":1024.0},"type":"SCALAR"},{"name":"ports","ranges":{"range":[{"begin":31000,"end":32000}]},"type":"RANGES"}]
I0721 09:21:13.537734  5045 slave.cpp:573] Agent attributes: [  ]
I0721 09:21:13.537756  5045 slave.cpp:582] Agent hostname: d924d694434e
I0721 09:21:13.537964  5040 status_update_manager.cpp:177] Pausing sending status updates
I0721 09:21:13.539824  5041 state.cpp:64] Recovering state from '/tmp/Endpoint_SlaveEndpointTest_UnauthorizedRequest_0_zzckmr/meta'
I0721 09:21:13.540554  5038 status_update_manager.cpp:203] Recovering status update manager
I0721 09:21:13.541002  5044 containerizer.cpp:582] Recovering containerizer
I0721 09:21:13.543100  5044 provisioner.cpp:416] Provisioner recovery complete
I0721 09:21:13.543617  5041 slave.cpp:6207] Finished recovery
I0721 09:21:13.544329  5041 slave.cpp:6389] Querying resource estimator for oversubscribable
resources
I0721 09:21:13.544767  5043 slave.cpp:6403] Received oversubscribable resources {} from the
resource estimator
I0721 09:21:13.549264  5039 process.cpp:3837] Handling HTTP event for process 'slave(793)'
with path: '/slave(793)/monitor/statistics'
I0721 09:21:13.551877  5045 http.cpp:1133] HTTP GET for /slave(793)/monitor/statistics from
172.17.0.2:60692
I0721 09:21:13.552004  5045 http.cpp:957] Authorizing principal 'test-principal' to GET the
'/monitor/statistics' endpoint
I0721 09:21:13.555932  5019 slave.cpp:843] Agent terminating
[       OK ] Endpoint/SlaveEndpointTest.UnauthorizedRequest/0 (43 ms)
[ RUN      ] Endpoint/SlaveEndpointTest.UnauthorizedRequest/1
I0721 09:21:13.571208  5019 containerizer.cpp:230] Using isolation: posix/cpu,posix/mem,filesystem/posix,network/cni,environment_secret
W0721 09:21:13.571961  5019 backend.cpp:76] Failed to create 'overlay' backend: OverlayBackend
requires root privileges
W0721 09:21:13.572119  5019 backend.cpp:76] Failed to create 'bind' backend: BindBackend requires
root privileges
I0721 09:21:13.572160  5019 provisioner.cpp:255] Using default backend 'copy'
I0721 09:21:13.577100  5042 slave.cpp:250] Mesos agent started on (794)@172.17.0.2:34355
I0721 09:21:13.577142  5042 slave.cpp:251] Flags at startup: --acls="" --appc_simple_discovery_uri_prefix="http://"
--appc_store_dir="/tmp/Endpoint_SlaveEndpointTest_UnauthorizedRequest_1_2gf3u2/store/appc"
--authenticate_http_readonly="true" --authenticate_http_readwrite="true" --authenticatee="crammd5"
--authentication_backoff_factor="1secs" --authorizer="local" --cgroups_cpu_enable_pids_and_tids_count="false"
--cgroups_enable_cfs="false" --cgroups_hierarchy="/sys/fs/cgroup" --cgroups_limit_swap="false"
--cgroups_root="mesos" --container_disk_watch_interval="15secs" --containerizers="mesos" --credential="/tmp/Endpoint_SlaveEndpointTest_UnauthorizedRequest_1_2gf3u2/credential"
--default_role="*" --disk_watch_interval="1mins" --docker="docker" --docker_kill_orphans="true"
--docker_registry="https://registry-1.docker.io" --docker_remove_delay="6hrs" --docker_socket="/var/run/docker.sock"
--docker_stop_timeout="0ns" --docker_store_dir="/tmp/Endpoint_SlaveEndpointTest_UnauthorizedRequest_1_2gf3u2/store/docker"
--docker_volume_checkpoint_dir="/var/run/mesos/isolators/docker/volume" --enforce_container_disk_quota="false"
--executor_registration_timeout="1mins" --executor_reregistration_timeout="2secs" --executor_shutdown_grace_period="5secs"
--fetcher_cache_dir="/tmp/Endpoint_SlaveEndpointTest_UnauthorizedRequest_1_2gf3u2/fetch" --fetcher_cache_size="2GB"
--frameworks_home="" --gc_delay="1weeks" --gc_disk_headroom="0.1" --hadoop_home="" --help="false"
--hostname_lookup="true" --http_command_executor="false" --http_credentials="/tmp/Endpoint_SlaveEndpointTest_UnauthorizedRequest_1_2gf3u2/http_credentials"
--http_heartbeat_interval="30secs" --initialize_driver_logging="true" --isolation="posix/cpu,posix/mem"
--launcher="posix" --launcher_dir="/mesos/mesos-1.4.0/_build/src" --logbufsecs="0" --logging_level="INFO"
--max_completed_executors_per_framework="150" --oversubscribed_resources_interval="15secs"
--perf_duration="10secs" --perf_interval="1mins" --port="5051" --qos_correction_interval_min="0ns"
--quiet="false" --recover="reconnect" --recovery_timeout="15mins" --registration_backoff_factor="10ms"
--resources="cpus:2;gpus:0;mem:1024;disk:1024;ports:[31000-32000]" --revocable_cpu_low_priority="true"
--runtime_dir="/tmp/Endpoint_SlaveEndpointTest_UnauthorizedRequest_1_2gf3u2" --sandbox_directory="/mnt/mesos/sandbox"
--strict="true" --switch_user="true" --systemd_enable_support="true" --systemd_runtime_directory="/run/systemd/system"
--version="false" --work_dir="/tmp/Endpoint_SlaveEndpointTest_UnauthorizedRequest_1_tCOf2U"
I0721 09:21:13.578065  5042 credentials.hpp:86] Loading credential for authentication from
'/tmp/Endpoint_SlaveEndpointTest_UnauthorizedRequest_1_2gf3u2/credential'
I0721 09:21:13.578337  5042 slave.cpp:283] Agent using credential for: test-principal
I0721 09:21:13.578361  5042 credentials.hpp:37] Loading credentials for authentication from
'/tmp/Endpoint_SlaveEndpointTest_UnauthorizedRequest_1_2gf3u2/http_credentials'
I0721 09:21:13.578721  5042 http.cpp:993] Creating default 'basic' HTTP authenticator for
realm 'mesos-agent-readonly'
I0721 09:21:13.578953  5042 http.cpp:993] Creating default 'basic' HTTP authenticator for
realm 'mesos-agent-readwrite'
I0721 09:21:13.581141  5042 slave.cpp:565] Agent resources: [{"name":"cpus","scalar":{"value":2.0},"type":"SCALAR"},{"name":"mem","scalar":{"value":1024.0},"type":"SCALAR"},{"name":"disk","scalar":{"value":1024.0},"type":"SCALAR"},{"name":"ports","ranges":{"range":[{"begin":31000,"end":32000}]},"type":"RANGES"}]
I0721 09:21:13.581564  5042 slave.cpp:573] Agent attributes: [  ]
I0721 09:21:13.581584  5042 slave.cpp:582] Agent hostname: d924d694434e
I0721 09:21:13.581815  5045 status_update_manager.cpp:177] Pausing sending status updates
I0721 09:21:13.584019  5039 state.cpp:64] Recovering state from '/tmp/Endpoint_SlaveEndpointTest_UnauthorizedRequest_1_tCOf2U/meta'
I0721 09:21:13.584666  5043 status_update_manager.cpp:203] Recovering status update manager
I0721 09:21:13.585302  5044 containerizer.cpp:582] Recovering containerizer
I0721 09:21:13.587255  5038 provisioner.cpp:416] Provisioner recovery complete
I0721 09:21:13.587692  5044 slave.cpp:6207] Finished recovery
I0721 09:21:13.588299  5044 slave.cpp:6389] Querying resource estimator for oversubscribable
resources
I0721 09:21:13.588649  5041 slave.cpp:6403] Received oversubscribable resources {} from the
resource estimator
I0721 09:21:13.593055  5041 process.cpp:3837] Handling HTTP event for process 'slave(794)'
with path: '/slave(794)/monitor/statistics.json'
I0721 09:21:13.595134  5044 http.cpp:1133] HTTP GET for /slave(794)/monitor/statistics.json
from 172.17.0.2:60694
I0721 09:21:13.595265  5044 http.cpp:957] Authorizing principal 'test-principal' to GET the
'/monitor/statistics.json' endpoint
I0721 09:21:13.598718  5019 slave.cpp:843] Agent terminating
[       OK ] Endpoint/SlaveEndpointTest.UnauthorizedRequest/1 (42 ms)
[ RUN      ] Endpoint/SlaveEndpointTest.UnauthorizedRequest/2
I0721 09:21:13.613833  5019 containerizer.cpp:230] Using isolation: posix/cpu,posix/mem,filesystem/posix,network/cni,environment_secret
W0721 09:21:13.614625  5019 backend.cpp:76] Failed to create 'overlay' backend: OverlayBackend
requires root privileges
W0721 09:21:13.614789  5019 backend.cpp:76] Failed to create 'bind' backend: BindBackend requires
root privileges
I0721 09:21:13.614831  5019 provisioner.cpp:255] Using default backend 'copy'
I0721 09:21:13.619786  5039 slave.cpp:250] Mesos agent started on (795)@172.17.0.2:34355
I0721 09:21:13.620029  5039 slave.cpp:251] Flags at startup: --acls="" --appc_simple_discovery_uri_prefix="http://"
--appc_store_dir="/tmp/Endpoint_SlaveEndpointTest_UnauthorizedRequest_2_gKrVJw/store/appc"
--authenticate_http_readonly="true" --authenticate_http_readwrite="true" --authenticatee="crammd5"
--authentication_backoff_factor="1secs" --authorizer="local" --cgroups_cpu_enable_pids_and_tids_count="false"
--cgroups_enable_cfs="false" --cgroups_hierarchy="/sys/fs/cgroup" --cgroups_limit_swap="false"
--cgroups_root="mesos" --container_disk_watch_interval="15secs" --containerizers="mesos" --credential="/tmp/Endpoint_SlaveEndpointTest_UnauthorizedRequest_2_gKrVJw/credential"
--default_role="*" --disk_watch_interval="1mins" --docker="docker" --docker_kill_orphans="true"
--docker_registry="https://registry-1.docker.io" --docker_remove_delay="6hrs" --docker_socket="/var/run/docker.sock"
--docker_stop_timeout="0ns" --docker_store_dir="/tmp/Endpoint_SlaveEndpointTest_UnauthorizedRequest_2_gKrVJw/store/docker"
--docker_volume_checkpoint_dir="/var/run/mesos/isolators/docker/volume" --enforce_container_disk_quota="false"
--executor_registration_timeout="1mins" --executor_reregistration_timeout="2secs" --executor_shutdown_grace_period="5secs"
--fetcher_cache_dir="/tmp/Endpoint_SlaveEndpointTest_UnauthorizedRequest_2_gKrVJw/fetch" --fetcher_cache_size="2GB"
--frameworks_home="" --gc_delay="1weeks" --gc_disk_headroom="0.1" --hadoop_home="" --help="false"
--hostname_lookup="true" --http_command_executor="false" --http_credentials="/tmp/Endpoint_SlaveEndpointTest_UnauthorizedRequest_2_gKrVJw/http_credentials"
--http_heartbeat_interval="30secs" --initialize_driver_logging="true" --isolation="posix/cpu,posix/mem"
--launcher="posix" --launcher_dir="/mesos/mesos-1.4.0/_build/src" --logbufsecs="0" --logging_level="INFO"
--max_completed_executors_per_framework="150" --oversubscribed_resources_interval="15secs"
--perf_duration="10secs" --perf_interval="1mins" --port="5051" --qos_correction_interval_min="0ns"
--quiet="false" --recover="reconnect" --recovery_timeout="15mins" --registration_backoff_factor="10ms"
--resources="cpus:2;gpus:0;mem:1024;disk:1024;ports:[31000-32000]" --revocable_cpu_low_priority="true"
--runtime_dir="/tmp/Endpoint_SlaveEndpointTest_UnauthorizedRequest_2_gKrVJw" --sandbox_directory="/mnt/mesos/sandbox"
--strict="true" --switch_user="true" --systemd_enable_support="true" --systemd_runtime_directory="/run/systemd/system"
--version="false" --work_dir="/tmp/Endpoint_SlaveEndpointTest_UnauthorizedRequest_2_n7kdap"
I0721 09:21:13.621136  5039 credentials.hpp:86] Loading credential for authentication from
'/tmp/Endpoint_SlaveEndpointTest_UnauthorizedRequest_2_gKrVJw/credential'
I0721 09:21:13.621661  5039 slave.cpp:283] Agent using credential for: test-principal
I0721 09:21:13.621915  5039 credentials.hpp:37] Loading credentials for authentication from
'/tmp/Endpoint_SlaveEndpointTest_UnauthorizedRequest_2_gKrVJw/http_credentials'
I0721 09:21:13.622575  5039 http.cpp:993] Creating default 'basic' HTTP authenticator for
realm 'mesos-agent-readonly'
I0721 09:21:13.623102  5039 http.cpp:993] Creating default 'basic' HTTP authenticator for
realm 'mesos-agent-readwrite'
I0721 09:21:13.625655  5039 slave.cpp:565] Agent resources: [{"name":"cpus","scalar":{"value":2.0},"type":"SCALAR"},{"name":"mem","scalar":{"value":1024.0},"type":"SCALAR"},{"name":"disk","scalar":{"value":1024.0},"type":"SCALAR"},{"name":"ports","ranges":{"range":[{"begin":31000,"end":32000}]},"type":"RANGES"}]
I0721 09:21:13.626359  5039 slave.cpp:573] Agent attributes: [  ]
I0721 09:21:13.626579  5039 slave.cpp:582] Agent hostname: d924d694434e
I0721 09:21:13.627123  5041 status_update_manager.cpp:177] Pausing sending status updates
I0721 09:21:13.629443  5044 state.cpp:64] Recovering state from '/tmp/Endpoint_SlaveEndpointTest_UnauthorizedRequest_2_n7kdap/meta'
I0721 09:21:13.630017  5038 status_update_manager.cpp:203] Recovering status update manager
I0721 09:21:13.630440  5043 containerizer.cpp:582] Recovering containerizer
I0721 09:21:13.632452  5043 provisioner.cpp:416] Provisioner recovery complete
I0721 09:21:13.633060  5042 slave.cpp:6207] Finished recovery
I0721 09:21:13.633693  5042 slave.cpp:6389] Querying resource estimator for oversubscribable
resources
I0721 09:21:13.634052  5041 slave.cpp:6403] Received oversubscribable resources {} from the
resource estimator
I0721 09:21:13.638377  5045 process.cpp:3837] Handling HTTP event for process 'slave(795)'
with path: '/slave(795)/containers'
I0721 09:21:13.640399  5043 http.cpp:1133] HTTP GET for /slave(795)/containers from 172.17.0.2:60696
I0721 09:21:13.640524  5043 http.cpp:957] Authorizing principal 'test-principal' to GET the
'/containers' endpoint
I0721 09:21:13.644220  5045 slave.cpp:843] Agent terminating
[       OK ] Endpoint/SlaveEndpointTest.UnauthorizedRequest/2 (45 ms)
[ RUN      ] Endpoint/SlaveEndpointTest.NoAuthorizer/0
I0721 09:21:13.659903  5019 containerizer.cpp:230] Using isolation: posix/cpu,posix/mem,filesystem/posix,network/cni,environment_secret
W0721 09:21:13.660670  5019 backend.cpp:76] Failed to create 'overlay' backend: OverlayBackend
requires root privileges
W0721 09:21:13.660830  5019 backend.cpp:76] Failed to create 'bind' backend: BindBackend requires
root privileges
I0721 09:21:13.660871  5019 provisioner.cpp:255] Using default backend 'copy'
I0721 09:21:13.663208  5019 cluster.cpp:448] Creating default 'local' authorizer
I0721 09:21:13.665879  5045 slave.cpp:250] Mesos agent started on (796)@172.17.0.2:34355
I0721 09:21:13.665918  5045 slave.cpp:251] Flags at startup: --acls="" --appc_simple_discovery_uri_prefix="http://"
--appc_store_dir="/tmp/Endpoint_SlaveEndpointTest_NoAuthorizer_0_Q6Ejs1/store/appc" --authenticate_http_readonly="true"
--authenticate_http_readwrite="true" --authenticatee="crammd5" --authentication_backoff_factor="1secs"
--authorizer="local" --cgroups_cpu_enable_pids_and_tids_count="false" --cgroups_enable_cfs="false"
--cgroups_hierarchy="/sys/fs/cgroup" --cgroups_limit_swap="false" --cgroups_root="mesos" --container_disk_watch_interval="15secs"
--containerizers="mesos" --credential="/tmp/Endpoint_SlaveEndpointTest_NoAuthorizer_0_Q6Ejs1/credential"
--default_role="*" --disk_watch_interval="1mins" --docker="docker" --docker_kill_orphans="true"
--docker_registry="https://registry-1.docker.io" --docker_remove_delay="6hrs" --docker_socket="/var/run/docker.sock"
--docker_stop_timeout="0ns" --docker_store_dir="/tmp/Endpoint_SlaveEndpointTest_NoAuthorizer_0_Q6Ejs1/store/docker"
--docker_volume_checkpoint_dir="/var/run/mesos/isolators/docker/volume" --enforce_container_disk_quota="false"
--executor_registration_timeout="1mins" --executor_reregistration_timeout="2secs" --executor_shutdown_grace_period="5secs"
--fetcher_cache_dir="/tmp/Endpoint_SlaveEndpointTest_NoAuthorizer_0_Q6Ejs1/fetch" --fetcher_cache_size="2GB"
--frameworks_home="" --gc_delay="1weeks" --gc_disk_headroom="0.1" --hadoop_home="" --help="false"
--hostname_lookup="true" --http_command_executor="false" --http_credentials="/tmp/Endpoint_SlaveEndpointTest_NoAuthorizer_0_Q6Ejs1/http_credentials"
--http_heartbeat_interval="30secs" --initialize_driver_logging="true" --isolation="posix/cpu,posix/mem"
--launcher="posix" --launcher_dir="/mesos/mesos-1.4.0/_build/src" --logbufsecs="0" --logging_level="INFO"
--max_completed_executors_per_framework="150" --oversubscribed_resources_interval="15secs"
--perf_duration="10secs" --perf_interval="1mins" --port="5051" --qos_correction_interval_min="0ns"
--quiet="false" --recover="reconnect" --recovery_timeout="15mins" --registration_backoff_factor="10ms"
--resources="cpus:2;gpus:0;mem:1024;disk:1024;ports:[31000-32000]" --revocable_cpu_low_priority="true"
--runtime_dir="/tmp/Endpoint_SlaveEndpointTest_NoAuthorizer_0_Q6Ejs1" --sandbox_directory="/mnt/mesos/sandbox"
--strict="true" --switch_user="true" --systemd_enable_support="true" --systemd_runtime_directory="/run/systemd/system"
--version="false" --work_dir="/tmp/Endpoint_SlaveEndpointTest_NoAuthorizer_0_XbHdLT"
I0721 09:21:13.666637  5045 credentials.hpp:86] Loading credential for authentication from
'/tmp/Endpoint_SlaveEndpointTest_NoAuthorizer_0_Q6Ejs1/credential'
I0721 09:21:13.666880  5045 slave.cpp:283] Agent using credential for: test-principal
I0721 09:21:13.666903  5045 credentials.hpp:37] Loading credentials for authentication from
'/tmp/Endpoint_SlaveEndpointTest_NoAuthorizer_0_Q6Ejs1/http_credentials'
I0721 09:21:13.667243  5045 http.cpp:993] Creating default 'basic' HTTP authenticator for
realm 'mesos-agent-readonly'
I0721 09:21:13.667465  5045 http.cpp:993] Creating default 'basic' HTTP authenticator for
realm 'mesos-agent-readwrite'
I0721 09:21:13.669582  5045 slave.cpp:565] Agent resources: [{"name":"cpus","scalar":{"value":2.0},"type":"SCALAR"},{"name":"mem","scalar":{"value":1024.0},"type":"SCALAR"},{"name":"disk","scalar":{"value":1024.0},"type":"SCALAR"},{"name":"ports","ranges":{"range":[{"begin":31000,"end":32000}]},"type":"RANGES"}]
I0721 09:21:13.670003  5045 slave.cpp:573] Agent attributes: [  ]
I0721 09:21:13.670025  5045 slave.cpp:582] Agent hostname: d924d694434e
I0721 09:21:13.670253  5039 status_update_manager.cpp:177] Pausing sending status updates
I0721 09:21:13.672067  5042 state.cpp:64] Recovering state from '/tmp/Endpoint_SlaveEndpointTest_NoAuthorizer_0_XbHdLT/meta'
I0721 09:21:13.672682  5039 status_update_manager.cpp:203] Recovering status update manager
I0721 09:21:13.672922  5040 containerizer.cpp:582] Recovering containerizer
I0721 09:21:13.675142  5039 provisioner.cpp:416] Provisioner recovery complete
I0721 09:21:13.675657  5043 slave.cpp:6207] Finished recovery
I0721 09:21:13.676288  5043 slave.cpp:6389] Querying resource estimator for oversubscribable
resources
I0721 09:21:13.676599  5039 slave.cpp:6403] Received oversubscribable resources {} from the
resource estimator
I0721 09:21:13.680439  5042 process.cpp:3837] Handling HTTP event for process 'slave(796)'
with path: '/slave(796)/monitor/statistics'
I0721 09:21:13.682296  5039 http.cpp:1133] HTTP GET for /slave(796)/monitor/statistics from
172.17.0.2:60698
I0721 09:21:13.682426  5039 http.cpp:957] Authorizing principal 'test-principal' to GET the
'/monitor/statistics' endpoint
I0721 09:21:13.687466  5019 slave.cpp:843] Agent terminating
[       OK ] Endpoint/SlaveEndpointTest.NoAuthorizer/0 (47 ms)
[ RUN      ] Endpoint/SlaveEndpointTest.NoAuthorizer/1
I0721 09:21:13.707572  5019 containerizer.cpp:230] Using isolation: posix/cpu,posix/mem,filesystem/posix,network/cni,environment_secret
W0721 09:21:13.708320  5019 backend.cpp:76] Failed to create 'overlay' backend: OverlayBackend
requires root privileges
W0721 09:21:13.708515  5019 backend.cpp:76] Failed to create 'bind' backend: BindBackend requires
root privileges
I0721 09:21:13.708556  5019 provisioner.cpp:255] Using default backend 'copy'
I0721 09:21:13.710978  5019 cluster.cpp:448] Creating default 'local' authorizer
I0721 09:21:13.713841  5040 slave.cpp:250] Mesos agent started on (797)@172.17.0.2:34355
I0721 09:21:13.713901  5040 slave.cpp:251] Flags at startup: --acls="" --appc_simple_discovery_uri_prefix="http://"
--appc_store_dir="/tmp/Endpoint_SlaveEndpointTest_NoAuthorizer_1_uVBpEw/store/appc" --authenticate_http_readonly="true"
--authenticate_http_readwrite="true" --authenticatee="crammd5" --authentication_backoff_factor="1secs"
--authorizer="local" --cgroups_cpu_enable_pids_and_tids_count="false" --cgroups_enable_cfs="false"
--cgroups_hierarchy="/sys/fs/cgroup" --cgroups_limit_swap="false" --cgroups_root="mesos" --container_disk_watch_interval="15secs"
--containerizers="mesos" --credential="/tmp/Endpoint_SlaveEndpointTest_NoAuthorizer_1_uVBpEw/credential"
--default_role="*" --disk_watch_interval="1mins" --docker="docker" --docker_kill_orphans="true"
--docker_registry="https://registry-1.docker.io" --docker_remove_delay="6hrs" --docker_socket="/var/run/docker.sock"
--docker_stop_timeout="0ns" --docker_store_dir="/tmp/Endpoint_SlaveEndpointTest_NoAuthorizer_1_uVBpEw/store/docker"
--docker_volume_checkpoint_dir="/var/run/mesos/isolators/docker/volume" --enforce_container_disk_quota="false"
--executor_registration_timeout="1mins" --executor_reregistration_timeout="2secs" --executor_shutdown_grace_period="5secs"
--fetcher_cache_dir="/tmp/Endpoint_SlaveEndpointTest_NoAuthorizer_1_uVBpEw/fetch" --fetcher_cache_size="2GB"
--frameworks_home="" --gc_delay="1weeks" --gc_disk_headroom="0.1" --hadoop_home="" --help="false"
--hostname_lookup="true" --http_command_executor="false" --http_credentials="/tmp/Endpoint_SlaveEndpointTest_NoAuthorizer_1_uVBpEw/http_credentials"
--http_heartbeat_interval="30secs" --initialize_driver_logging="true" --isolation="posix/cpu,posix/mem"
--launcher="posix" --launcher_dir="/mesos/mesos-1.4.0/_build/src" --logbufsecs="0" --logging_level="INFO"
--max_completed_executors_per_framework="150" --oversubscribed_resources_interval="15secs"
--perf_duration="10secs" --perf_interval="1mins" --port="5051" --qos_correction_interval_min="0ns"
--quiet="false" --recover="reconnect" --recovery_timeout="15mins" --registration_backoff_factor="10ms"
--resources="cpus:2;gpus:0;mem:1024;disk:1024;ports:[31000-32000]" --revocable_cpu_low_priority="true"
--runtime_dir="/tmp/Endpoint_SlaveEndpointTest_NoAuthorizer_1_uVBpEw" --sandbox_directory="/mnt/mesos/sandbox"
--strict="true" --switch_user="true" --systemd_enable_support="true" --systemd_runtime_directory="/run/systemd/system"
--version="false" --work_dir="/tmp/Endpoint_SlaveEndpointTest_NoAuthorizer_1_3ktIPo"
I0721 09:21:13.714619  5040 credentials.hpp:86] Loading credential for authentication from
'/tmp/Endpoint_SlaveEndpointTest_NoAuthorizer_1_uVBpEw/credential'
I0721 09:21:13.714877  5040 slave.cpp:283] Agent using credential for: test-principal
I0721 09:21:13.714905  5040 credentials.hpp:37] Loading credentials for authentication from
'/tmp/Endpoint_SlaveEndpointTest_NoAuthorizer_1_uVBpEw/http_credentials'
I0721 09:21:13.715268  5040 http.cpp:993] Creating default 'basic' HTTP authenticator for
realm 'mesos-agent-readonly'
I0721 09:21:13.715488  5040 http.cpp:993] Creating default 'basic' HTTP authenticator for
realm 'mesos-agent-readwrite'
I0721 09:21:13.717634  5040 slave.cpp:565] Agent resources: [{"name":"cpus","scalar":{"value":2.0},"type":"SCALAR"},{"name":"mem","scalar":{"value":1024.0},"type":"SCALAR"},{"name":"disk","scalar":{"value":1024.0},"type":"SCALAR"},{"name":"ports","ranges":{"range":[{"begin":31000,"end":32000}]},"type":"RANGES"}]
I0721 09:21:13.718060  5040 slave.cpp:573] Agent attributes: [  ]
I0721 09:21:13.718081  5040 slave.cpp:582] Agent hostname: d924d694434e
I0721 09:21:13.718382  5044 status_update_manager.cpp:177] Pausing sending status updates
I0721 09:21:13.720149  5043 state.cpp:64] Recovering state from '/tmp/Endpoint_SlaveEndpointTest_NoAuthorizer_1_3ktIPo/meta'
I0721 09:21:13.720682  5045 status_update_manager.cpp:203] Recovering status update manager
I0721 09:21:13.721010  5042 containerizer.cpp:582] Recovering containerizer
I0721 09:21:13.723089  5041 provisioner.cpp:416] Provisioner recovery complete
I0721 09:21:13.723624  5038 slave.cpp:6207] Finished recovery
I0721 09:21:13.724445  5038 slave.cpp:6389] Querying resource estimator for oversubscribable
resources
I0721 09:21:13.724827  5039 slave.cpp:6403] Received oversubscribable resources {} from the
resource estimator
I0721 09:21:13.728242  5040 process.cpp:3837] Handling HTTP event for process 'slave(797)'
with path: '/slave(797)/monitor/statistics.json'
I0721 09:21:13.730053  5042 http.cpp:1133] HTTP GET for /slave(797)/monitor/statistics.json
from 172.17.0.2:60700
I0721 09:21:13.730178  5042 http.cpp:957] Authorizing principal 'test-principal' to GET the
'/monitor/statistics.json' endpoint
I0721 09:21:13.735141  5039 slave.cpp:843] Agent terminating
[       OK ] Endpoint/SlaveEndpointTest.NoAuthorizer/1 (48 ms)
[ RUN      ] Endpoint/SlaveEndpointTest.NoAuthorizer/2
I0721 09:21:13.754950  5019 containerizer.cpp:230] Using isolation: posix/cpu,posix/mem,filesystem/posix,network/cni,environment_secret
W0721 09:21:13.755897  5019 backend.cpp:76] Failed to create 'overlay' backend: OverlayBackend
requires root privileges
W0721 09:21:13.756202  5019 backend.cpp:76] Failed to create 'bind' backend: BindBackend requires
root privileges
I0721 09:21:13.756301  5019 provisioner.cpp:255] Using default backend 'copy'
I0721 09:21:13.758913  5019 cluster.cpp:448] Creating default 'local' authorizer
I0721 09:21:13.761808  5042 slave.cpp:250] Mesos agent started on (798)@172.17.0.2:34355
I0721 09:21:13.761852  5042 slave.cpp:251] Flags at startup: --acls="" --appc_simple_discovery_uri_prefix="http://"
--appc_store_dir="/tmp/Endpoint_SlaveEndpointTest_NoAuthorizer_2_it7Fl2/store/appc" --authenticate_http_readonly="true"
--authenticate_http_readwrite="true" --authenticatee="crammd5" --authentication_backoff_factor="1secs"
--authorizer="local" --cgroups_cpu_enable_pids_and_tids_count="false" --cgroups_enable_cfs="false"
--cgroups_hierarchy="/sys/fs/cgroup" --cgroups_limit_swap="false" --cgroups_root="mesos" --container_disk_watch_interval="15secs"
--containerizers="mesos" --credential="/tmp/Endpoint_SlaveEndpointTest_NoAuthorizer_2_it7Fl2/credential"
--default_role="*" --disk_watch_interval="1mins" --docker="docker" --docker_kill_orphans="true"
--docker_registry="https://registry-1.docker.io" --docker_remove_delay="6hrs" --docker_socket="/var/run/docker.sock"
--docker_stop_timeout="0ns" --docker_store_dir="/tmp/Endpoint_SlaveEndpointTest_NoAuthorizer_2_it7Fl2/store/docker"
--docker_volume_checkpoint_dir="/var/run/mesos/isolators/docker/volume" --enforce_container_disk_quota="false"
--executor_registration_timeout="1mins" --executor_reregistration_timeout="2secs" --executor_shutdown_grace_period="5secs"
--fetcher_cache_dir="/tmp/Endpoint_SlaveEndpointTest_NoAuthorizer_2_it7Fl2/fetch" --fetcher_cache_size="2GB"
--frameworks_home="" --gc_delay="1weeks" --gc_disk_headroom="0.1" --hadoop_home="" --help="false"
--hostname_lookup="true" --http_command_executor="false" --http_credentials="/tmp/Endpoint_SlaveEndpointTest_NoAuthorizer_2_it7Fl2/http_credentials"
--http_heartbeat_interval="30secs" --initialize_driver_logging="true" --isolation="posix/cpu,posix/mem"
--launcher="posix" --launcher_dir="/mesos/mesos-1.4.0/_build/src" --logbufsecs="0" --logging_level="INFO"
--max_completed_executors_per_framework="150" --oversubscribed_resources_interval="15secs"
--perf_duration="10secs" --perf_interval="1mins" --port="5051" --qos_correction_interval_min="0ns"
--quiet="false" --recover="reconnect" --recovery_timeout="15mins" --registration_backoff_factor="10ms"
--resources="cpus:2;gpus:0;mem:1024;disk:1024;ports:[31000-32000]" --revocable_cpu_low_priority="true"
--runtime_dir="/tmp/Endpoint_SlaveEndpointTest_NoAuthorizer_2_it7Fl2" --sandbox_directory="/mnt/mesos/sandbox"
--strict="true" --switch_user="true" --systemd_enable_support="true" --systemd_runtime_directory="/run/systemd/system"
--version="false" --work_dir="/tmp/Endpoint_SlaveEndpointTest_NoAuthorizer_2_HlmbpU"
I0721 09:21:13.762588  5042 credentials.hpp:86] Loading credential for authentication from
'/tmp/Endpoint_SlaveEndpointTest_NoAuthorizer_2_it7Fl2/credential'
I0721 09:21:13.762843  5042 slave.cpp:283] Agent using credential for: test-principal
I0721 09:21:13.762867  5042 credentials.hpp:37] Loading credentials for authentication from
'/tmp/Endpoint_SlaveEndpointTest_NoAuthorizer_2_it7Fl2/http_credentials'
I0721 09:21:13.763243  5042 http.cpp:993] Creating default 'basic' HTTP authenticator for
realm 'mesos-agent-readonly'
I0721 09:21:13.763604  5042 http.cpp:993] Creating default 'basic' HTTP authenticator for
realm 'mesos-agent-readwrite'
I0721 09:21:13.765827  5042 slave.cpp:565] Agent resources: [{"name":"cpus","scalar":{"value":2.0},"type":"SCALAR"},{"name":"mem","scalar":{"value":1024.0},"type":"SCALAR"},{"name":"disk","scalar":{"value":1024.0},"type":"SCALAR"},{"name":"ports","ranges":{"range":[{"begin":31000,"end":32000}]},"type":"RANGES"}]
I0721 09:21:13.766254  5042 slave.cpp:573] Agent attributes: [  ]
I0721 09:21:13.766276  5042 slave.cpp:582] Agent hostname: d924d694434e
I0721 09:21:13.766646  5038 status_update_manager.cpp:177] Pausing sending status updates
I0721 09:21:13.768772  5041 state.cpp:64] Recovering state from '/tmp/Endpoint_SlaveEndpointTest_NoAuthorizer_2_HlmbpU/meta'
I0721 09:21:13.769322  5043 status_update_manager.cpp:203] Recovering status update manager
I0721 09:21:13.769681  5040 containerizer.cpp:582] Recovering containerizer
I0721 09:21:13.771941  5041 provisioner.cpp:416] Provisioner recovery complete
I0721 09:21:13.772415  5039 slave.cpp:6207] Finished recovery
I0721 09:21:13.773064  5039 slave.cpp:6389] Querying resource estimator for oversubscribable
resources
I0721 09:21:13.773455  5045 slave.cpp:6403] Received oversubscribable resources {} from the
resource estimator
I0721 09:21:13.777474  5041 process.cpp:3837] Handling HTTP event for process 'slave(798)'
with path: '/slave(798)/containers'
I0721 09:21:13.779691  5045 http.cpp:1133] HTTP GET for /slave(798)/containers from 172.17.0.2:60702
I0721 09:21:13.779822  5045 http.cpp:957] Authorizing principal 'test-principal' to GET the
'/containers' endpoint
I0721 09:21:13.785902  5041 slave.cpp:843] Agent terminating
[       OK ] Endpoint/SlaveEndpointTest.NoAuthorizer/2 (47 ms)
[----------] 9 tests from Endpoint/SlaveEndpointTest (422 ms total)

[----------] Global test environment tear-down
[==========] 1637 tests from 179 test cases ran. (756033 ms total)
[  PASSED  ] 1633 tests.
[  FAILED  ] 4 tests, listed below:
[  FAILED  ] DefaultExecutorCheckTest.CommandCheckDeliveredAndReconciled
[  FAILED  ] DefaultExecutorCheckTest.CommandCheckStatusChange
[  FAILED  ] DefaultExecutorCheckTest.CommandCheckSeesParentsEnv
[  FAILED  ] DefaultExecutorCheckTest.CommandCheckSharesWorkDirWithTask

 4 FAILED TESTS
  YOU HAVE 20 DISABLED TESTS

I0721 09:21:13.927624  5046 process.cpp:1006] Failed to accept socket: future discarded
make[4]: *** [check-local] Error 1
make[4]: Leaving directory `/mesos/mesos-1.4.0/_build/src'
make[3]: *** [check-am] Error 2
make[3]: Leaving directory `/mesos/mesos-1.4.0/_build/src'
make[2]: *** [check] Error 2
make[2]: Leaving directory `/mesos/mesos-1.4.0/_build/src'
make[1]: *** [check-recursive] Error 1
make[1]: Leaving directory `/mesos/mesos-1.4.0/_build'
make: *** [distcheck] Error 1
+ docker rmi mesos-1500623072-15061
Untagged: mesos-1500623072-15061:latest
Deleted: sha256:be59696eadc90d50a7c7879e7aec1c93cbfa4a088bb7f2e854b59e9842c10d7c
Deleted: sha256:ded76e7820313c58693b123d6f98edfe7074aaa64eead6397c477dcfd60e29c6
Deleted: sha256:0215684351429c62e5672f9b4e22ae64b734b0080c39865742bbd7731fc86cac
Deleted: sha256:cacd63ce01587e3c59dbaf4b13e0dc3642f57b5259e44455fe0faa71888eb730
Deleted: sha256:e8adcf29013ec47423803422e430c42c68827173dd321ab512972a242ca7b785
Deleted: sha256:57ab93c18532e4733c01c40048aebe7d1d82414db91d582566b73f03fa540a10
Deleted: sha256:f02a6fd9461afce006b5b939ea367608ab78bfcd8528f4eab49229198f52e88d
Deleted: sha256:5f2e88e7b37ffce4bba509bfc9bec6cb10da5c9882c4c818d1b068d2086e9a37
Deleted: sha256:ab81c074ee84df0c5c28888766153a7d547a2b5444d18ee37a4b62eb14db418d
Deleted: sha256:c3faaf6d82cac7841e434df9e060f3e5f43884ab80498586fdc1ec553afe7cc1
Deleted: sha256:7b461725a8851704657955f9b54a7f83b943d1e957e9a742cdb408c9ada65f74
Deleted: sha256:013cf03852c30499311cda9c55d8b50769f7fd1535cf81c944609e251b5f2ef2
Deleted: sha256:31f5db174306e302fb9a4fdca3fbac9169ddefd06120b3df2c4ceef55966a05d
Deleted: sha256:4df8ea1e1ba5ec20976226465d4cf42a390b98578bd888e43d28178aa57bf175
Deleted: sha256:eb3726d77d2538bcb692931ad116944aba1280223bdff7a85146d75f3ef0d4e0
Deleted: sha256:f12e7e1263a0b93f9eaa678f20ccd66c559157b2aeba9c81b2c1f72de9cea639
Deleted: sha256:473bfc96be33b3b7ecf7cbfe84d52d189802f46e84844108bbfd71ebf3f7c476
Deleted: sha256:8f4c38804ee49c1649596392a449b6c09f7a96a6249940b878498a9235fdabc6
Deleted: sha256:fd808c9bfc60f83c79dabbdaa0fa90062feea8c63dc7167836518da90fb82d24
Deleted: sha256:47358719b01d04d691b9ab2c55b8792c49d2575575eea054e14afe945c563b3c
Deleted: sha256:4bc8d1e9293e3e35da07cdd297344e1dfceda336c69e39b0dc0903229308a637
Deleted: sha256:1256fc189d9449e6015eb0e1b9a635a864e3e9d749128f04cafafb0a24cbc705
Deleted: sha256:74b0b663ca1d9a0dd6b16e8923b50591f7348b562cbe77d5f3fc0e18f128256d
Deleted: sha256:0e955cee994ba0a798a53575674ba6250de4b0a0799b014e55a1a4ef5a495403
Build step 'Execute shell' marked build as failure

Mime
View raw message