mesos-builds mailing list archives

Site index · List index
Message view « Date » · « Thread »
Top « Date » · « Thread »
From Apache Jenkins Server <jenk...@builds.apache.org>
Subject Build failed in Jenkins: Mesos-Reviewbot #18609
Date Thu, 27 Jul 2017 02:48:13 GMT
See <https://builds.apache.org/job/Mesos-Reviewbot/18609/display/redirect?page=changes>

Changes:

[yujie.jay] Added evolve functions for resource provider Event/Call.

[yujie.jay] Added validation functions for resource provider calls.

[yujie.jay] Implemented the 'SUBSCRIBE' call in the resource provider manager.

------------------------------------------
[...truncated 30.56 MB...]
I0727 02:48:04.006063  5100 containerizer.cpp:230] Using isolation: posix/cpu,posix/mem,filesystem/posix,network/cni,environment_secret
W0727 02:48:04.007015  5100 backend.cpp:76] Failed to create 'overlay' backend: OverlayBackend
requires root privileges
W0727 02:48:04.007202  5100 backend.cpp:76] Failed to create 'bind' backend: BindBackend requires
root privileges
I0727 02:48:04.007248  5100 provisioner.cpp:255] Using default backend 'copy'
I0727 02:48:04.013110  5124 slave.cpp:250] Mesos agent started on (796)@172.17.0.3:40769
I0727 02:48:04.013154  5124 slave.cpp:251] Flags at startup: --acls="" --appc_simple_discovery_uri_prefix="http://"
--appc_store_dir="/tmp/Endpoint_SlaveEndpointTest_AuthorizedRequest_2_sXUhYz/store/appc" --authenticate_http_readonly="true"
--authenticate_http_readwrite="true" --authenticatee="crammd5" --authentication_backoff_factor="1secs"
--authorizer="local" --cgroups_cpu_enable_pids_and_tids_count="false" --cgroups_enable_cfs="false"
--cgroups_hierarchy="/sys/fs/cgroup" --cgroups_limit_swap="false" --cgroups_root="mesos" --container_disk_watch_interval="15secs"
--containerizers="mesos" --credential="/tmp/Endpoint_SlaveEndpointTest_AuthorizedRequest_2_sXUhYz/credential"
--default_role="*" --disk_watch_interval="1mins" --docker="docker" --docker_kill_orphans="true"
--docker_registry="https://registry-1.docker.io" --docker_remove_delay="6hrs" --docker_socket="/var/run/docker.sock"
--docker_stop_timeout="0ns" --docker_store_dir="/tmp/Endpoint_SlaveEndpointTest_AuthorizedRequest_2_sXUhYz/store/docker"
--docker_volume_checkpoint_dir="/var/run/mesos/isolators/docker/volume" --enforce_container_disk_quota="false"
--executor_registration_timeout="1mins" --executor_reregistration_timeout="2secs" --executor_shutdown_grace_period="5secs"
--fetcher_cache_dir="/tmp/Endpoint_SlaveEndpointTest_AuthorizedRequest_2_sXUhYz/fetch" --fetcher_cache_size="2GB"
--frameworks_home="" --gc_delay="1weeks" --gc_disk_headroom="0.1" --hadoop_home="" --help="false"
--hostname_lookup="true" --http_command_executor="false" --http_credentials="/tmp/Endpoint_SlaveEndpointTest_AuthorizedRequest_2_sXUhYz/http_credentials"
--http_heartbeat_interval="30secs" --initialize_driver_logging="true" --isolation="posix/cpu,posix/mem"
--launcher="posix" --launcher_dir="/mesos/mesos-1.4.0/_build/src" --logbufsecs="0" --logging_level="INFO"
--max_completed_executors_per_framework="150" --oversubscribed_resources_interval="15secs"
--perf_duration="10secs" --perf_interval="1mins" --port="5051" --qos_correction_interval_min="0ns"
--quiet="false" --recover="reconnect" --recovery_timeout="15mins" --registration_backoff_factor="10ms"
--resources="cpus:2;gpus:0;mem:1024;disk:1024;ports:[31000-32000]" --revocable_cpu_low_priority="true"
--runtime_dir="/tmp/Endpoint_SlaveEndpointTest_AuthorizedRequest_2_sXUhYz" --sandbox_directory="/mnt/mesos/sandbox"
--strict="true" --switch_user="true" --systemd_enable_support="true" --systemd_runtime_directory="/run/systemd/system"
--version="false" --work_dir="/tmp/Endpoint_SlaveEndpointTest_AuthorizedRequest_2_E7vtLK"
I0727 02:48:04.014276  5124 credentials.hpp:86] Loading credential for authentication from
'/tmp/Endpoint_SlaveEndpointTest_AuthorizedRequest_2_sXUhYz/credential'
I0727 02:48:04.014845  5124 slave.cpp:283] Agent using credential for: test-principal
I0727 02:48:04.014888  5124 credentials.hpp:37] Loading credentials for authentication from
'/tmp/Endpoint_SlaveEndpointTest_AuthorizedRequest_2_sXUhYz/http_credentials'
I0727 02:48:04.015532  5124 http.cpp:993] Creating default 'basic' HTTP authenticator for
realm 'mesos-agent-readonly'
I0727 02:48:04.016041  5124 http.cpp:993] Creating default 'basic' HTTP authenticator for
realm 'mesos-agent-readwrite'
I0727 02:48:04.018616  5124 slave.cpp:565] Agent resources: [{"name":"cpus","scalar":{"value":2.0},"type":"SCALAR"},{"name":"mem","scalar":{"value":1024.0},"type":"SCALAR"},{"name":"disk","scalar":{"value":1024.0},"type":"SCALAR"},{"name":"ports","ranges":{"range":[{"begin":31000,"end":32000}]},"type":"RANGES"}]
I0727 02:48:04.019054  5124 slave.cpp:573] Agent attributes: [  ]
I0727 02:48:04.019075  5124 slave.cpp:582] Agent hostname: 7948599c8522
I0727 02:48:04.020558  5126 status_update_manager.cpp:177] Pausing sending status updates
I0727 02:48:04.023269  5120 state.cpp:64] Recovering state from '/tmp/Endpoint_SlaveEndpointTest_AuthorizedRequest_2_E7vtLK/meta'
I0727 02:48:04.024021  5121 status_update_manager.cpp:203] Recovering status update manager
I0727 02:48:04.024577  5125 containerizer.cpp:582] Recovering containerizer
I0727 02:48:04.027055  5126 provisioner.cpp:416] Provisioner recovery complete
I0727 02:48:04.027842  5126 slave.cpp:6207] Finished recovery
I0727 02:48:04.028472  5126 slave.cpp:6389] Querying resource estimator for oversubscribable
resources
I0727 02:48:04.029134  5125 slave.cpp:6403] Received oversubscribable resources {} from the
resource estimator
I0727 02:48:04.035396  5119 process.cpp:3837] Handling HTTP event for process 'slave(796)'
with path: '/slave(796)/containers'
I0727 02:48:04.037818  5122 http.cpp:1133] HTTP GET for /slave(796)/containers from 172.17.0.3:35178
I0727 02:48:04.037951  5122 http.cpp:957] Authorizing principal 'test-principal' to GET the
'/containers' endpoint
I0727 02:48:04.054934  5119 slave.cpp:843] Agent terminating
[       OK ] Endpoint/SlaveEndpointTest.AuthorizedRequest/2 (101 ms)
[ RUN      ] Endpoint/SlaveEndpointTest.UnauthorizedRequest/0
I0727 02:48:04.106992  5100 containerizer.cpp:230] Using isolation: posix/cpu,posix/mem,filesystem/posix,network/cni,environment_secret
W0727 02:48:04.108165  5100 backend.cpp:76] Failed to create 'overlay' backend: OverlayBackend
requires root privileges
W0727 02:48:04.108628  5100 backend.cpp:76] Failed to create 'bind' backend: BindBackend requires
root privileges
I0727 02:48:04.108690  5100 provisioner.cpp:255] Using default backend 'copy'
I0727 02:48:04.114117  5121 slave.cpp:250] Mesos agent started on (797)@172.17.0.3:40769
I0727 02:48:04.114161  5121 slave.cpp:251] Flags at startup: --acls="" --appc_simple_discovery_uri_prefix="http://"
--appc_store_dir="/tmp/Endpoint_SlaveEndpointTest_UnauthorizedRequest_0_kJbtET/store/appc"
--authenticate_http_readonly="true" --authenticate_http_readwrite="true" --authenticatee="crammd5"
--authentication_backoff_factor="1secs" --authorizer="local" --cgroups_cpu_enable_pids_and_tids_count="false"
--cgroups_enable_cfs="false" --cgroups_hierarchy="/sys/fs/cgroup" --cgroups_limit_swap="false"
--cgroups_root="mesos" --container_disk_watch_interval="15secs" --containerizers="mesos" --credential="/tmp/Endpoint_SlaveEndpointTest_UnauthorizedRequest_0_kJbtET/credential"
--default_role="*" --disk_watch_interval="1mins" --docker="docker" --docker_kill_orphans="true"
--docker_registry="https://registry-1.docker.io" --docker_remove_delay="6hrs" --docker_socket="/var/run/docker.sock"
--docker_stop_timeout="0ns" --docker_store_dir="/tmp/Endpoint_SlaveEndpointTest_UnauthorizedRequest_0_kJbtET/store/docker"
--docker_volume_checkpoint_dir="/var/run/mesos/isolators/docker/volume" --enforce_container_disk_quota="false"
--executor_registration_timeout="1mins" --executor_reregistration_timeout="2secs" --executor_shutdown_grace_period="5secs"
--fetcher_cache_dir="/tmp/Endpoint_SlaveEndpointTest_UnauthorizedRequest_0_kJbtET/fetch" --fetcher_cache_size="2GB"
--frameworks_home="" --gc_delay="1weeks" --gc_disk_headroom="0.1" --hadoop_home="" --help="false"
--hostname_lookup="true" --http_command_executor="false" --http_credentials="/tmp/Endpoint_SlaveEndpointTest_UnauthorizedRequest_0_kJbtET/http_credentials"
--http_heartbeat_interval="30secs" --initialize_driver_logging="true" --isolation="posix/cpu,posix/mem"
--launcher="posix" --launcher_dir="/mesos/mesos-1.4.0/_build/src" --logbufsecs="0" --logging_level="INFO"
--max_completed_executors_per_framework="150" --oversubscribed_resources_interval="15secs"
--perf_duration="10secs" --perf_interval="1mins" --port="5051" --qos_correction_interval_min="0ns"
--quiet="false" --recover="reconnect" --recovery_timeout="15mins" --registration_backoff_factor="10ms"
--resources="cpus:2;gpus:0;mem:1024;disk:1024;ports:[31000-32000]" --revocable_cpu_low_priority="true"
--runtime_dir="/tmp/Endpoint_SlaveEndpointTest_UnauthorizedRequest_0_kJbtET" --sandbox_directory="/mnt/mesos/sandbox"
--strict="true" --switch_user="true" --systemd_enable_support="true" --systemd_runtime_directory="/run/systemd/system"
--version="false" --work_dir="/tmp/Endpoint_SlaveEndpointTest_UnauthorizedRequest_0_8W8gb4"
I0727 02:48:04.115051  5121 credentials.hpp:86] Loading credential for authentication from
'/tmp/Endpoint_SlaveEndpointTest_UnauthorizedRequest_0_kJbtET/credential'
I0727 02:48:04.115337  5121 slave.cpp:283] Agent using credential for: test-principal
I0727 02:48:04.115370  5121 credentials.hpp:37] Loading credentials for authentication from
'/tmp/Endpoint_SlaveEndpointTest_UnauthorizedRequest_0_kJbtET/http_credentials'
I0727 02:48:04.116248  5121 http.cpp:993] Creating default 'basic' HTTP authenticator for
realm 'mesos-agent-readonly'
I0727 02:48:04.116503  5121 http.cpp:993] Creating default 'basic' HTTP authenticator for
realm 'mesos-agent-readwrite'
I0727 02:48:04.118934  5121 slave.cpp:565] Agent resources: [{"name":"cpus","scalar":{"value":2.0},"type":"SCALAR"},{"name":"mem","scalar":{"value":1024.0},"type":"SCALAR"},{"name":"disk","scalar":{"value":1024.0},"type":"SCALAR"},{"name":"ports","ranges":{"range":[{"begin":31000,"end":32000}]},"type":"RANGES"}]
I0727 02:48:04.119371  5121 slave.cpp:573] Agent attributes: [  ]
I0727 02:48:04.119391  5121 slave.cpp:582] Agent hostname: 7948599c8522
I0727 02:48:04.119910  5124 status_update_manager.cpp:177] Pausing sending status updates
I0727 02:48:04.123703  5121 state.cpp:64] Recovering state from '/tmp/Endpoint_SlaveEndpointTest_UnauthorizedRequest_0_8W8gb4/meta'
I0727 02:48:04.124295  5122 status_update_manager.cpp:203] Recovering status update manager
I0727 02:48:04.124932  5122 containerizer.cpp:582] Recovering containerizer
I0727 02:48:04.127516  5124 provisioner.cpp:416] Provisioner recovery complete
I0727 02:48:04.128365  5123 slave.cpp:6207] Finished recovery
I0727 02:48:04.129365  5123 slave.cpp:6389] Querying resource estimator for oversubscribable
resources
I0727 02:48:04.129732  5123 slave.cpp:6403] Received oversubscribable resources {} from the
resource estimator
I0727 02:48:04.140991  5124 process.cpp:3837] Handling HTTP event for process 'slave(797)'
with path: '/slave(797)/monitor/statistics'
I0727 02:48:04.143715  5122 http.cpp:1133] HTTP GET for /slave(797)/monitor/statistics from
172.17.0.3:35180
I0727 02:48:04.143875  5122 http.cpp:957] Authorizing principal 'test-principal' to GET the
'/monitor/statistics' endpoint
I0727 02:48:04.155906  5122 slave.cpp:843] Agent terminating
[       OK ] Endpoint/SlaveEndpointTest.UnauthorizedRequest/0 (100 ms)
[ RUN      ] Endpoint/SlaveEndpointTest.UnauthorizedRequest/1
I0727 02:48:04.207989  5100 containerizer.cpp:230] Using isolation: posix/cpu,posix/mem,filesystem/posix,network/cni,environment_secret
W0727 02:48:04.209117  5100 backend.cpp:76] Failed to create 'overlay' backend: OverlayBackend
requires root privileges
W0727 02:48:04.209332  5100 backend.cpp:76] Failed to create 'bind' backend: BindBackend requires
root privileges
I0727 02:48:04.209735  5100 provisioner.cpp:255] Using default backend 'copy'
I0727 02:48:04.216336  5120 slave.cpp:250] Mesos agent started on (798)@172.17.0.3:40769
I0727 02:48:04.216382  5120 slave.cpp:251] Flags at startup: --acls="" --appc_simple_discovery_uri_prefix="http://"
--appc_store_dir="/tmp/Endpoint_SlaveEndpointTest_UnauthorizedRequest_1_ctrLne/store/appc"
--authenticate_http_readonly="true" --authenticate_http_readwrite="true" --authenticatee="crammd5"
--authentication_backoff_factor="1secs" --authorizer="local" --cgroups_cpu_enable_pids_and_tids_count="false"
--cgroups_enable_cfs="false" --cgroups_hierarchy="/sys/fs/cgroup" --cgroups_limit_swap="false"
--cgroups_root="mesos" --container_disk_watch_interval="15secs" --containerizers="mesos" --credential="/tmp/Endpoint_SlaveEndpointTest_UnauthorizedRequest_1_ctrLne/credential"
--default_role="*" --disk_watch_interval="1mins" --docker="docker" --docker_kill_orphans="true"
--docker_registry="https://registry-1.docker.io" --docker_remove_delay="6hrs" --docker_socket="/var/run/docker.sock"
--docker_stop_timeout="0ns" --docker_store_dir="/tmp/Endpoint_SlaveEndpointTest_UnauthorizedRequest_1_ctrLne/store/docker"
--docker_volume_checkpoint_dir="/var/run/mesos/isolators/docker/volume" --enforce_container_disk_quota="false"
--executor_registration_timeout="1mins" --executor_reregistration_timeout="2secs" --executor_shutdown_grace_period="5secs"
--fetcher_cache_dir="/tmp/Endpoint_SlaveEndpointTest_UnauthorizedRequest_1_ctrLne/fetch" --fetcher_cache_size="2GB"
--frameworks_home="" --gc_delay="1weeks" --gc_disk_headroom="0.1" --hadoop_home="" --help="false"
--hostname_lookup="true" --http_command_executor="false" --http_credentials="/tmp/Endpoint_SlaveEndpointTest_UnauthorizedRequest_1_ctrLne/http_credentials"
--http_heartbeat_interval="30secs" --initialize_driver_logging="true" --isolation="posix/cpu,posix/mem"
--launcher="posix" --launcher_dir="/mesos/mesos-1.4.0/_build/src" --logbufsecs="0" --logging_level="INFO"
--max_completed_executors_per_framework="150" --oversubscribed_resources_interval="15secs"
--perf_duration="10secs" --perf_interval="1mins" --port="5051" --qos_correction_interval_min="0ns"
--quiet="false" --recover="reconnect" --recovery_timeout="15mins" --registration_backoff_factor="10ms"
--resources="cpus:2;gpus:0;mem:1024;disk:1024;ports:[31000-32000]" --revocable_cpu_low_priority="true"
--runtime_dir="/tmp/Endpoint_SlaveEndpointTest_UnauthorizedRequest_1_ctrLne" --sandbox_directory="/mnt/mesos/sandbox"
--strict="true" --switch_user="true" --systemd_enable_support="true" --systemd_runtime_directory="/run/systemd/system"
--version="false" --work_dir="/tmp/Endpoint_SlaveEndpointTest_UnauthorizedRequest_1_CmShEo"
I0727 02:48:04.217128  5120 credentials.hpp:86] Loading credential for authentication from
'/tmp/Endpoint_SlaveEndpointTest_UnauthorizedRequest_1_ctrLne/credential'
I0727 02:48:04.217417  5120 slave.cpp:283] Agent using credential for: test-principal
I0727 02:48:04.217454  5120 credentials.hpp:37] Loading credentials for authentication from
'/tmp/Endpoint_SlaveEndpointTest_UnauthorizedRequest_1_ctrLne/http_credentials'
I0727 02:48:04.217905  5120 http.cpp:993] Creating default 'basic' HTTP authenticator for
realm 'mesos-agent-readonly'
I0727 02:48:04.218178  5120 http.cpp:993] Creating default 'basic' HTTP authenticator for
realm 'mesos-agent-readwrite'
I0727 02:48:04.220826  5120 slave.cpp:565] Agent resources: [{"name":"cpus","scalar":{"value":2.0},"type":"SCALAR"},{"name":"mem","scalar":{"value":1024.0},"type":"SCALAR"},{"name":"disk","scalar":{"value":1024.0},"type":"SCALAR"},{"name":"ports","ranges":{"range":[{"begin":31000,"end":32000}]},"type":"RANGES"}]
I0727 02:48:04.221271  5120 slave.cpp:573] Agent attributes: [  ]
I0727 02:48:04.221292  5120 slave.cpp:582] Agent hostname: 7948599c8522
I0727 02:48:04.221848  5123 status_update_manager.cpp:177] Pausing sending status updates
I0727 02:48:04.224046  5124 state.cpp:64] Recovering state from '/tmp/Endpoint_SlaveEndpointTest_UnauthorizedRequest_1_CmShEo/meta'
I0727 02:48:04.225178  5124 status_update_manager.cpp:203] Recovering status update manager
I0727 02:48:04.225852  5121 containerizer.cpp:582] Recovering containerizer
I0727 02:48:04.228142  5125 provisioner.cpp:416] Provisioner recovery complete
I0727 02:48:04.229007  5125 slave.cpp:6207] Finished recovery
I0727 02:48:04.229679  5125 slave.cpp:6389] Querying resource estimator for oversubscribable
resources
I0727 02:48:04.230466  5119 slave.cpp:6403] Received oversubscribable resources {} from the
resource estimator
I0727 02:48:04.235885  5126 process.cpp:3837] Handling HTTP event for process 'slave(798)'
with path: '/slave(798)/monitor/statistics.json'
I0727 02:48:04.238348  5121 http.cpp:1133] HTTP GET for /slave(798)/monitor/statistics.json
from 172.17.0.3:35182
I0727 02:48:04.238476  5121 http.cpp:957] Authorizing principal 'test-principal' to GET the
'/monitor/statistics.json' endpoint
I0727 02:48:04.251204  5100 slave.cpp:843] Agent terminating
[       OK ] Endpoint/SlaveEndpointTest.UnauthorizedRequest/1 (101 ms)
[ RUN      ] Endpoint/SlaveEndpointTest.UnauthorizedRequest/2
I0727 02:48:04.309423  5100 containerizer.cpp:230] Using isolation: posix/cpu,posix/mem,filesystem/posix,network/cni,environment_secret
W0727 02:48:04.310647  5100 backend.cpp:76] Failed to create 'overlay' backend: OverlayBackend
requires root privileges
W0727 02:48:04.311199  5100 backend.cpp:76] Failed to create 'bind' backend: BindBackend requires
root privileges
I0727 02:48:04.311265  5100 provisioner.cpp:255] Using default backend 'copy'
I0727 02:48:04.317064  5122 slave.cpp:250] Mesos agent started on (799)@172.17.0.3:40769
I0727 02:48:04.317109  5122 slave.cpp:251] Flags at startup: --acls="" --appc_simple_discovery_uri_prefix="http://"
--appc_store_dir="/tmp/Endpoint_SlaveEndpointTest_UnauthorizedRequest_2_2NyKaA/store/appc"
--authenticate_http_readonly="true" --authenticate_http_readwrite="true" --authenticatee="crammd5"
--authentication_backoff_factor="1secs" --authorizer="local" --cgroups_cpu_enable_pids_and_tids_count="false"
--cgroups_enable_cfs="false" --cgroups_hierarchy="/sys/fs/cgroup" --cgroups_limit_swap="false"
--cgroups_root="mesos" --container_disk_watch_interval="15secs" --containerizers="mesos" --credential="/tmp/Endpoint_SlaveEndpointTest_UnauthorizedRequest_2_2NyKaA/credential"
--default_role="*" --disk_watch_interval="1mins" --docker="docker" --docker_kill_orphans="true"
--docker_registry="https://registry-1.docker.io" --docker_remove_delay="6hrs" --docker_socket="/var/run/docker.sock"
--docker_stop_timeout="0ns" --docker_store_dir="/tmp/Endpoint_SlaveEndpointTest_UnauthorizedRequest_2_2NyKaA/store/docker"
--docker_volume_checkpoint_dir="/var/run/mesos/isolators/docker/volume" --enforce_container_disk_quota="false"
--executor_registration_timeout="1mins" --executor_reregistration_timeout="2secs" --executor_shutdown_grace_period="5secs"
--fetcher_cache_dir="/tmp/Endpoint_SlaveEndpointTest_UnauthorizedRequest_2_2NyKaA/fetch" --fetcher_cache_size="2GB"
--frameworks_home="" --gc_delay="1weeks" --gc_disk_headroom="0.1" --hadoop_home="" --help="false"
--hostname_lookup="true" --http_command_executor="false" --http_credentials="/tmp/Endpoint_SlaveEndpointTest_UnauthorizedRequest_2_2NyKaA/http_credentials"
--http_heartbeat_interval="30secs" --initialize_driver_logging="true" --isolation="posix/cpu,posix/mem"
--launcher="posix" --launcher_dir="/mesos/mesos-1.4.0/_build/src" --logbufsecs="0" --logging_level="INFO"
--max_completed_executors_per_framework="150" --oversubscribed_resources_interval="15secs"
--perf_duration="10secs" --perf_interval="1mins" --port="5051" --qos_correction_interval_min="0ns"
--quiet="false" --recover="reconnect" --recovery_timeout="15mins" --registration_backoff_factor="10ms"
--resources="cpus:2;gpus:0;mem:1024;disk:1024;ports:[31000-32000]" --revocable_cpu_low_priority="true"
--runtime_dir="/tmp/Endpoint_SlaveEndpointTest_UnauthorizedRequest_2_2NyKaA" --sandbox_directory="/mnt/mesos/sandbox"
--strict="true" --switch_user="true" --systemd_enable_support="true" --systemd_runtime_directory="/run/systemd/system"
--version="false" --work_dir="/tmp/Endpoint_SlaveEndpointTest_UnauthorizedRequest_2_OqZNaK"
I0727 02:48:04.317849  5122 credentials.hpp:86] Loading credential for authentication from
'/tmp/Endpoint_SlaveEndpointTest_UnauthorizedRequest_2_2NyKaA/credential'
I0727 02:48:04.318136  5122 slave.cpp:283] Agent using credential for: test-principal
I0727 02:48:04.318173  5122 credentials.hpp:37] Loading credentials for authentication from
'/tmp/Endpoint_SlaveEndpointTest_UnauthorizedRequest_2_2NyKaA/http_credentials'
I0727 02:48:04.318632  5122 http.cpp:993] Creating default 'basic' HTTP authenticator for
realm 'mesos-agent-readonly'
I0727 02:48:04.319243  5122 http.cpp:993] Creating default 'basic' HTTP authenticator for
realm 'mesos-agent-readwrite'
I0727 02:48:04.321947  5122 slave.cpp:565] Agent resources: [{"name":"cpus","scalar":{"value":2.0},"type":"SCALAR"},{"name":"mem","scalar":{"value":1024.0},"type":"SCALAR"},{"name":"disk","scalar":{"value":1024.0},"type":"SCALAR"},{"name":"ports","ranges":{"range":[{"begin":31000,"end":32000}]},"type":"RANGES"}]
I0727 02:48:04.322389  5122 slave.cpp:573] Agent attributes: [  ]
I0727 02:48:04.322410  5122 slave.cpp:582] Agent hostname: 7948599c8522
I0727 02:48:04.324836  5120 status_update_manager.cpp:177] Pausing sending status updates
I0727 02:48:04.325537  5124 state.cpp:64] Recovering state from '/tmp/Endpoint_SlaveEndpointTest_UnauthorizedRequest_2_OqZNaK/meta'
I0727 02:48:04.326589  5120 status_update_manager.cpp:203] Recovering status update manager
I0727 02:48:04.326825  5125 containerizer.cpp:582] Recovering containerizer
I0727 02:48:04.329217  5124 provisioner.cpp:416] Provisioner recovery complete
I0727 02:48:04.330185  5124 slave.cpp:6207] Finished recovery
I0727 02:48:04.331105  5124 slave.cpp:6389] Querying resource estimator for oversubscribable
resources
I0727 02:48:04.331904  5123 slave.cpp:6403] Received oversubscribable resources {} from the
resource estimator
I0727 02:48:04.338122  5124 process.cpp:3837] Handling HTTP event for process 'slave(799)'
with path: '/slave(799)/containers'
I0727 02:48:04.340378  5122 http.cpp:1133] HTTP GET for /slave(799)/containers from 172.17.0.3:35184
I0727 02:48:04.340519  5122 http.cpp:957] Authorizing principal 'test-principal' to GET the
'/containers' endpoint
I0727 02:48:04.345286  5119 slave.cpp:843] Agent terminating
[       OK ] Endpoint/SlaveEndpointTest.UnauthorizedRequest/2 (76 ms)
[ RUN      ] Endpoint/SlaveEndpointTest.NoAuthorizer/0
I0727 02:48:04.385529  5100 containerizer.cpp:230] Using isolation: posix/cpu,posix/mem,filesystem/posix,network/cni,environment_secret
W0727 02:48:04.386499  5100 backend.cpp:76] Failed to create 'overlay' backend: OverlayBackend
requires root privileges
W0727 02:48:04.386854  5100 backend.cpp:76] Failed to create 'bind' backend: BindBackend requires
root privileges
I0727 02:48:04.386986  5100 provisioner.cpp:255] Using default backend 'copy'
I0727 02:48:04.389816  5100 cluster.cpp:448] Creating default 'local' authorizer
I0727 02:48:04.394381  5123 slave.cpp:250] Mesos agent started on (800)@172.17.0.3:40769
I0727 02:48:04.394426  5123 slave.cpp:251] Flags at startup: --acls="" --appc_simple_discovery_uri_prefix="http://"
--appc_store_dir="/tmp/Endpoint_SlaveEndpointTest_NoAuthorizer_0_eI48OW/store/appc" --authenticate_http_readonly="true"
--authenticate_http_readwrite="true" --authenticatee="crammd5" --authentication_backoff_factor="1secs"
--authorizer="local" --cgroups_cpu_enable_pids_and_tids_count="false" --cgroups_enable_cfs="false"
--cgroups_hierarchy="/sys/fs/cgroup" --cgroups_limit_swap="false" --cgroups_root="mesos" --container_disk_watch_interval="15secs"
--containerizers="mesos" --credential="/tmp/Endpoint_SlaveEndpointTest_NoAuthorizer_0_eI48OW/credential"
--default_role="*" --disk_watch_interval="1mins" --docker="docker" --docker_kill_orphans="true"
--docker_registry="https://registry-1.docker.io" --docker_remove_delay="6hrs" --docker_socket="/var/run/docker.sock"
--docker_stop_timeout="0ns" --docker_store_dir="/tmp/Endpoint_SlaveEndpointTest_NoAuthorizer_0_eI48OW/store/docker"
--docker_volume_checkpoint_dir="/var/run/mesos/isolators/docker/volume" --enforce_container_disk_quota="false"
--executor_registration_timeout="1mins" --executor_reregistration_timeout="2secs" --executor_shutdown_grace_period="5secs"
--fetcher_cache_dir="/tmp/Endpoint_SlaveEndpointTest_NoAuthorizer_0_eI48OW/fetch" --fetcher_cache_size="2GB"
--frameworks_home="" --gc_delay="1weeks" --gc_disk_headroom="0.1" --hadoop_home="" --help="false"
--hostname_lookup="true" --http_command_executor="false" --http_credentials="/tmp/Endpoint_SlaveEndpointTest_NoAuthorizer_0_eI48OW/http_credentials"
--http_heartbeat_interval="30secs" --initialize_driver_logging="true" --isolation="posix/cpu,posix/mem"
--launcher="posix" --launcher_dir="/mesos/mesos-1.4.0/_build/src" --logbufsecs="0" --logging_level="INFO"
--max_completed_executors_per_framework="150" --oversubscribed_resources_interval="15secs"
--perf_duration="10secs" --perf_interval="1mins" --port="5051" --qos_correction_interval_min="0ns"
--quiet="false" --recover="reconnect" --recovery_timeout="15mins" --registration_backoff_factor="10ms"
--resources="cpus:2;gpus:0;mem:1024;disk:1024;ports:[31000-32000]" --revocable_cpu_low_priority="true"
--runtime_dir="/tmp/Endpoint_SlaveEndpointTest_NoAuthorizer_0_eI48OW" --sandbox_directory="/mnt/mesos/sandbox"
--strict="true" --switch_user="true" --systemd_enable_support="true" --systemd_runtime_directory="/run/systemd/system"
--version="false" --work_dir="/tmp/Endpoint_SlaveEndpointTest_NoAuthorizer_0_EvWTC6"
I0727 02:48:04.395683  5123 credentials.hpp:86] Loading credential for authentication from
'/tmp/Endpoint_SlaveEndpointTest_NoAuthorizer_0_eI48OW/credential'
I0727 02:48:04.396283  5123 slave.cpp:283] Agent using credential for: test-principal
I0727 02:48:04.396329  5123 credentials.hpp:37] Loading credentials for authentication from
'/tmp/Endpoint_SlaveEndpointTest_NoAuthorizer_0_eI48OW/http_credentials'
I0727 02:48:04.397001  5123 http.cpp:993] Creating default 'basic' HTTP authenticator for
realm 'mesos-agent-readonly'
I0727 02:48:04.397541  5123 http.cpp:993] Creating default 'basic' HTTP authenticator for
realm 'mesos-agent-readwrite'
I0727 02:48:04.400341  5123 slave.cpp:565] Agent resources: [{"name":"cpus","scalar":{"value":2.0},"type":"SCALAR"},{"name":"mem","scalar":{"value":1024.0},"type":"SCALAR"},{"name":"disk","scalar":{"value":1024.0},"type":"SCALAR"},{"name":"ports","ranges":{"range":[{"begin":31000,"end":32000}]},"type":"RANGES"}]
I0727 02:48:04.400789  5123 slave.cpp:573] Agent attributes: [  ]
I0727 02:48:04.400916  5123 slave.cpp:582] Agent hostname: 7948599c8522
I0727 02:48:04.401639  5122 status_update_manager.cpp:177] Pausing sending status updates
I0727 02:48:04.404588  5120 state.cpp:64] Recovering state from '/tmp/Endpoint_SlaveEndpointTest_NoAuthorizer_0_EvWTC6/meta'
I0727 02:48:04.405093  5125 status_update_manager.cpp:203] Recovering status update manager
I0727 02:48:04.405520  5121 containerizer.cpp:582] Recovering containerizer
I0727 02:48:04.407968  5125 provisioner.cpp:416] Provisioner recovery complete
I0727 02:48:04.408948  5122 slave.cpp:6207] Finished recovery
I0727 02:48:04.409821  5122 slave.cpp:6389] Querying resource estimator for oversubscribable
resources
I0727 02:48:04.410770  5121 slave.cpp:6403] Received oversubscribable resources {} from the
resource estimator
I0727 02:48:04.416389  5121 process.cpp:3837] Handling HTTP event for process 'slave(800)'
with path: '/slave(800)/monitor/statistics'
I0727 02:48:04.419252  5123 http.cpp:1133] HTTP GET for /slave(800)/monitor/statistics from
172.17.0.3:35186
I0727 02:48:04.419389  5123 http.cpp:957] Authorizing principal 'test-principal' to GET the
'/monitor/statistics' endpoint
I0727 02:48:04.433070  5100 slave.cpp:843] Agent terminating
[       OK ] Endpoint/SlaveEndpointTest.NoAuthorizer/0 (93 ms)
[ RUN      ] Endpoint/SlaveEndpointTest.NoAuthorizer/1
I0727 02:48:04.480234  5100 containerizer.cpp:230] Using isolation: posix/cpu,posix/mem,filesystem/posix,network/cni,environment_secret
W0727 02:48:04.481245  5100 backend.cpp:76] Failed to create 'overlay' backend: OverlayBackend
requires root privileges
W0727 02:48:04.481604  5100 backend.cpp:76] Failed to create 'bind' backend: BindBackend requires
root privileges
I0727 02:48:04.481673  5100 provisioner.cpp:255] Using default backend 'copy'
I0727 02:48:04.484740  5100 cluster.cpp:448] Creating default 'local' authorizer
I0727 02:48:04.487787  5125 slave.cpp:250] Mesos agent started on (801)@172.17.0.3:40769
I0727 02:48:04.487833  5125 slave.cpp:251] Flags at startup: --acls="" --appc_simple_discovery_uri_prefix="http://"
--appc_store_dir="/tmp/Endpoint_SlaveEndpointTest_NoAuthorizer_1_ghg6pk/store/appc" --authenticate_http_readonly="true"
--authenticate_http_readwrite="true" --authenticatee="crammd5" --authentication_backoff_factor="1secs"
--authorizer="local" --cgroups_cpu_enable_pids_and_tids_count="false" --cgroups_enable_cfs="false"
--cgroups_hierarchy="/sys/fs/cgroup" --cgroups_limit_swap="false" --cgroups_root="mesos" --container_disk_watch_interval="15secs"
--containerizers="mesos" --credential="/tmp/Endpoint_SlaveEndpointTest_NoAuthorizer_1_ghg6pk/credential"
--default_role="*" --disk_watch_interval="1mins" --docker="docker" --docker_kill_orphans="true"
--docker_registry="https://registry-1.docker.io" --docker_remove_delay="6hrs" --docker_socket="/var/run/docker.sock"
--docker_stop_timeout="0ns" --docker_store_dir="/tmp/Endpoint_SlaveEndpointTest_NoAuthorizer_1_ghg6pk/store/docker"
--docker_volume_checkpoint_dir="/var/run/mesos/isolators/docker/volume" --enforce_container_disk_quota="false"
--executor_registration_timeout="1mins" --executor_reregistration_timeout="2secs" --executor_shutdown_grace_period="5secs"
--fetcher_cache_dir="/tmp/Endpoint_SlaveEndpointTest_NoAuthorizer_1_ghg6pk/fetch" --fetcher_cache_size="2GB"
--frameworks_home="" --gc_delay="1weeks" --gc_disk_headroom="0.1" --hadoop_home="" --help="false"
--hostname_lookup="true" --http_command_executor="false" --http_credentials="/tmp/Endpoint_SlaveEndpointTest_NoAuthorizer_1_ghg6pk/http_credentials"
--http_heartbeat_interval="30secs" --initialize_driver_logging="true" --isolation="posix/cpu,posix/mem"
--launcher="posix" --launcher_dir="/mesos/mesos-1.4.0/_build/src" --logbufsecs="0" --logging_level="INFO"
--max_completed_executors_per_framework="150" --oversubscribed_resources_interval="15secs"
--perf_duration="10secs" --perf_interval="1mins" --port="5051" --qos_correction_interval_min="0ns"
--quiet="false" --recover="reconnect" --recovery_timeout="15mins" --registration_backoff_factor="10ms"
--resources="cpus:2;gpus:0;mem:1024;disk:1024;ports:[31000-32000]" --revocable_cpu_low_priority="true"
--runtime_dir="/tmp/Endpoint_SlaveEndpointTest_NoAuthorizer_1_ghg6pk" --sandbox_directory="/mnt/mesos/sandbox"
--strict="true" --switch_user="true" --systemd_enable_support="true" --systemd_runtime_directory="/run/systemd/system"
--version="false" --work_dir="/tmp/Endpoint_SlaveEndpointTest_NoAuthorizer_1_A3YzYt"
I0727 02:48:04.488754  5125 credentials.hpp:86] Loading credential for authentication from
'/tmp/Endpoint_SlaveEndpointTest_NoAuthorizer_1_ghg6pk/credential'
I0727 02:48:04.489209  5125 slave.cpp:283] Agent using credential for: test-principal
I0727 02:48:04.489255  5125 credentials.hpp:37] Loading credentials for authentication from
'/tmp/Endpoint_SlaveEndpointTest_NoAuthorizer_1_ghg6pk/http_credentials'
I0727 02:48:04.489861  5125 http.cpp:993] Creating default 'basic' HTTP authenticator for
realm 'mesos-agent-readonly'
I0727 02:48:04.490306  5125 http.cpp:993] Creating default 'basic' HTTP authenticator for
realm 'mesos-agent-readwrite'
I0727 02:48:04.492727  5125 slave.cpp:565] Agent resources: [{"name":"cpus","scalar":{"value":2.0},"type":"SCALAR"},{"name":"mem","scalar":{"value":1024.0},"type":"SCALAR"},{"name":"disk","scalar":{"value":1024.0},"type":"SCALAR"},{"name":"ports","ranges":{"range":[{"begin":31000,"end":32000}]},"type":"RANGES"}]
I0727 02:48:04.493166  5125 slave.cpp:573] Agent attributes: [  ]
I0727 02:48:04.493187  5125 slave.cpp:582] Agent hostname: 7948599c8522
I0727 02:48:04.493672  5126 status_update_manager.cpp:177] Pausing sending status updates
I0727 02:48:04.496340  5126 state.cpp:64] Recovering state from '/tmp/Endpoint_SlaveEndpointTest_NoAuthorizer_1_A3YzYt/meta'
I0727 02:48:04.496984  5119 status_update_manager.cpp:203] Recovering status update manager
I0727 02:48:04.497504  5121 containerizer.cpp:582] Recovering containerizer
I0727 02:48:04.500380  5121 provisioner.cpp:416] Provisioner recovery complete
I0727 02:48:04.501338  5124 slave.cpp:6207] Finished recovery
I0727 02:48:04.502246  5124 slave.cpp:6389] Querying resource estimator for oversubscribable
resources
I0727 02:48:04.502933  5123 slave.cpp:6403] Received oversubscribable resources {} from the
resource estimator
I0727 02:48:04.509097  5119 process.cpp:3837] Handling HTTP event for process 'slave(801)'
with path: '/slave(801)/monitor/statistics.json'
I0727 02:48:04.512604  5126 http.cpp:1133] HTTP GET for /slave(801)/monitor/statistics.json
from 172.17.0.3:35188
I0727 02:48:04.512737  5126 http.cpp:957] Authorizing principal 'test-principal' to GET the
'/monitor/statistics.json' endpoint
I0727 02:48:04.534346  5100 slave.cpp:843] Agent terminating
[       OK ] Endpoint/SlaveEndpointTest.NoAuthorizer/1 (125 ms)
[ RUN      ] Endpoint/SlaveEndpointTest.NoAuthorizer/2
I0727 02:48:04.606233  5100 containerizer.cpp:230] Using isolation: posix/cpu,posix/mem,filesystem/posix,network/cni,environment_secret
W0727 02:48:04.607208  5100 backend.cpp:76] Failed to create 'overlay' backend: OverlayBackend
requires root privileges
W0727 02:48:04.607528  5100 backend.cpp:76] Failed to create 'bind' backend: BindBackend requires
root privileges
I0727 02:48:04.607653  5100 provisioner.cpp:255] Using default backend 'copy'
I0727 02:48:04.610330  5100 cluster.cpp:448] Creating default 'local' authorizer
I0727 02:48:04.614151  5119 slave.cpp:250] Mesos agent started on (802)@172.17.0.3:40769
I0727 02:48:04.614197  5119 slave.cpp:251] Flags at startup: --acls="" --appc_simple_discovery_uri_prefix="http://"
--appc_store_dir="/tmp/Endpoint_SlaveEndpointTest_NoAuthorizer_2_OIx5eJ/store/appc" --authenticate_http_readonly="true"
--authenticate_http_readwrite="true" --authenticatee="crammd5" --authentication_backoff_factor="1secs"
--authorizer="local" --cgroups_cpu_enable_pids_and_tids_count="false" --cgroups_enable_cfs="false"
--cgroups_hierarchy="/sys/fs/cgroup" --cgroups_limit_swap="false" --cgroups_root="mesos" --container_disk_watch_interval="15secs"
--containerizers="mesos" --credential="/tmp/Endpoint_SlaveEndpointTest_NoAuthorizer_2_OIx5eJ/credential"
--default_role="*" --disk_watch_interval="1mins" --docker="docker" --docker_kill_orphans="true"
--docker_registry="https://registry-1.docker.io" --docker_remove_delay="6hrs" --docker_socket="/var/run/docker.sock"
--docker_stop_timeout="0ns" --docker_store_dir="/tmp/Endpoint_SlaveEndpointTest_NoAuthorizer_2_OIx5eJ/store/docker"
--docker_volume_checkpoint_dir="/var/run/mesos/isolators/docker/volume" --enforce_container_disk_quota="false"
--executor_registration_timeout="1mins" --executor_reregistration_timeout="2secs" --executor_shutdown_grace_period="5secs"
--fetcher_cache_dir="/tmp/Endpoint_SlaveEndpointTest_NoAuthorizer_2_OIx5eJ/fetch" --fetcher_cache_size="2GB"
--frameworks_home="" --gc_delay="1weeks" --gc_disk_headroom="0.1" --hadoop_home="" --help="false"
--hostname_lookup="true" --http_command_executor="false" --http_credentials="/tmp/Endpoint_SlaveEndpointTest_NoAuthorizer_2_OIx5eJ/http_credentials"
--http_heartbeat_interval="30secs" --initialize_driver_logging="true" --isolation="posix/cpu,posix/mem"
--launcher="posix" --launcher_dir="/mesos/mesos-1.4.0/_build/src" --logbufsecs="0" --logging_level="INFO"
--max_completed_executors_per_framework="150" --oversubscribed_resources_interval="15secs"
--perf_duration="10secs" --perf_interval="1mins" --port="5051" --qos_correction_interval_min="0ns"
--quiet="false" --recover="reconnect" --recovery_timeout="15mins" --registration_backoff_factor="10ms"
--resources="cpus:2;gpus:0;mem:1024;disk:1024;ports:[31000-32000]" --revocable_cpu_low_priority="true"
--runtime_dir="/tmp/Endpoint_SlaveEndpointTest_NoAuthorizer_2_OIx5eJ" --sandbox_directory="/mnt/mesos/sandbox"
--strict="true" --switch_user="true" --systemd_enable_support="true" --systemd_runtime_directory="/run/systemd/system"
--version="false" --work_dir="/tmp/Endpoint_SlaveEndpointTest_NoAuthorizer_2_qQQdtS"
I0727 02:48:04.615087  5119 credentials.hpp:86] Loading credential for authentication from
'/tmp/Endpoint_SlaveEndpointTest_NoAuthorizer_2_OIx5eJ/credential'
I0727 02:48:04.615619  5119 slave.cpp:283] Agent using credential for: test-principal
I0727 02:48:04.615665  5119 credentials.hpp:37] Loading credentials for authentication from
'/tmp/Endpoint_SlaveEndpointTest_NoAuthorizer_2_OIx5eJ/http_credentials'
I0727 02:48:04.616232  5119 http.cpp:993] Creating default 'basic' HTTP authenticator for
realm 'mesos-agent-readonly'
I0727 02:48:04.616660  5119 http.cpp:993] Creating default 'basic' HTTP authenticator for
realm 'mesos-agent-readwrite'
I0727 02:48:04.619040  5119 slave.cpp:565] Agent resources: [{"name":"cpus","scalar":{"value":2.0},"type":"SCALAR"},{"name":"mem","scalar":{"value":1024.0},"type":"SCALAR"},{"name":"disk","scalar":{"value":1024.0},"type":"SCALAR"},{"name":"ports","ranges":{"range":[{"begin":31000,"end":32000}]},"type":"RANGES"}]
I0727 02:48:04.619484  5119 slave.cpp:573] Agent attributes: [  ]
I0727 02:48:04.619504  5119 slave.cpp:582] Agent hostname: 7948599c8522
I0727 02:48:04.620066  5121 status_update_manager.cpp:177] Pausing sending status updates
I0727 02:48:04.622649  5120 state.cpp:64] Recovering state from '/tmp/Endpoint_SlaveEndpointTest_NoAuthorizer_2_qQQdtS/meta'
I0727 02:48:04.623329  5125 status_update_manager.cpp:203] Recovering status update manager
I0727 02:48:04.623756  5124 containerizer.cpp:582] Recovering containerizer
I0727 02:48:04.626477  5121 provisioner.cpp:416] Provisioner recovery complete
I0727 02:48:04.627560  5120 slave.cpp:6207] Finished recovery
I0727 02:48:04.628885  5120 slave.cpp:6389] Querying resource estimator for oversubscribable
resources
I0727 02:48:04.629600  5121 slave.cpp:6403] Received oversubscribable resources {} from the
resource estimator
I0727 02:48:04.635288  5119 process.cpp:3837] Handling HTTP event for process 'slave(802)'
with path: '/slave(802)/containers'
I0727 02:48:04.638032  5119 http.cpp:1133] HTTP GET for /slave(802)/containers from 172.17.0.3:35190
I0727 02:48:04.638173  5119 http.cpp:957] Authorizing principal 'test-principal' to GET the
'/containers' endpoint
I0727 02:48:04.646623  5122 slave.cpp:843] Agent terminating
[       OK ] Endpoint/SlaveEndpointTest.NoAuthorizer/2 (121 ms)
[----------] 9 tests from Endpoint/SlaveEndpointTest (931 ms total)

[----------] Global test environment tear-down
[==========] 1649 tests from 181 test cases ran. (840363 ms total)
[  PASSED  ] 1645 tests.
[  FAILED  ] 4 tests, listed below:
[  FAILED  ] DefaultExecutorCheckTest.CommandCheckDeliveredAndReconciled
[  FAILED  ] DefaultExecutorCheckTest.CommandCheckStatusChange
[  FAILED  ] DefaultExecutorCheckTest.CommandCheckSeesParentsEnv
[  FAILED  ] DefaultExecutorCheckTest.CommandCheckSharesWorkDirWithTask

 4 FAILED TESTS
  YOU HAVE 20 DISABLED TESTS

I0727 02:48:04.857792  5127 process.cpp:1006] Failed to accept socket: future discarded
make[4]: *** [check-local] Error 1
make[4]: Leaving directory `/mesos/mesos-1.4.0/_build/src'
make[3]: *** [check-am] Error 2
make[3]: Leaving directory `/mesos/mesos-1.4.0/_build/src'
make[2]: *** [check] Error 2
make[2]: Leaving directory `/mesos/mesos-1.4.0/_build/src'
make[1]: *** [check-recursive] Error 1
make[1]: Leaving directory `/mesos/mesos-1.4.0/_build'
make: *** [distcheck] Error 1
+ docker rmi mesos-1501116890-402
Untagged: mesos-1501116890-402:latest
Deleted: sha256:768333aec15c8f582e80b97e0f09567dc7786b41826f697e1214c34512669c43
Deleted: sha256:c5433770365d476119d12fd0c84bbaa85b77391f2b4ad7759d5ef68680f42185
Deleted: sha256:ae99a0f45263ff99c3cbd890a81bcd0790ebc949520f7511ecac1fb4750ce464
Deleted: sha256:560c47ae6351f39df9c3f335b290d1d7fd61af5b3a688f1a7a52aba2eb983c9d
Deleted: sha256:721c9bad77149d47302997cefa18c6625624aa5fdfd2209550d50a0b46b44fe8
Deleted: sha256:95ca0959a238a42dfb0d351017887d114fdb94a2d7cdd7601682e51cb727bc3f
Deleted: sha256:f81544cb442279adc0760178fc22555d0853e1d3c0199462923fc9d85f5e4d0c
Deleted: sha256:93b0cfc7728d6f1b4aaf95ca238639f579b0ed1a506541a89de4c24420738593
Deleted: sha256:fba97b0a8d5f4169bf9f0dc5593d1fc62ad11571c37b37ba13340c29c593dd3c
Deleted: sha256:ca33e5bfe96afe4d2c8bb054517b43bd1c4bc25921045665f9c548173f60d85c
Deleted: sha256:49d6f7589fbbc6686f7f096d7a2fe8408c1c5fb650357e951754835b0df1bc85
Deleted: sha256:87d042f8f57bcf012a22718c297fec755e53c9d9fad5f3e6589ab70f6cc442c9
Deleted: sha256:b36cef88f79e75192212e5ae5c045a8e4a1726d71142aacefb4b608a71587477
Deleted: sha256:f0d9b681b2f7ed8257c4d05db96a227f2a510e2147fdbe9e57a0d92cda312838
Deleted: sha256:02b73798dbefb12444798ef50b3facc7f27ddd9e4eb84743228efc967a63cc91
Deleted: sha256:cf08bd6424ad823a119304f1daefb599828f56799365d70cc63d0097a26e1884
Deleted: sha256:40d4b8b35eb9eba942ea949bf97a6c433c8a752507d18441b2ba8724e2a125f1
Deleted: sha256:9eca914b94846783fab1dba15fa020b9397cf2118f534f1fc897681e00a0cc08
Deleted: sha256:40f1abebe36377dde1f7b2619460a56320bff0ffcb01b7271c321ec4461c70b7
Deleted: sha256:31e5a12b63a37e3715e4d37f28a11574e8ed7827a3f952f79f09ac141ca3dd11
Deleted: sha256:5611c2f5f705777a1833df84912e5ee030d40fc2631cafc9bc09dc2de31b138c
Deleted: sha256:972da4353ea31e1c0b3904f054f473e6ccd1d478eb6a3681eb55fcd1ea984808
Deleted: sha256:00b9677a5525f888c8ef3a55d1ed0f466c46aa6cb50cd150f0964bcdcfb1ad5a
Deleted: sha256:5dfd7b6576669e60f24fb2f01210d4ad76da35f8bf769d02a8872576f0ac03fd
Build step 'Execute shell' marked build as failure

Mime
View raw message