mesos-builds mailing list archives

Site index · List index
Message view « Date » · « Thread »
Top « Date » · « Thread »
From Apache Jenkins Server <jenk...@builds.apache.org>
Subject Build failed in Jenkins: Mesos-Buildbot » autotools,gcc,--verbose --enable-libevent --enable-ssl,GLOG_v=1 MESOS_VERBOSE=1,centos:7,(ubuntu)&&(!ubuntu-us1)&&(!ubuntu-eu2) #3899
Date Tue, 11 Jul 2017 18:28:05 GMT
See <https://builds.apache.org/job/Mesos-Buildbot/BUILDTOOL=autotools,COMPILER=gcc,CONFIGURATION=--verbose%20--enable-libevent%20--enable-ssl,ENVIRONMENT=GLOG_v=1%20MESOS_VERBOSE=1,OS=centos%3A7,label_exp=(ubuntu)&&(!ubuntu-us1)&&(!ubuntu-eu2)/3899/display/redirect?page=changes>

Changes:

[bmahler] Handled EINTR for waitpid in ChildHook::SUPERVISOR from subprocess.

------------------------------------------
[...truncated 30.92 MB...]
I0711 18:27:57.841946 29920 http.cpp:1116] HTTP GET for /slave(782)/containers from 172.17.0.6:41548
I0711 18:27:57.842034 29920 http.cpp:937] Authorizing principal 'test-principal' to GET the
'/containers' endpoint
I0711 18:27:57.846096 29919 slave.cpp:839] Agent terminating
[       OK ] Endpoint/SlaveEndpointTest.AuthorizedRequest/2 (35 ms)
[ RUN      ] Endpoint/SlaveEndpointTest.UnauthorizedRequest/0
I0711 18:27:57.859213  9202 containerizer.cpp:230] Using isolation: posix/cpu,posix/mem,filesystem/posix,network/cni,environment_secret
W0711 18:27:57.859779  9202 backend.cpp:76] Failed to create 'aufs' backend: AufsBackend requires
root privileges
W0711 18:27:57.859899  9202 backend.cpp:76] Failed to create 'bind' backend: BindBackend requires
root privileges
I0711 18:27:57.859942  9202 provisioner.cpp:255] Using default backend 'copy'
I0711 18:27:57.863698 29910 slave.cpp:250] Mesos agent started on (783)@172.17.0.6:42319
I0711 18:27:57.863725 29910 slave.cpp:251] Flags at startup: --acls="" --appc_simple_discovery_uri_prefix="http://"
--appc_store_dir="/tmp/Endpoint_SlaveEndpointTest_UnauthorizedRequest_0_o2A8Jj/store/appc"
--authenticate_http_executors="true" --authenticate_http_readonly="true" --authenticate_http_readwrite="true"
--authenticatee="crammd5" --authentication_backoff_factor="1secs" --authorizer="local" --cgroups_cpu_enable_pids_and_tids_count="false"
--cgroups_enable_cfs="false" --cgroups_hierarchy="/sys/fs/cgroup" --cgroups_limit_swap="false"
--cgroups_root="mesos" --container_disk_watch_interval="15secs" --containerizers="mesos" --credential="/tmp/Endpoint_SlaveEndpointTest_UnauthorizedRequest_0_o2A8Jj/credential"
--default_role="*" --disk_watch_interval="1mins" --docker="docker" --docker_kill_orphans="true"
--docker_registry="https://registry-1.docker.io" --docker_remove_delay="6hrs" --docker_socket="/var/run/docker.sock"
--docker_stop_timeout="0ns" --docker_store_dir="/tmp/Endpoint_SlaveEndpointTest_UnauthorizedRequest_0_o2A8Jj/store/docker"
--docker_volume_checkpoint_dir="/var/run/mesos/isolators/docker/volume" --enforce_container_disk_quota="false"
--executor_registration_timeout="1mins" --executor_reregistration_timeout="2secs" --executor_secret_key="/tmp/Endpoint_SlaveEndpointTest_UnauthorizedRequest_0_o2A8Jj/executor_secret_key"
--executor_shutdown_grace_period="5secs" --fetcher_cache_dir="/tmp/Endpoint_SlaveEndpointTest_UnauthorizedRequest_0_o2A8Jj/fetch"
--fetcher_cache_size="2GB" --frameworks_home="" --gc_delay="1weeks" --gc_disk_headroom="0.1"
--hadoop_home="" --help="false" --hostname_lookup="true" --http_command_executor="false" --http_credentials="/tmp/Endpoint_SlaveEndpointTest_UnauthorizedRequest_0_o2A8Jj/http_credentials"
--http_heartbeat_interval="30secs" --initialize_driver_logging="true" --isolation="posix/cpu,posix/mem"
--launcher="posix" --launcher_dir="/mesos/mesos-1.4.0/_build/src" --logbufsecs="0" --logging_level="INFO"
--max_completed_executors_per_framework="150" --oversubscribed_resources_interval="15secs"
--perf_duration="10secs" --perf_interval="1mins" --port="5051" --qos_correction_interval_min="0ns"
--quiet="false" --recover="reconnect" --recovery_timeout="15mins" --registration_backoff_factor="10ms"
--resources="cpus:2;gpus:0;mem:1024;disk:1024;ports:[31000-32000]" --revocable_cpu_low_priority="true"
--runtime_dir="/tmp/Endpoint_SlaveEndpointTest_UnauthorizedRequest_0_o2A8Jj" --sandbox_directory="/mnt/mesos/sandbox"
--strict="true" --switch_user="true" --systemd_enable_support="true" --systemd_runtime_directory="/run/systemd/system"
--version="false" --work_dir="/tmp/Endpoint_SlaveEndpointTest_UnauthorizedRequest_0_WI8tuM"
I0711 18:27:57.864223 29910 credentials.hpp:86] Loading credential for authentication from
'/tmp/Endpoint_SlaveEndpointTest_UnauthorizedRequest_0_o2A8Jj/credential'
I0711 18:27:57.864411 29910 slave.cpp:283] Agent using credential for: test-principal
I0711 18:27:57.864434 29910 credentials.hpp:37] Loading credentials for authentication from
'/tmp/Endpoint_SlaveEndpointTest_UnauthorizedRequest_0_o2A8Jj/http_credentials'
I0711 18:27:57.864809 29910 http.cpp:976] Creating default 'basic' HTTP authenticator for
realm 'mesos-agent-executor'
I0711 18:27:57.864977 29910 http.cpp:997] Creating default 'jwt' HTTP authenticator for realm
'mesos-agent-executor'
I0711 18:27:57.865180 29910 http.cpp:976] Creating default 'basic' HTTP authenticator for
realm 'mesos-agent-readonly'
I0711 18:27:57.865377 29910 http.cpp:997] Creating default 'jwt' HTTP authenticator for realm
'mesos-agent-readonly'
I0711 18:27:57.865805 29910 http.cpp:976] Creating default 'basic' HTTP authenticator for
realm 'mesos-agent-readwrite'
I0711 18:27:57.865972 29910 http.cpp:997] Creating default 'jwt' HTTP authenticator for realm
'mesos-agent-readwrite'
I0711 18:27:57.867641 29910 slave.cpp:565] Agent resources: [{"name":"cpus","scalar":{"value":2.0},"type":"SCALAR"},{"name":"mem","scalar":{"value":1024.0},"type":"SCALAR"},{"name":"disk","scalar":{"value":1024.0},"type":"SCALAR"},{"name":"ports","ranges":{"range":[{"begin":31000,"end":32000}]},"type":"RANGES"}]
I0711 18:27:57.867928 29910 slave.cpp:573] Agent attributes: [  ]
I0711 18:27:57.867945 29910 slave.cpp:578] Agent hostname: a767ee572700
I0711 18:27:57.868118 29926 status_update_manager.cpp:177] Pausing sending status updates
I0711 18:27:57.869845 29912 state.cpp:64] Recovering state from '/tmp/Endpoint_SlaveEndpointTest_UnauthorizedRequest_0_WI8tuM/meta'
I0711 18:27:57.870339 29925 status_update_manager.cpp:203] Recovering status update manager
I0711 18:27:57.870561 29919 containerizer.cpp:582] Recovering containerizer
I0711 18:27:57.872386 29917 provisioner.cpp:416] Provisioner recovery complete
I0711 18:27:57.872746 29925 slave.cpp:6203] Finished recovery
I0711 18:27:57.873246 29925 slave.cpp:6385] Querying resource estimator for oversubscribable
resources
I0711 18:27:57.873538 29911 slave.cpp:6399] Received oversubscribable resources {} from the
resource estimator
I0711 18:27:57.876135 29918 process.cpp:3820] Handling HTTP event for process 'slave(783)'
with path: '/slave(783)/monitor/statistics'
I0711 18:27:57.878069 29926 http.cpp:1116] HTTP GET for /slave(783)/monitor/statistics from
172.17.0.6:41550
I0711 18:27:57.878165 29926 http.cpp:937] Authorizing principal 'test-principal' to GET the
'/monitor/statistics' endpoint
I0711 18:27:57.880805 29931 slave.cpp:839] Agent terminating
[       OK ] Endpoint/SlaveEndpointTest.UnauthorizedRequest/0 (34 ms)
[ RUN      ] Endpoint/SlaveEndpointTest.UnauthorizedRequest/1
I0711 18:27:57.894340  9202 containerizer.cpp:230] Using isolation: posix/cpu,posix/mem,filesystem/posix,network/cni,environment_secret
W0711 18:27:57.894878  9202 backend.cpp:76] Failed to create 'aufs' backend: AufsBackend requires
root privileges
W0711 18:27:57.894997  9202 backend.cpp:76] Failed to create 'bind' backend: BindBackend requires
root privileges
I0711 18:27:57.895036  9202 provisioner.cpp:255] Using default backend 'copy'
I0711 18:27:57.899039 29920 slave.cpp:250] Mesos agent started on (784)@172.17.0.6:42319
I0711 18:27:57.899077 29920 slave.cpp:251] Flags at startup: --acls="" --appc_simple_discovery_uri_prefix="http://"
--appc_store_dir="/tmp/Endpoint_SlaveEndpointTest_UnauthorizedRequest_1_KDlu2s/store/appc"
--authenticate_http_executors="true" --authenticate_http_readonly="true" --authenticate_http_readwrite="true"
--authenticatee="crammd5" --authentication_backoff_factor="1secs" --authorizer="local" --cgroups_cpu_enable_pids_and_tids_count="false"
--cgroups_enable_cfs="false" --cgroups_hierarchy="/sys/fs/cgroup" --cgroups_limit_swap="false"
--cgroups_root="mesos" --container_disk_watch_interval="15secs" --containerizers="mesos" --credential="/tmp/Endpoint_SlaveEndpointTest_UnauthorizedRequest_1_KDlu2s/credential"
--default_role="*" --disk_watch_interval="1mins" --docker="docker" --docker_kill_orphans="true"
--docker_registry="https://registry-1.docker.io" --docker_remove_delay="6hrs" --docker_socket="/var/run/docker.sock"
--docker_stop_timeout="0ns" --docker_store_dir="/tmp/Endpoint_SlaveEndpointTest_UnauthorizedRequest_1_KDlu2s/store/docker"
--docker_volume_checkpoint_dir="/var/run/mesos/isolators/docker/volume" --enforce_container_disk_quota="false"
--executor_registration_timeout="1mins" --executor_reregistration_timeout="2secs" --executor_secret_key="/tmp/Endpoint_SlaveEndpointTest_UnauthorizedRequest_1_KDlu2s/executor_secret_key"
--executor_shutdown_grace_period="5secs" --fetcher_cache_dir="/tmp/Endpoint_SlaveEndpointTest_UnauthorizedRequest_1_KDlu2s/fetch"
--fetcher_cache_size="2GB" --frameworks_home="" --gc_delay="1weeks" --gc_disk_headroom="0.1"
--hadoop_home="" --help="false" --hostname_lookup="true" --http_command_executor="false" --http_credentials="/tmp/Endpoint_SlaveEndpointTest_UnauthorizedRequest_1_KDlu2s/http_credentials"
--http_heartbeat_interval="30secs" --initialize_driver_logging="true" --isolation="posix/cpu,posix/mem"
--launcher="posix" --launcher_dir="/mesos/mesos-1.4.0/_build/src" --logbufsecs="0" --logging_level="INFO"
--max_completed_executors_per_framework="150" --oversubscribed_resources_interval="15secs"
--perf_duration="10secs" --perf_interval="1mins" --port="5051" --qos_correction_interval_min="0ns"
--quiet="false" --recover="reconnect" --recovery_timeout="15mins" --registration_backoff_factor="10ms"
--resources="cpus:2;gpus:0;mem:1024;disk:1024;ports:[31000-32000]" --revocable_cpu_low_priority="true"
--runtime_dir="/tmp/Endpoint_SlaveEndpointTest_UnauthorizedRequest_1_KDlu2s" --sandbox_directory="/mnt/mesos/sandbox"
--strict="true" --switch_user="true" --systemd_enable_support="true" --systemd_runtime_directory="/run/systemd/system"
--version="false" --work_dir="/tmp/Endpoint_SlaveEndpointTest_UnauthorizedRequest_1_GBeCHV"
I0711 18:27:57.899485 29920 credentials.hpp:86] Loading credential for authentication from
'/tmp/Endpoint_SlaveEndpointTest_UnauthorizedRequest_1_KDlu2s/credential'
I0711 18:27:57.899678 29920 slave.cpp:283] Agent using credential for: test-principal
I0711 18:27:57.899701 29920 credentials.hpp:37] Loading credentials for authentication from
'/tmp/Endpoint_SlaveEndpointTest_UnauthorizedRequest_1_KDlu2s/http_credentials'
I0711 18:27:57.900017 29920 http.cpp:976] Creating default 'basic' HTTP authenticator for
realm 'mesos-agent-executor'
I0711 18:27:57.900137 29920 http.cpp:997] Creating default 'jwt' HTTP authenticator for realm
'mesos-agent-executor'
I0711 18:27:57.900348 29920 http.cpp:976] Creating default 'basic' HTTP authenticator for
realm 'mesos-agent-readonly'
I0711 18:27:57.900466 29920 http.cpp:997] Creating default 'jwt' HTTP authenticator for realm
'mesos-agent-readonly'
I0711 18:27:57.900703 29920 http.cpp:976] Creating default 'basic' HTTP authenticator for
realm 'mesos-agent-readwrite'
I0711 18:27:57.900882 29920 http.cpp:997] Creating default 'jwt' HTTP authenticator for realm
'mesos-agent-readwrite'
I0711 18:27:57.902477 29920 slave.cpp:565] Agent resources: [{"name":"cpus","scalar":{"value":2.0},"type":"SCALAR"},{"name":"mem","scalar":{"value":1024.0},"type":"SCALAR"},{"name":"disk","scalar":{"value":1024.0},"type":"SCALAR"},{"name":"ports","ranges":{"range":[{"begin":31000,"end":32000}]},"type":"RANGES"}]
I0711 18:27:57.902734 29920 slave.cpp:573] Agent attributes: [  ]
I0711 18:27:57.902755 29920 slave.cpp:578] Agent hostname: a767ee572700
I0711 18:27:57.902897 29911 status_update_manager.cpp:177] Pausing sending status updates
I0711 18:27:57.904455 29911 state.cpp:64] Recovering state from '/tmp/Endpoint_SlaveEndpointTest_UnauthorizedRequest_1_GBeCHV/meta'
I0711 18:27:57.904830 29925 status_update_manager.cpp:203] Recovering status update manager
I0711 18:27:57.905159 29914 containerizer.cpp:582] Recovering containerizer
I0711 18:27:57.906992 29920 provisioner.cpp:416] Provisioner recovery complete
I0711 18:27:57.907450 29929 slave.cpp:6203] Finished recovery
I0711 18:27:57.908022 29929 slave.cpp:6385] Querying resource estimator for oversubscribable
resources
I0711 18:27:57.908470 29912 slave.cpp:6399] Received oversubscribable resources {} from the
resource estimator
I0711 18:27:57.910699 29928 process.cpp:3820] Handling HTTP event for process 'slave(784)'
with path: '/slave(784)/monitor/statistics.json'
I0711 18:27:57.912513 29912 http.cpp:1116] HTTP GET for /slave(784)/monitor/statistics.json
from 172.17.0.6:41552
I0711 18:27:57.912611 29912 http.cpp:937] Authorizing principal 'test-principal' to GET the
'/monitor/statistics.json' endpoint
I0711 18:27:57.915539 29928 slave.cpp:839] Agent terminating
[       OK ] Endpoint/SlaveEndpointTest.UnauthorizedRequest/1 (34 ms)
[ RUN      ] Endpoint/SlaveEndpointTest.UnauthorizedRequest/2
I0711 18:27:57.927677  9202 containerizer.cpp:230] Using isolation: posix/cpu,posix/mem,filesystem/posix,network/cni,environment_secret
W0711 18:27:57.928186  9202 backend.cpp:76] Failed to create 'aufs' backend: AufsBackend requires
root privileges
W0711 18:27:57.928292  9202 backend.cpp:76] Failed to create 'bind' backend: BindBackend requires
root privileges
I0711 18:27:57.928328  9202 provisioner.cpp:255] Using default backend 'copy'
I0711 18:27:57.932014 29924 slave.cpp:250] Mesos agent started on (785)@172.17.0.6:42319
I0711 18:27:57.932041 29924 slave.cpp:251] Flags at startup: --acls="" --appc_simple_discovery_uri_prefix="http://"
--appc_store_dir="/tmp/Endpoint_SlaveEndpointTest_UnauthorizedRequest_2_klr4EC/store/appc"
--authenticate_http_executors="true" --authenticate_http_readonly="true" --authenticate_http_readwrite="true"
--authenticatee="crammd5" --authentication_backoff_factor="1secs" --authorizer="local" --cgroups_cpu_enable_pids_and_tids_count="false"
--cgroups_enable_cfs="false" --cgroups_hierarchy="/sys/fs/cgroup" --cgroups_limit_swap="false"
--cgroups_root="mesos" --container_disk_watch_interval="15secs" --containerizers="mesos" --credential="/tmp/Endpoint_SlaveEndpointTest_UnauthorizedRequest_2_klr4EC/credential"
--default_role="*" --disk_watch_interval="1mins" --docker="docker" --docker_kill_orphans="true"
--docker_registry="https://registry-1.docker.io" --docker_remove_delay="6hrs" --docker_socket="/var/run/docker.sock"
--docker_stop_timeout="0ns" --docker_store_dir="/tmp/Endpoint_SlaveEndpointTest_UnauthorizedRequest_2_klr4EC/store/docker"
--docker_volume_checkpoint_dir="/var/run/mesos/isolators/docker/volume" --enforce_container_disk_quota="false"
--executor_registration_timeout="1mins" --executor_reregistration_timeout="2secs" --executor_secret_key="/tmp/Endpoint_SlaveEndpointTest_UnauthorizedRequest_2_klr4EC/executor_secret_key"
--executor_shutdown_grace_period="5secs" --fetcher_cache_dir="/tmp/Endpoint_SlaveEndpointTest_UnauthorizedRequest_2_klr4EC/fetch"
--fetcher_cache_size="2GB" --frameworks_home="" --gc_delay="1weeks" --gc_disk_headroom="0.1"
--hadoop_home="" --help="false" --hostname_lookup="true" --http_command_executor="false" --http_credentials="/tmp/Endpoint_SlaveEndpointTest_UnauthorizedRequest_2_klr4EC/http_credentials"
--http_heartbeat_interval="30secs" --initialize_driver_logging="true" --isolation="posix/cpu,posix/mem"
--launcher="posix" --launcher_dir="/mesos/mesos-1.4.0/_build/src" --logbufsecs="0" --logging_level="INFO"
--max_completed_executors_per_framework="150" --oversubscribed_resources_interval="15secs"
--perf_duration="10secs" --perf_interval="1mins" --port="5051" --qos_correction_interval_min="0ns"
--quiet="false" --recover="reconnect" --recovery_timeout="15mins" --registration_backoff_factor="10ms"
--resources="cpus:2;gpus:0;mem:1024;disk:1024;ports:[31000-32000]" --revocable_cpu_low_priority="true"
--runtime_dir="/tmp/Endpoint_SlaveEndpointTest_UnauthorizedRequest_2_klr4EC" --sandbox_directory="/mnt/mesos/sandbox"
--strict="true" --switch_user="true" --systemd_enable_support="true" --systemd_runtime_directory="/run/systemd/system"
--version="false" --work_dir="/tmp/Endpoint_SlaveEndpointTest_UnauthorizedRequest_2_Y9Rcf5"
I0711 18:27:57.932420 29924 credentials.hpp:86] Loading credential for authentication from
'/tmp/Endpoint_SlaveEndpointTest_UnauthorizedRequest_2_klr4EC/credential'
I0711 18:27:57.932569 29924 slave.cpp:283] Agent using credential for: test-principal
I0711 18:27:57.932590 29924 credentials.hpp:37] Loading credentials for authentication from
'/tmp/Endpoint_SlaveEndpointTest_UnauthorizedRequest_2_klr4EC/http_credentials'
I0711 18:27:57.932867 29924 http.cpp:976] Creating default 'basic' HTTP authenticator for
realm 'mesos-agent-executor'
I0711 18:27:57.932982 29924 http.cpp:997] Creating default 'jwt' HTTP authenticator for realm
'mesos-agent-executor'
I0711 18:27:57.933179 29924 http.cpp:976] Creating default 'basic' HTTP authenticator for
realm 'mesos-agent-readonly'
I0711 18:27:57.933321 29924 http.cpp:997] Creating default 'jwt' HTTP authenticator for realm
'mesos-agent-readonly'
I0711 18:27:57.933574 29924 http.cpp:976] Creating default 'basic' HTTP authenticator for
realm 'mesos-agent-readwrite'
I0711 18:27:57.933692 29924 http.cpp:997] Creating default 'jwt' HTTP authenticator for realm
'mesos-agent-readwrite'
I0711 18:27:57.935468 29924 slave.cpp:565] Agent resources: [{"name":"cpus","scalar":{"value":2.0},"type":"SCALAR"},{"name":"mem","scalar":{"value":1024.0},"type":"SCALAR"},{"name":"disk","scalar":{"value":1024.0},"type":"SCALAR"},{"name":"ports","ranges":{"range":[{"begin":31000,"end":32000}]},"type":"RANGES"}]
I0711 18:27:57.935727 29924 slave.cpp:573] Agent attributes: [  ]
I0711 18:27:57.935744 29924 slave.cpp:578] Agent hostname: a767ee572700
I0711 18:27:57.935892 29918 status_update_manager.cpp:177] Pausing sending status updates
I0711 18:27:57.937456 29927 state.cpp:64] Recovering state from '/tmp/Endpoint_SlaveEndpointTest_UnauthorizedRequest_2_Y9Rcf5/meta'
I0711 18:27:57.937741 29922 status_update_manager.cpp:203] Recovering status update manager
I0711 18:27:57.937988 29923 containerizer.cpp:582] Recovering containerizer
I0711 18:27:57.939625 29929 provisioner.cpp:416] Provisioner recovery complete
I0711 18:27:57.940057 29917 slave.cpp:6203] Finished recovery
I0711 18:27:57.940574 29917 slave.cpp:6385] Querying resource estimator for oversubscribable
resources
I0711 18:27:57.940820 29921 slave.cpp:6399] Received oversubscribable resources {} from the
resource estimator
I0711 18:27:57.942776 29911 process.cpp:3820] Handling HTTP event for process 'slave(785)'
with path: '/slave(785)/containers'
I0711 18:27:57.944573 29918 http.cpp:1116] HTTP GET for /slave(785)/containers from 172.17.0.6:41554
I0711 18:27:57.944659 29918 http.cpp:937] Authorizing principal 'test-principal' to GET the
'/containers' endpoint
I0711 18:27:57.946832 29921 slave.cpp:839] Agent terminating
[       OK ] Endpoint/SlaveEndpointTest.UnauthorizedRequest/2 (30 ms)
[ RUN      ] Endpoint/SlaveEndpointTest.NoAuthorizer/0
I0711 18:27:57.958601  9202 containerizer.cpp:230] Using isolation: posix/cpu,posix/mem,filesystem/posix,network/cni,environment_secret
W0711 18:27:57.959133  9202 backend.cpp:76] Failed to create 'aufs' backend: AufsBackend requires
root privileges
W0711 18:27:57.959235  9202 backend.cpp:76] Failed to create 'bind' backend: BindBackend requires
root privileges
I0711 18:27:57.959277  9202 provisioner.cpp:255] Using default backend 'copy'
I0711 18:27:57.961092  9202 cluster.cpp:448] Creating default 'local' authorizer
I0711 18:27:57.962868 29926 slave.cpp:250] Mesos agent started on (786)@172.17.0.6:42319
I0711 18:27:57.962893 29926 slave.cpp:251] Flags at startup: --acls="" --appc_simple_discovery_uri_prefix="http://"
--appc_store_dir="/tmp/Endpoint_SlaveEndpointTest_NoAuthorizer_0_C7I7zM/store/appc" --authenticate_http_executors="true"
--authenticate_http_readonly="true" --authenticate_http_readwrite="true" --authenticatee="crammd5"
--authentication_backoff_factor="1secs" --authorizer="local" --cgroups_cpu_enable_pids_and_tids_count="false"
--cgroups_enable_cfs="false" --cgroups_hierarchy="/sys/fs/cgroup" --cgroups_limit_swap="false"
--cgroups_root="mesos" --container_disk_watch_interval="15secs" --containerizers="mesos" --credential="/tmp/Endpoint_SlaveEndpointTest_NoAuthorizer_0_C7I7zM/credential"
--default_role="*" --disk_watch_interval="1mins" --docker="docker" --docker_kill_orphans="true"
--docker_registry="https://registry-1.docker.io" --docker_remove_delay="6hrs" --docker_socket="/var/run/docker.sock"
--docker_stop_timeout="0ns" --docker_store_dir="/tmp/Endpoint_SlaveEndpointTest_NoAuthorizer_0_C7I7zM/store/docker"
--docker_volume_checkpoint_dir="/var/run/mesos/isolators/docker/volume" --enforce_container_disk_quota="false"
--executor_registration_timeout="1mins" --executor_reregistration_timeout="2secs" --executor_secret_key="/tmp/Endpoint_SlaveEndpointTest_NoAuthorizer_0_C7I7zM/executor_secret_key"
--executor_shutdown_grace_period="5secs" --fetcher_cache_dir="/tmp/Endpoint_SlaveEndpointTest_NoAuthorizer_0_C7I7zM/fetch"
--fetcher_cache_size="2GB" --frameworks_home="" --gc_delay="1weeks" --gc_disk_headroom="0.1"
--hadoop_home="" --help="false" --hostname_lookup="true" --http_command_executor="false" --http_credentials="/tmp/Endpoint_SlaveEndpointTest_NoAuthorizer_0_C7I7zM/http_credentials"
--http_heartbeat_interval="30secs" --initialize_driver_logging="true" --isolation="posix/cpu,posix/mem"
--launcher="posix" --launcher_dir="/mesos/mesos-1.4.0/_build/src" --logbufsecs="0" --logging_level="INFO"
--max_completed_executors_per_framework="150" --oversubscribed_resources_interval="15secs"
--perf_duration="10secs" --perf_interval="1mins" --port="5051" --qos_correction_interval_min="0ns"
--quiet="false" --recover="reconnect" --recovery_timeout="15mins" --registration_backoff_factor="10ms"
--resources="cpus:2;gpus:0;mem:1024;disk:1024;ports:[31000-32000]" --revocable_cpu_low_priority="true"
--runtime_dir="/tmp/Endpoint_SlaveEndpointTest_NoAuthorizer_0_C7I7zM" --sandbox_directory="/mnt/mesos/sandbox"
--strict="true" --switch_user="true" --systemd_enable_support="true" --systemd_runtime_directory="/run/systemd/system"
--version="false" --work_dir="/tmp/Endpoint_SlaveEndpointTest_NoAuthorizer_0_g8BI5e"
I0711 18:27:57.963336 29926 credentials.hpp:86] Loading credential for authentication from
'/tmp/Endpoint_SlaveEndpointTest_NoAuthorizer_0_C7I7zM/credential'
I0711 18:27:57.963520 29926 slave.cpp:283] Agent using credential for: test-principal
I0711 18:27:57.963546 29926 credentials.hpp:37] Loading credentials for authentication from
'/tmp/Endpoint_SlaveEndpointTest_NoAuthorizer_0_C7I7zM/http_credentials'
I0711 18:27:57.963850 29926 http.cpp:976] Creating default 'basic' HTTP authenticator for
realm 'mesos-agent-executor'
I0711 18:27:57.963958 29926 http.cpp:997] Creating default 'jwt' HTTP authenticator for realm
'mesos-agent-executor'
I0711 18:27:57.964215 29926 http.cpp:976] Creating default 'basic' HTTP authenticator for
realm 'mesos-agent-readonly'
I0711 18:27:57.964326 29926 http.cpp:997] Creating default 'jwt' HTTP authenticator for realm
'mesos-agent-readonly'
I0711 18:27:57.964643 29926 http.cpp:976] Creating default 'basic' HTTP authenticator for
realm 'mesos-agent-readwrite'
I0711 18:27:57.964748 29926 http.cpp:997] Creating default 'jwt' HTTP authenticator for realm
'mesos-agent-readwrite'
I0711 18:27:57.966260 29926 slave.cpp:565] Agent resources: [{"name":"cpus","scalar":{"value":2.0},"type":"SCALAR"},{"name":"mem","scalar":{"value":1024.0},"type":"SCALAR"},{"name":"disk","scalar":{"value":1024.0},"type":"SCALAR"},{"name":"ports","ranges":{"range":[{"begin":31000,"end":32000}]},"type":"RANGES"}]
I0711 18:27:57.966511 29926 slave.cpp:573] Agent attributes: [  ]
I0711 18:27:57.966531 29926 slave.cpp:578] Agent hostname: a767ee572700
I0711 18:27:57.966665 29929 status_update_manager.cpp:177] Pausing sending status updates
I0711 18:27:57.968075 29929 state.cpp:64] Recovering state from '/tmp/Endpoint_SlaveEndpointTest_NoAuthorizer_0_g8BI5e/meta'
I0711 18:27:57.968343 29917 status_update_manager.cpp:203] Recovering status update manager
I0711 18:27:57.968559 29920 containerizer.cpp:582] Recovering containerizer
I0711 18:27:57.970221 29932 provisioner.cpp:416] Provisioner recovery complete
I0711 18:27:57.970757 29923 slave.cpp:6203] Finished recovery
I0711 18:27:57.971200 29923 slave.cpp:6385] Querying resource estimator for oversubscribable
resources
I0711 18:27:57.974252 29928 slave.cpp:6399] Received oversubscribable resources {} from the
resource estimator
I0711 18:27:57.976318 29922 process.cpp:3820] Handling HTTP event for process 'slave(786)'
with path: '/slave(786)/monitor/statistics'
I0711 18:27:57.978174 29919 http.cpp:1116] HTTP GET for /slave(786)/monitor/statistics from
172.17.0.6:41556
I0711 18:27:57.978271 29919 http.cpp:937] Authorizing principal 'test-principal' to GET the
'/monitor/statistics' endpoint
I0711 18:27:57.982338 29925 slave.cpp:839] Agent terminating
[       OK ] Endpoint/SlaveEndpointTest.NoAuthorizer/0 (35 ms)
[ RUN      ] Endpoint/SlaveEndpointTest.NoAuthorizer/1
I0711 18:27:57.995429  9202 containerizer.cpp:230] Using isolation: posix/cpu,posix/mem,filesystem/posix,network/cni,environment_secret
W0711 18:27:57.996318  9202 backend.cpp:76] Failed to create 'aufs' backend: AufsBackend requires
root privileges
W0711 18:27:57.996500  9202 backend.cpp:76] Failed to create 'bind' backend: BindBackend requires
root privileges
I0711 18:27:57.996549  9202 provisioner.cpp:255] Using default backend 'copy'
I0711 18:27:57.999303  9202 cluster.cpp:448] Creating default 'local' authorizer
I0711 18:27:58.002351 29929 slave.cpp:250] Mesos agent started on (787)@172.17.0.6:42319
I0711 18:27:58.002372 29929 slave.cpp:251] Flags at startup: --acls="" --appc_simple_discovery_uri_prefix="http://"
--appc_store_dir="/tmp/Endpoint_SlaveEndpointTest_NoAuthorizer_1_8QwcQW/store/appc" --authenticate_http_executors="true"
--authenticate_http_readonly="true" --authenticate_http_readwrite="true" --authenticatee="crammd5"
--authentication_backoff_factor="1secs" --authorizer="local" --cgroups_cpu_enable_pids_and_tids_count="false"
--cgroups_enable_cfs="false" --cgroups_hierarchy="/sys/fs/cgroup" --cgroups_limit_swap="false"
--cgroups_root="mesos" --container_disk_watch_interval="15secs" --containerizers="mesos" --credential="/tmp/Endpoint_SlaveEndpointTest_NoAuthorizer_1_8QwcQW/credential"
--default_role="*" --disk_watch_interval="1mins" --docker="docker" --docker_kill_orphans="true"
--docker_registry="https://registry-1.docker.io" --docker_remove_delay="6hrs" --docker_socket="/var/run/docker.sock"
--docker_stop_timeout="0ns" --docker_store_dir="/tmp/Endpoint_SlaveEndpointTest_NoAuthorizer_1_8QwcQW/store/docker"
--docker_volume_checkpoint_dir="/var/run/mesos/isolators/docker/volume" --enforce_container_disk_quota="false"
--executor_registration_timeout="1mins" --executor_reregistration_timeout="2secs" --executor_secret_key="/tmp/Endpoint_SlaveEndpointTest_NoAuthorizer_1_8QwcQW/executor_secret_key"
--executor_shutdown_grace_period="5secs" --fetcher_cache_dir="/tmp/Endpoint_SlaveEndpointTest_NoAuthorizer_1_8QwcQW/fetch"
--fetcher_cache_size="2GB" --frameworks_home="" --gc_delay="1weeks" --gc_disk_headroom="0.1"
--hadoop_home="" --help="false" --hostname_lookup="true" --http_command_executor="false" --http_credentials="/tmp/Endpoint_SlaveEndpointTest_NoAuthorizer_1_8QwcQW/http_credentials"
--http_heartbeat_interval="30secs" --initialize_driver_logging="true" --isolation="posix/cpu,posix/mem"
--launcher="posix" --launcher_dir="/mesos/mesos-1.4.0/_build/src" --logbufsecs="0" --logging_level="INFO"
--max_completed_executors_per_framework="150" --oversubscribed_resources_interval="15secs"
--perf_duration="10secs" --perf_interval="1mins" --port="5051" --qos_correction_interval_min="0ns"
--quiet="false" --recover="reconnect" --recovery_timeout="15mins" --registration_backoff_factor="10ms"
--resources="cpus:2;gpus:0;mem:1024;disk:1024;ports:[31000-32000]" --revocable_cpu_low_priority="true"
--runtime_dir="/tmp/Endpoint_SlaveEndpointTest_NoAuthorizer_1_8QwcQW" --sandbox_directory="/mnt/mesos/sandbox"
--strict="true" --switch_user="true" --systemd_enable_support="true" --systemd_runtime_directory="/run/systemd/system"
--version="false" --work_dir="/tmp/Endpoint_SlaveEndpointTest_NoAuthorizer_1_Ippjgp"
I0711 18:27:58.002743 29929 credentials.hpp:86] Loading credential for authentication from
'/tmp/Endpoint_SlaveEndpointTest_NoAuthorizer_1_8QwcQW/credential'
I0711 18:27:58.002941 29929 slave.cpp:283] Agent using credential for: test-principal
I0711 18:27:58.002964 29929 credentials.hpp:37] Loading credentials for authentication from
'/tmp/Endpoint_SlaveEndpointTest_NoAuthorizer_1_8QwcQW/http_credentials'
I0711 18:27:58.003283 29929 http.cpp:976] Creating default 'basic' HTTP authenticator for
realm 'mesos-agent-executor'
I0711 18:27:58.003460 29929 http.cpp:997] Creating default 'jwt' HTTP authenticator for realm
'mesos-agent-executor'
I0711 18:27:58.003741 29929 http.cpp:976] Creating default 'basic' HTTP authenticator for
realm 'mesos-agent-readonly'
I0711 18:27:58.003880 29929 http.cpp:997] Creating default 'jwt' HTTP authenticator for realm
'mesos-agent-readonly'
I0711 18:27:58.004199 29929 http.cpp:976] Creating default 'basic' HTTP authenticator for
realm 'mesos-agent-readwrite'
I0711 18:27:58.004349 29929 http.cpp:997] Creating default 'jwt' HTTP authenticator for realm
'mesos-agent-readwrite'
I0711 18:27:58.006243 29929 slave.cpp:565] Agent resources: [{"name":"cpus","scalar":{"value":2.0},"type":"SCALAR"},{"name":"mem","scalar":{"value":1024.0},"type":"SCALAR"},{"name":"disk","scalar":{"value":1024.0},"type":"SCALAR"},{"name":"ports","ranges":{"range":[{"begin":31000,"end":32000}]},"type":"RANGES"}]
I0711 18:27:58.006500 29929 slave.cpp:573] Agent attributes: [  ]
I0711 18:27:58.006515 29929 slave.cpp:578] Agent hostname: a767ee572700
I0711 18:27:58.006681 29913 status_update_manager.cpp:177] Pausing sending status updates
I0711 18:27:58.008132 29919 state.cpp:64] Recovering state from '/tmp/Endpoint_SlaveEndpointTest_NoAuthorizer_1_Ippjgp/meta'
I0711 18:27:58.008529 29928 status_update_manager.cpp:203] Recovering status update manager
I0711 18:27:58.008734 29917 containerizer.cpp:582] Recovering containerizer
I0711 18:27:58.010172 29927 provisioner.cpp:416] Provisioner recovery complete
I0711 18:27:58.010551 29917 slave.cpp:6203] Finished recovery
I0711 18:27:58.010990 29917 slave.cpp:6385] Querying resource estimator for oversubscribable
resources
I0711 18:27:58.011405 29923 slave.cpp:6399] Received oversubscribable resources {} from the
resource estimator
I0711 18:27:58.013435 29932 process.cpp:3820] Handling HTTP event for process 'slave(787)'
with path: '/slave(787)/monitor/statistics.json'
I0711 18:27:58.015241 29926 http.cpp:1116] HTTP GET for /slave(787)/monitor/statistics.json
from 172.17.0.6:41558
I0711 18:27:58.015348 29926 http.cpp:937] Authorizing principal 'test-principal' to GET the
'/monitor/statistics.json' endpoint
I0711 18:27:58.018537 29929 slave.cpp:839] Agent terminating
[       OK ] Endpoint/SlaveEndpointTest.NoAuthorizer/1 (37 ms)
[ RUN      ] Endpoint/SlaveEndpointTest.NoAuthorizer/2
I0711 18:27:58.032455  9202 containerizer.cpp:230] Using isolation: posix/cpu,posix/mem,filesystem/posix,network/cni,environment_secret
W0711 18:27:58.032945  9202 backend.cpp:76] Failed to create 'aufs' backend: AufsBackend requires
root privileges
W0711 18:27:58.033041  9202 backend.cpp:76] Failed to create 'bind' backend: BindBackend requires
root privileges
I0711 18:27:58.033072  9202 provisioner.cpp:255] Using default backend 'copy'
I0711 18:27:58.035078  9202 cluster.cpp:448] Creating default 'local' authorizer
I0711 18:27:58.036969 29915 slave.cpp:250] Mesos agent started on (788)@172.17.0.6:42319
I0711 18:27:58.037006 29915 slave.cpp:251] Flags at startup: --acls="" --appc_simple_discovery_uri_prefix="http://"
--appc_store_dir="/tmp/Endpoint_SlaveEndpointTest_NoAuthorizer_2_8esGs7/store/appc" --authenticate_http_executors="true"
--authenticate_http_readonly="true" --authenticate_http_readwrite="true" --authenticatee="crammd5"
--authentication_backoff_factor="1secs" --authorizer="local" --cgroups_cpu_enable_pids_and_tids_count="false"
--cgroups_enable_cfs="false" --cgroups_hierarchy="/sys/fs/cgroup" --cgroups_limit_swap="false"
--cgroups_root="mesos" --container_disk_watch_interval="15secs" --containerizers="mesos" --credential="/tmp/Endpoint_SlaveEndpointTest_NoAuthorizer_2_8esGs7/credential"
--default_role="*" --disk_watch_interval="1mins" --docker="docker" --docker_kill_orphans="true"
--docker_registry="https://registry-1.docker.io" --docker_remove_delay="6hrs" --docker_socket="/var/run/docker.sock"
--docker_stop_timeout="0ns" --docker_store_dir="/tmp/Endpoint_SlaveEndpointTest_NoAuthorizer_2_8esGs7/store/docker"
--docker_volume_checkpoint_dir="/var/run/mesos/isolators/docker/volume" --enforce_container_disk_quota="false"
--executor_registration_timeout="1mins" --executor_reregistration_timeout="2secs" --executor_secret_key="/tmp/Endpoint_SlaveEndpointTest_NoAuthorizer_2_8esGs7/executor_secret_key"
--executor_shutdown_grace_period="5secs" --fetcher_cache_dir="/tmp/Endpoint_SlaveEndpointTest_NoAuthorizer_2_8esGs7/fetch"
--fetcher_cache_size="2GB" --frameworks_home="" --gc_delay="1weeks" --gc_disk_headroom="0.1"
--hadoop_home="" --help="false" --hostname_lookup="true" --http_command_executor="false" --http_credentials="/tmp/Endpoint_SlaveEndpointTest_NoAuthorizer_2_8esGs7/http_credentials"
--http_heartbeat_interval="30secs" --initialize_driver_logging="true" --isolation="posix/cpu,posix/mem"
--launcher="posix" --launcher_dir="/mesos/mesos-1.4.0/_build/src" --logbufsecs="0" --logging_level="INFO"
--max_completed_executors_per_framework="150" --oversubscribed_resources_interval="15secs"
--perf_duration="10secs" --perf_interval="1mins" --port="5051" --qos_correction_interval_min="0ns"
--quiet="false" --recover="reconnect" --recovery_timeout="15mins" --registration_backoff_factor="10ms"
--resources="cpus:2;gpus:0;mem:1024;disk:1024;ports:[31000-32000]" --revocable_cpu_low_priority="true"
--runtime_dir="/tmp/Endpoint_SlaveEndpointTest_NoAuthorizer_2_8esGs7" --sandbox_directory="/mnt/mesos/sandbox"
--strict="true" --switch_user="true" --systemd_enable_support="true" --systemd_runtime_directory="/run/systemd/system"
--version="false" --work_dir="/tmp/Endpoint_SlaveEndpointTest_NoAuthorizer_2_W6EhNz"
I0711 18:27:58.037482 29915 credentials.hpp:86] Loading credential for authentication from
'/tmp/Endpoint_SlaveEndpointTest_NoAuthorizer_2_8esGs7/credential'
I0711 18:27:58.037621 29915 slave.cpp:283] Agent using credential for: test-principal
I0711 18:27:58.037643 29915 credentials.hpp:37] Loading credentials for authentication from
'/tmp/Endpoint_SlaveEndpointTest_NoAuthorizer_2_8esGs7/http_credentials'
I0711 18:27:58.037945 29915 http.cpp:976] Creating default 'basic' HTTP authenticator for
realm 'mesos-agent-executor'
I0711 18:27:58.038048 29915 http.cpp:997] Creating default 'jwt' HTTP authenticator for realm
'mesos-agent-executor'
I0711 18:27:58.038259 29915 http.cpp:976] Creating default 'basic' HTTP authenticator for
realm 'mesos-agent-readonly'
I0711 18:27:58.038357 29915 http.cpp:997] Creating default 'jwt' HTTP authenticator for realm
'mesos-agent-readonly'
I0711 18:27:58.038702 29915 http.cpp:976] Creating default 'basic' HTTP authenticator for
realm 'mesos-agent-readwrite'
I0711 18:27:58.038832 29915 http.cpp:997] Creating default 'jwt' HTTP authenticator for realm
'mesos-agent-readwrite'
I0711 18:27:58.041277 29915 slave.cpp:565] Agent resources: [{"name":"cpus","scalar":{"value":2.0},"type":"SCALAR"},{"name":"mem","scalar":{"value":1024.0},"type":"SCALAR"},{"name":"disk","scalar":{"value":1024.0},"type":"SCALAR"},{"name":"ports","ranges":{"range":[{"begin":31000,"end":32000}]},"type":"RANGES"}]
I0711 18:27:58.041688 29915 slave.cpp:573] Agent attributes: [  ]
I0711 18:27:58.041714 29915 slave.cpp:578] Agent hostname: a767ee572700
I0711 18:27:58.041883 29930 status_update_manager.cpp:177] Pausing sending status updates
I0711 18:27:58.044378 29912 state.cpp:64] Recovering state from '/tmp/Endpoint_SlaveEndpointTest_NoAuthorizer_2_W6EhNz/meta'
I0711 18:27:58.044736 29923 status_update_manager.cpp:203] Recovering status update manager
I0711 18:27:58.044934 29931 containerizer.cpp:582] Recovering containerizer
I0711 18:27:58.046517 29917 provisioner.cpp:416] Provisioner recovery complete
I0711 18:27:58.046900 29918 slave.cpp:6203] Finished recovery
I0711 18:27:58.047335 29918 slave.cpp:6385] Querying resource estimator for oversubscribable
resources
I0711 18:27:58.047592 29929 slave.cpp:6399] Received oversubscribable resources {} from the
resource estimator
I0711 18:27:58.049552 29912 process.cpp:3820] Handling HTTP event for process 'slave(788)'
with path: '/slave(788)/containers'
I0711 18:27:58.051702 29932 http.cpp:1116] HTTP GET for /slave(788)/containers from 172.17.0.6:41560
I0711 18:27:58.051808 29932 http.cpp:937] Authorizing principal 'test-principal' to GET the
'/containers' endpoint
I0711 18:27:58.055279 29925 slave.cpp:839] Agent terminating
[       OK ] Endpoint/SlaveEndpointTest.NoAuthorizer/2 (37 ms)
[----------] 9 tests from Endpoint/SlaveEndpointTest (315 ms total)

[----------] Global test environment tear-down
[==========] 1633 tests from 181 test cases ran. (523521 ms total)
[  PASSED  ] 1632 tests.
[  FAILED  ] 1 test, listed below:
[  FAILED  ] MasterTest.IgnoreOldAgentReregistration

 1 FAILED TEST
  YOU HAVE 20 DISABLED TESTS

I0711 18:27:58.126154 29933 process.cpp:993] Failed to accept socket: future discarded
make[4]: *** [check-local] Error 1
make[4]: Leaving directory `/mesos/mesos-1.4.0/_build/src'
make[3]: *** [check-am] Error 2
make[3]: Leaving directory `/mesos/mesos-1.4.0/_build/src'
make[2]: *** [check] Error 2
make[2]: Leaving directory `/mesos/mesos-1.4.0/_build/src'
make[1]: *** [check-recursive] Error 1
make[1]: Leaving directory `/mesos/mesos-1.4.0/_build'
make: *** [distcheck] Error 1
+ docker rmi mesos-1499795144-1040
Untagged: mesos-1499795144-1040:latest
Deleted: sha256:9f73a925c86e86e4fb61a4b7ca4f72e8937a070f909c41342d94253e57bf4cf8
Deleted: sha256:f8408243db897769abdd0bba63061184ddc052c26e27bc887690b47f70dc72cc
Deleted: sha256:cb80bd4492735c679a14d7fb359c63f60fd56d7b325b3cc8b82e16f63a7bdbeb
Deleted: sha256:12f4cb47a1c5399f20692186e61a8d05f27557eef948b2a90f8d6f6356bc2052
Deleted: sha256:8131fe83ecd0c9c933df7ddca03dfa7c8370c3eb9b9b663b5f18bfb7e421ae13
Deleted: sha256:3ee0ff737b7dffd77222070554535687b72df8f7fcea22ed49ebd311640a9026
Deleted: sha256:3cedea618502d497a411de543453264fc02435bee3e22f232c587baf8625e146
Deleted: sha256:e8851e8d50c59181c321bcc156e86478cb4d19c3ad8619ebc011378ac3ff0833
Deleted: sha256:602c7257ae71dd4f783f3a85b6399ec66d9c113c4acce6a5f45ded3019dfed39
Deleted: sha256:1fada4385b7081421b29496f7ca6a1862d454a14650ef89cc543cbb9851cdfd7
Deleted: sha256:bee8b33909c8b42715c64f655769edc648d1534c9a23df3e1524e40cb2465b58
Deleted: sha256:62e14f15b1ad5490b4174c339e073e5e0917c5fde78e6ff62345e5816d79eb4d
Deleted: sha256:76dcdf1cc83739a3ec907a11d2d0e489c7dfcedc06955e7a50a587dcbac66a74
Deleted: sha256:7c0920c99eb46d0953eee6d25f1c9f0bbfeb14dcde3086665a133d45906c0461
Deleted: sha256:f04aac20a9ff22ee382cc718cc214fea60b0bbe804e7e75cc74279b343043395
Deleted: sha256:7fe34c75ac45bc1c59c3ffbb3ccc5385b7028f6fe300fd2922200d70444d941e
Deleted: sha256:19bd22da68220e67a9a2f8ed9b58cc16884f747457bcaf3542410c22fa84f9b6
Deleted: sha256:507b725581ca5e82d0b7323167942b97b0bc895d6d94e7fd026778ce90f53d9a
Deleted: sha256:eaa0f0f17742fd7221ef10585272252ddb6e486b08ffbb89575a2561da330003
Deleted: sha256:4e2a4fc8931061fc58cbe61920578b9ba7164c11599b03bfcefb4eb38655aa34
Deleted: sha256:a5d597f72d50e6c07fb53f94304959fa3492707c81eb4ee047cd9bce8f37e388
Deleted: sha256:3f79c165968c1a2f547ba76b5c86f49edb82b4ef8837852ad4e7ae6e1664b9be
Deleted: sha256:d94e32dd81e229256d7906009f0ad754e4581fd00be41d3b854583aaf6f08cc5
Deleted: sha256:003a56dd278258f80d9ed1abdeef695c92b4ddc596d05775bd318cc052f1c048
Deleted: sha256:7c61272dfe843a2c715472f0e954d989b72db9d032710c49b1583f06efbb209d
Build step 'Execute shell' marked build as failure
Not sending mail to unregistered user alexander@mesosphere.io

Mime
View raw message