mesos-builds mailing list archives

Site index · List index
Message view « Date » · « Thread »
Top « Date » · « Thread »
From Apache Jenkins Server <jenk...@builds.apache.org>
Subject Build failed in Jenkins: Mesos-Reviewbot #18610
Date Thu, 27 Jul 2017 04:38:16 GMT
See <https://builds.apache.org/job/Mesos-Reviewbot/18610/display/redirect?page=changes>

Changes:

[toenshoff] Added support for OpenSSL's ECDH key exchange.

[toenshoff] Added documentation for LIBPROCESS_SSL_ECDH_CURVE environment variable.

------------------------------------------
[...truncated 30.26 MB...]
I0727 04:38:08.599303  5101 containerizer.cpp:230] Using isolation: posix/cpu,posix/mem,filesystem/posix,network/cni,environment_secret
W0727 04:38:08.600149  5101 backend.cpp:76] Failed to create 'overlay' backend: OverlayBackend
requires root privileges
W0727 04:38:08.600347  5101 backend.cpp:76] Failed to create 'bind' backend: BindBackend requires
root privileges
I0727 04:38:08.600391  5101 provisioner.cpp:255] Using default backend 'copy'
I0727 04:38:08.606521  5125 slave.cpp:250] Mesos agent started on (796)@172.17.0.3:38411
I0727 04:38:08.606564  5125 slave.cpp:251] Flags at startup: --acls="" --appc_simple_discovery_uri_prefix="http://"
--appc_store_dir="/tmp/Endpoint_SlaveEndpointTest_AuthorizedRequest_2_2WHoOK/store/appc" --authenticate_http_readonly="true"
--authenticate_http_readwrite="true" --authenticatee="crammd5" --authentication_backoff_factor="1secs"
--authorizer="local" --cgroups_cpu_enable_pids_and_tids_count="false" --cgroups_enable_cfs="false"
--cgroups_hierarchy="/sys/fs/cgroup" --cgroups_limit_swap="false" --cgroups_root="mesos" --container_disk_watch_interval="15secs"
--containerizers="mesos" --credential="/tmp/Endpoint_SlaveEndpointTest_AuthorizedRequest_2_2WHoOK/credential"
--default_role="*" --disk_watch_interval="1mins" --docker="docker" --docker_kill_orphans="true"
--docker_registry="https://registry-1.docker.io" --docker_remove_delay="6hrs" --docker_socket="/var/run/docker.sock"
--docker_stop_timeout="0ns" --docker_store_dir="/tmp/Endpoint_SlaveEndpointTest_AuthorizedRequest_2_2WHoOK/store/docker"
--docker_volume_checkpoint_dir="/var/run/mesos/isolators/docker/volume" --enforce_container_disk_quota="false"
--executor_registration_timeout="1mins" --executor_reregistration_timeout="2secs" --executor_shutdown_grace_period="5secs"
--fetcher_cache_dir="/tmp/Endpoint_SlaveEndpointTest_AuthorizedRequest_2_2WHoOK/fetch" --fetcher_cache_size="2GB"
--frameworks_home="" --gc_delay="1weeks" --gc_disk_headroom="0.1" --hadoop_home="" --help="false"
--hostname_lookup="true" --http_command_executor="false" --http_credentials="/tmp/Endpoint_SlaveEndpointTest_AuthorizedRequest_2_2WHoOK/http_credentials"
--http_heartbeat_interval="30secs" --initialize_driver_logging="true" --isolation="posix/cpu,posix/mem"
--launcher="posix" --launcher_dir="/mesos/mesos-1.4.0/_build/src" --logbufsecs="0" --logging_level="INFO"
--max_completed_executors_per_framework="150" --oversubscribed_resources_interval="15secs"
--perf_duration="10secs" --perf_interval="1mins" --port="5051" --qos_correction_interval_min="0ns"
--quiet="false" --recover="reconnect" --recovery_timeout="15mins" --registration_backoff_factor="10ms"
--resources="cpus:2;gpus:0;mem:1024;disk:1024;ports:[31000-32000]" --revocable_cpu_low_priority="true"
--runtime_dir="/tmp/Endpoint_SlaveEndpointTest_AuthorizedRequest_2_2WHoOK" --sandbox_directory="/mnt/mesos/sandbox"
--strict="true" --switch_user="true" --systemd_enable_support="true" --systemd_runtime_directory="/run/systemd/system"
--version="false" --work_dir="/tmp/Endpoint_SlaveEndpointTest_AuthorizedRequest_2_VZrZ7y"
I0727 04:38:08.607298  5125 credentials.hpp:86] Loading credential for authentication from
'/tmp/Endpoint_SlaveEndpointTest_AuthorizedRequest_2_2WHoOK/credential'
I0727 04:38:08.607550  5125 slave.cpp:283] Agent using credential for: test-principal
I0727 04:38:08.607573  5125 credentials.hpp:37] Loading credentials for authentication from
'/tmp/Endpoint_SlaveEndpointTest_AuthorizedRequest_2_2WHoOK/http_credentials'
I0727 04:38:08.607918  5125 http.cpp:993] Creating default 'basic' HTTP authenticator for
realm 'mesos-agent-readonly'
I0727 04:38:08.608134  5125 http.cpp:993] Creating default 'basic' HTTP authenticator for
realm 'mesos-agent-readwrite'
I0727 04:38:08.610249  5125 slave.cpp:565] Agent resources: [{"name":"cpus","scalar":{"value":2.0},"type":"SCALAR"},{"name":"mem","scalar":{"value":1024.0},"type":"SCALAR"},{"name":"disk","scalar":{"value":1024.0},"type":"SCALAR"},{"name":"ports","ranges":{"range":[{"begin":31000,"end":32000}]},"type":"RANGES"}]
I0727 04:38:08.610677  5125 slave.cpp:573] Agent attributes: [  ]
I0727 04:38:08.610702  5125 slave.cpp:582] Agent hostname: 3b0966186cf9
I0727 04:38:08.611003  5127 status_update_manager.cpp:177] Pausing sending status updates
I0727 04:38:08.612794  5122 state.cpp:64] Recovering state from '/tmp/Endpoint_SlaveEndpointTest_AuthorizedRequest_2_VZrZ7y/meta'
I0727 04:38:08.613409  5120 status_update_manager.cpp:203] Recovering status update manager
I0727 04:38:08.614156  5124 containerizer.cpp:582] Recovering containerizer
I0727 04:38:08.616266  5124 provisioner.cpp:416] Provisioner recovery complete
I0727 04:38:08.616942  5124 slave.cpp:6207] Finished recovery
I0727 04:38:08.617574  5124 slave.cpp:6389] Querying resource estimator for oversubscribable
resources
I0727 04:38:08.617923  5121 slave.cpp:6403] Received oversubscribable resources {} from the
resource estimator
I0727 04:38:08.621879  5121 process.cpp:3837] Handling HTTP event for process 'slave(796)'
with path: '/slave(796)/containers'
I0727 04:38:08.624065  5124 http.cpp:1133] HTTP GET for /slave(796)/containers from 172.17.0.3:42944
I0727 04:38:08.624199  5124 http.cpp:957] Authorizing principal 'test-principal' to GET the
'/containers' endpoint
I0727 04:38:08.630286  5101 slave.cpp:843] Agent terminating
[       OK ] Endpoint/SlaveEndpointTest.AuthorizedRequest/2 (47 ms)
[ RUN      ] Endpoint/SlaveEndpointTest.UnauthorizedRequest/0
I0727 04:38:08.647436  5101 containerizer.cpp:230] Using isolation: posix/cpu,posix/mem,filesystem/posix,network/cni,environment_secret
W0727 04:38:08.648279  5101 backend.cpp:76] Failed to create 'overlay' backend: OverlayBackend
requires root privileges
W0727 04:38:08.648454  5101 backend.cpp:76] Failed to create 'bind' backend: BindBackend requires
root privileges
I0727 04:38:08.648524  5101 provisioner.cpp:255] Using default backend 'copy'
I0727 04:38:08.653460  5124 slave.cpp:250] Mesos agent started on (797)@172.17.0.3:38411
I0727 04:38:08.653504  5124 slave.cpp:251] Flags at startup: --acls="" --appc_simple_discovery_uri_prefix="http://"
--appc_store_dir="/tmp/Endpoint_SlaveEndpointTest_UnauthorizedRequest_0_WBbxYv/store/appc"
--authenticate_http_readonly="true" --authenticate_http_readwrite="true" --authenticatee="crammd5"
--authentication_backoff_factor="1secs" --authorizer="local" --cgroups_cpu_enable_pids_and_tids_count="false"
--cgroups_enable_cfs="false" --cgroups_hierarchy="/sys/fs/cgroup" --cgroups_limit_swap="false"
--cgroups_root="mesos" --container_disk_watch_interval="15secs" --containerizers="mesos" --credential="/tmp/Endpoint_SlaveEndpointTest_UnauthorizedRequest_0_WBbxYv/credential"
--default_role="*" --disk_watch_interval="1mins" --docker="docker" --docker_kill_orphans="true"
--docker_registry="https://registry-1.docker.io" --docker_remove_delay="6hrs" --docker_socket="/var/run/docker.sock"
--docker_stop_timeout="0ns" --docker_store_dir="/tmp/Endpoint_SlaveEndpointTest_UnauthorizedRequest_0_WBbxYv/store/docker"
--docker_volume_checkpoint_dir="/var/run/mesos/isolators/docker/volume" --enforce_container_disk_quota="false"
--executor_registration_timeout="1mins" --executor_reregistration_timeout="2secs" --executor_shutdown_grace_period="5secs"
--fetcher_cache_dir="/tmp/Endpoint_SlaveEndpointTest_UnauthorizedRequest_0_WBbxYv/fetch" --fetcher_cache_size="2GB"
--frameworks_home="" --gc_delay="1weeks" --gc_disk_headroom="0.1" --hadoop_home="" --help="false"
--hostname_lookup="true" --http_command_executor="false" --http_credentials="/tmp/Endpoint_SlaveEndpointTest_UnauthorizedRequest_0_WBbxYv/http_credentials"
--http_heartbeat_interval="30secs" --initialize_driver_logging="true" --isolation="posix/cpu,posix/mem"
--launcher="posix" --launcher_dir="/mesos/mesos-1.4.0/_build/src" --logbufsecs="0" --logging_level="INFO"
--max_completed_executors_per_framework="150" --oversubscribed_resources_interval="15secs"
--perf_duration="10secs" --perf_interval="1mins" --port="5051" --qos_correction_interval_min="0ns"
--quiet="false" --recover="reconnect" --recovery_timeout="15mins" --registration_backoff_factor="10ms"
--resources="cpus:2;gpus:0;mem:1024;disk:1024;ports:[31000-32000]" --revocable_cpu_low_priority="true"
--runtime_dir="/tmp/Endpoint_SlaveEndpointTest_UnauthorizedRequest_0_WBbxYv" --sandbox_directory="/mnt/mesos/sandbox"
--strict="true" --switch_user="true" --systemd_enable_support="true" --systemd_runtime_directory="/run/systemd/system"
--version="false" --work_dir="/tmp/Endpoint_SlaveEndpointTest_UnauthorizedRequest_0_1UOkak"
I0727 04:38:08.654263  5124 credentials.hpp:86] Loading credential for authentication from
'/tmp/Endpoint_SlaveEndpointTest_UnauthorizedRequest_0_WBbxYv/credential'
I0727 04:38:08.654513  5124 slave.cpp:283] Agent using credential for: test-principal
I0727 04:38:08.654536  5124 credentials.hpp:37] Loading credentials for authentication from
'/tmp/Endpoint_SlaveEndpointTest_UnauthorizedRequest_0_WBbxYv/http_credentials'
I0727 04:38:08.654882  5124 http.cpp:993] Creating default 'basic' HTTP authenticator for
realm 'mesos-agent-readonly'
I0727 04:38:08.655102  5124 http.cpp:993] Creating default 'basic' HTTP authenticator for
realm 'mesos-agent-readwrite'
I0727 04:38:08.657179  5124 slave.cpp:565] Agent resources: [{"name":"cpus","scalar":{"value":2.0},"type":"SCALAR"},{"name":"mem","scalar":{"value":1024.0},"type":"SCALAR"},{"name":"disk","scalar":{"value":1024.0},"type":"SCALAR"},{"name":"ports","ranges":{"range":[{"begin":31000,"end":32000}]},"type":"RANGES"}]
I0727 04:38:08.657609  5124 slave.cpp:573] Agent attributes: [  ]
I0727 04:38:08.657632  5124 slave.cpp:582] Agent hostname: 3b0966186cf9
I0727 04:38:08.657846  5123 status_update_manager.cpp:177] Pausing sending status updates
I0727 04:38:08.659680  5120 state.cpp:64] Recovering state from '/tmp/Endpoint_SlaveEndpointTest_UnauthorizedRequest_0_1UOkak/meta'
I0727 04:38:08.660431  5126 status_update_manager.cpp:203] Recovering status update manager
I0727 04:38:08.660697  5126 containerizer.cpp:582] Recovering containerizer
I0727 04:38:08.662932  5126 provisioner.cpp:416] Provisioner recovery complete
I0727 04:38:08.663760  5122 slave.cpp:6207] Finished recovery
I0727 04:38:08.664427  5122 slave.cpp:6389] Querying resource estimator for oversubscribable
resources
I0727 04:38:08.664809  5121 slave.cpp:6403] Received oversubscribable resources {} from the
resource estimator
I0727 04:38:08.668984  5121 process.cpp:3837] Handling HTTP event for process 'slave(797)'
with path: '/slave(797)/monitor/statistics'
I0727 04:38:08.671010  5123 http.cpp:1133] HTTP GET for /slave(797)/monitor/statistics from
172.17.0.3:42946
I0727 04:38:08.671140  5123 http.cpp:957] Authorizing principal 'test-principal' to GET the
'/monitor/statistics' endpoint
I0727 04:38:08.681422  5101 slave.cpp:843] Agent terminating
[       OK ] Endpoint/SlaveEndpointTest.UnauthorizedRequest/0 (51 ms)
[ RUN      ] Endpoint/SlaveEndpointTest.UnauthorizedRequest/1
I0727 04:38:08.698760  5101 containerizer.cpp:230] Using isolation: posix/cpu,posix/mem,filesystem/posix,network/cni,environment_secret
W0727 04:38:08.699616  5101 backend.cpp:76] Failed to create 'overlay' backend: OverlayBackend
requires root privileges
W0727 04:38:08.699817  5101 backend.cpp:76] Failed to create 'bind' backend: BindBackend requires
root privileges
I0727 04:38:08.699877  5101 provisioner.cpp:255] Using default backend 'copy'
I0727 04:38:08.705003  5122 slave.cpp:250] Mesos agent started on (798)@172.17.0.3:38411
I0727 04:38:08.705049  5122 slave.cpp:251] Flags at startup: --acls="" --appc_simple_discovery_uri_prefix="http://"
--appc_store_dir="/tmp/Endpoint_SlaveEndpointTest_UnauthorizedRequest_1_kGI9Eh/store/appc"
--authenticate_http_readonly="true" --authenticate_http_readwrite="true" --authenticatee="crammd5"
--authentication_backoff_factor="1secs" --authorizer="local" --cgroups_cpu_enable_pids_and_tids_count="false"
--cgroups_enable_cfs="false" --cgroups_hierarchy="/sys/fs/cgroup" --cgroups_limit_swap="false"
--cgroups_root="mesos" --container_disk_watch_interval="15secs" --containerizers="mesos" --credential="/tmp/Endpoint_SlaveEndpointTest_UnauthorizedRequest_1_kGI9Eh/credential"
--default_role="*" --disk_watch_interval="1mins" --docker="docker" --docker_kill_orphans="true"
--docker_registry="https://registry-1.docker.io" --docker_remove_delay="6hrs" --docker_socket="/var/run/docker.sock"
--docker_stop_timeout="0ns" --docker_store_dir="/tmp/Endpoint_SlaveEndpointTest_UnauthorizedRequest_1_kGI9Eh/store/docker"
--docker_volume_checkpoint_dir="/var/run/mesos/isolators/docker/volume" --enforce_container_disk_quota="false"
--executor_registration_timeout="1mins" --executor_reregistration_timeout="2secs" --executor_shutdown_grace_period="5secs"
--fetcher_cache_dir="/tmp/Endpoint_SlaveEndpointTest_UnauthorizedRequest_1_kGI9Eh/fetch" --fetcher_cache_size="2GB"
--frameworks_home="" --gc_delay="1weeks" --gc_disk_headroom="0.1" --hadoop_home="" --help="false"
--hostname_lookup="true" --http_command_executor="false" --http_credentials="/tmp/Endpoint_SlaveEndpointTest_UnauthorizedRequest_1_kGI9Eh/http_credentials"
--http_heartbeat_interval="30secs" --initialize_driver_logging="true" --isolation="posix/cpu,posix/mem"
--launcher="posix" --launcher_dir="/mesos/mesos-1.4.0/_build/src" --logbufsecs="0" --logging_level="INFO"
--max_completed_executors_per_framework="150" --oversubscribed_resources_interval="15secs"
--perf_duration="10secs" --perf_interval="1mins" --port="5051" --qos_correction_interval_min="0ns"
--quiet="false" --recover="reconnect" --recovery_timeout="15mins" --registration_backoff_factor="10ms"
--resources="cpus:2;gpus:0;mem:1024;disk:1024;ports:[31000-32000]" --revocable_cpu_low_priority="true"
--runtime_dir="/tmp/Endpoint_SlaveEndpointTest_UnauthorizedRequest_1_kGI9Eh" --sandbox_directory="/mnt/mesos/sandbox"
--strict="true" --switch_user="true" --systemd_enable_support="true" --systemd_runtime_directory="/run/systemd/system"
--version="false" --work_dir="/tmp/Endpoint_SlaveEndpointTest_UnauthorizedRequest_1_JF4EI5"
I0727 04:38:08.705782  5122 credentials.hpp:86] Loading credential for authentication from
'/tmp/Endpoint_SlaveEndpointTest_UnauthorizedRequest_1_kGI9Eh/credential'
I0727 04:38:08.706051  5122 slave.cpp:283] Agent using credential for: test-principal
I0727 04:38:08.706084  5122 credentials.hpp:37] Loading credentials for authentication from
'/tmp/Endpoint_SlaveEndpointTest_UnauthorizedRequest_1_kGI9Eh/http_credentials'
I0727 04:38:08.706529  5122 http.cpp:993] Creating default 'basic' HTTP authenticator for
realm 'mesos-agent-readonly'
I0727 04:38:08.706774  5122 http.cpp:993] Creating default 'basic' HTTP authenticator for
realm 'mesos-agent-readwrite'
I0727 04:38:08.708909  5122 slave.cpp:565] Agent resources: [{"name":"cpus","scalar":{"value":2.0},"type":"SCALAR"},{"name":"mem","scalar":{"value":1024.0},"type":"SCALAR"},{"name":"disk","scalar":{"value":1024.0},"type":"SCALAR"},{"name":"ports","ranges":{"range":[{"begin":31000,"end":32000}]},"type":"RANGES"}]
I0727 04:38:08.709341  5122 slave.cpp:573] Agent attributes: [  ]
I0727 04:38:08.709362  5122 slave.cpp:582] Agent hostname: 3b0966186cf9
I0727 04:38:08.709652  5123 status_update_manager.cpp:177] Pausing sending status updates
I0727 04:38:08.711436  5125 state.cpp:64] Recovering state from '/tmp/Endpoint_SlaveEndpointTest_UnauthorizedRequest_1_JF4EI5/meta'
I0727 04:38:08.711925  5123 status_update_manager.cpp:203] Recovering status update manager
I0727 04:38:08.712359  5124 containerizer.cpp:582] Recovering containerizer
I0727 04:38:08.714464  5124 provisioner.cpp:416] Provisioner recovery complete
I0727 04:38:08.715245  5122 slave.cpp:6207] Finished recovery
I0727 04:38:08.715875  5122 slave.cpp:6389] Querying resource estimator for oversubscribable
resources
I0727 04:38:08.716250  5125 slave.cpp:6403] Received oversubscribable resources {} from the
resource estimator
I0727 04:38:08.720393  5121 process.cpp:3837] Handling HTTP event for process 'slave(798)'
with path: '/slave(798)/monitor/statistics.json'
I0727 04:38:08.722476  5125 http.cpp:1133] HTTP GET for /slave(798)/monitor/statistics.json
from 172.17.0.3:42948
I0727 04:38:08.722599  5125 http.cpp:957] Authorizing principal 'test-principal' to GET the
'/monitor/statistics.json' endpoint
I0727 04:38:08.726752  5125 slave.cpp:843] Agent terminating
[       OK ] Endpoint/SlaveEndpointTest.UnauthorizedRequest/1 (45 ms)
[ RUN      ] Endpoint/SlaveEndpointTest.UnauthorizedRequest/2
I0727 04:38:08.743741  5101 containerizer.cpp:230] Using isolation: posix/cpu,posix/mem,filesystem/posix,network/cni,environment_secret
W0727 04:38:08.744603  5101 backend.cpp:76] Failed to create 'overlay' backend: OverlayBackend
requires root privileges
W0727 04:38:08.744778  5101 backend.cpp:76] Failed to create 'bind' backend: BindBackend requires
root privileges
I0727 04:38:08.744845  5101 provisioner.cpp:255] Using default backend 'copy'
I0727 04:38:08.750514  5122 slave.cpp:250] Mesos agent started on (799)@172.17.0.3:38411
I0727 04:38:08.750555  5122 slave.cpp:251] Flags at startup: --acls="" --appc_simple_discovery_uri_prefix="http://"
--appc_store_dir="/tmp/Endpoint_SlaveEndpointTest_UnauthorizedRequest_2_0NA5P3/store/appc"
--authenticate_http_readonly="true" --authenticate_http_readwrite="true" --authenticatee="crammd5"
--authentication_backoff_factor="1secs" --authorizer="local" --cgroups_cpu_enable_pids_and_tids_count="false"
--cgroups_enable_cfs="false" --cgroups_hierarchy="/sys/fs/cgroup" --cgroups_limit_swap="false"
--cgroups_root="mesos" --container_disk_watch_interval="15secs" --containerizers="mesos" --credential="/tmp/Endpoint_SlaveEndpointTest_UnauthorizedRequest_2_0NA5P3/credential"
--default_role="*" --disk_watch_interval="1mins" --docker="docker" --docker_kill_orphans="true"
--docker_registry="https://registry-1.docker.io" --docker_remove_delay="6hrs" --docker_socket="/var/run/docker.sock"
--docker_stop_timeout="0ns" --docker_store_dir="/tmp/Endpoint_SlaveEndpointTest_UnauthorizedRequest_2_0NA5P3/store/docker"
--docker_volume_checkpoint_dir="/var/run/mesos/isolators/docker/volume" --enforce_container_disk_quota="false"
--executor_registration_timeout="1mins" --executor_reregistration_timeout="2secs" --executor_shutdown_grace_period="5secs"
--fetcher_cache_dir="/tmp/Endpoint_SlaveEndpointTest_UnauthorizedRequest_2_0NA5P3/fetch" --fetcher_cache_size="2GB"
--frameworks_home="" --gc_delay="1weeks" --gc_disk_headroom="0.1" --hadoop_home="" --help="false"
--hostname_lookup="true" --http_command_executor="false" --http_credentials="/tmp/Endpoint_SlaveEndpointTest_UnauthorizedRequest_2_0NA5P3/http_credentials"
--http_heartbeat_interval="30secs" --initialize_driver_logging="true" --isolation="posix/cpu,posix/mem"
--launcher="posix" --launcher_dir="/mesos/mesos-1.4.0/_build/src" --logbufsecs="0" --logging_level="INFO"
--max_completed_executors_per_framework="150" --oversubscribed_resources_interval="15secs"
--perf_duration="10secs" --perf_interval="1mins" --port="5051" --qos_correction_interval_min="0ns"
--quiet="false" --recover="reconnect" --recovery_timeout="15mins" --registration_backoff_factor="10ms"
--resources="cpus:2;gpus:0;mem:1024;disk:1024;ports:[31000-32000]" --revocable_cpu_low_priority="true"
--runtime_dir="/tmp/Endpoint_SlaveEndpointTest_UnauthorizedRequest_2_0NA5P3" --sandbox_directory="/mnt/mesos/sandbox"
--strict="true" --switch_user="true" --systemd_enable_support="true" --systemd_runtime_directory="/run/systemd/system"
--version="false" --work_dir="/tmp/Endpoint_SlaveEndpointTest_UnauthorizedRequest_2_9eBgMR"
I0727 04:38:08.751260  5122 credentials.hpp:86] Loading credential for authentication from
'/tmp/Endpoint_SlaveEndpointTest_UnauthorizedRequest_2_0NA5P3/credential'
I0727 04:38:08.751512  5122 slave.cpp:283] Agent using credential for: test-principal
I0727 04:38:08.751538  5122 credentials.hpp:37] Loading credentials for authentication from
'/tmp/Endpoint_SlaveEndpointTest_UnauthorizedRequest_2_0NA5P3/http_credentials'
I0727 04:38:08.751881  5122 http.cpp:993] Creating default 'basic' HTTP authenticator for
realm 'mesos-agent-readonly'
I0727 04:38:08.752104  5122 http.cpp:993] Creating default 'basic' HTTP authenticator for
realm 'mesos-agent-readwrite'
I0727 04:38:08.754266  5122 slave.cpp:565] Agent resources: [{"name":"cpus","scalar":{"value":2.0},"type":"SCALAR"},{"name":"mem","scalar":{"value":1024.0},"type":"SCALAR"},{"name":"disk","scalar":{"value":1024.0},"type":"SCALAR"},{"name":"ports","ranges":{"range":[{"begin":31000,"end":32000}]},"type":"RANGES"}]
I0727 04:38:08.754695  5122 slave.cpp:573] Agent attributes: [  ]
I0727 04:38:08.754715  5122 slave.cpp:582] Agent hostname: 3b0966186cf9
I0727 04:38:08.754958  5127 status_update_manager.cpp:177] Pausing sending status updates
I0727 04:38:08.757062  5122 state.cpp:64] Recovering state from '/tmp/Endpoint_SlaveEndpointTest_UnauthorizedRequest_2_9eBgMR/meta'
I0727 04:38:08.757527  5120 status_update_manager.cpp:203] Recovering status update manager
I0727 04:38:08.758009  5126 containerizer.cpp:582] Recovering containerizer
I0727 04:38:08.760337  5124 provisioner.cpp:416] Provisioner recovery complete
I0727 04:38:08.760990  5127 slave.cpp:6207] Finished recovery
I0727 04:38:08.761703  5127 slave.cpp:6389] Querying resource estimator for oversubscribable
resources
I0727 04:38:08.762022  5127 slave.cpp:6403] Received oversubscribable resources {} from the
resource estimator
I0727 04:38:08.767208  5127 process.cpp:3837] Handling HTTP event for process 'slave(799)'
with path: '/slave(799)/containers'
I0727 04:38:08.769847  5124 http.cpp:1133] HTTP GET for /slave(799)/containers from 172.17.0.3:42950
I0727 04:38:08.769974  5124 http.cpp:957] Authorizing principal 'test-principal' to GET the
'/containers' endpoint
I0727 04:38:08.773571  5123 slave.cpp:843] Agent terminating
[       OK ] Endpoint/SlaveEndpointTest.UnauthorizedRequest/2 (46 ms)
[ RUN      ] Endpoint/SlaveEndpointTest.NoAuthorizer/0
I0727 04:38:08.790693  5101 containerizer.cpp:230] Using isolation: posix/cpu,posix/mem,filesystem/posix,network/cni,environment_secret
W0727 04:38:08.791545  5101 backend.cpp:76] Failed to create 'overlay' backend: OverlayBackend
requires root privileges
W0727 04:38:08.791741  5101 backend.cpp:76] Failed to create 'bind' backend: BindBackend requires
root privileges
I0727 04:38:08.791800  5101 provisioner.cpp:255] Using default backend 'copy'
I0727 04:38:08.794260  5101 cluster.cpp:448] Creating default 'local' authorizer
I0727 04:38:08.797142  5127 slave.cpp:250] Mesos agent started on (800)@172.17.0.3:38411
I0727 04:38:08.797183  5127 slave.cpp:251] Flags at startup: --acls="" --appc_simple_discovery_uri_prefix="http://"
--appc_store_dir="/tmp/Endpoint_SlaveEndpointTest_NoAuthorizer_0_Wpy1uQ/store/appc" --authenticate_http_readonly="true"
--authenticate_http_readwrite="true" --authenticatee="crammd5" --authentication_backoff_factor="1secs"
--authorizer="local" --cgroups_cpu_enable_pids_and_tids_count="false" --cgroups_enable_cfs="false"
--cgroups_hierarchy="/sys/fs/cgroup" --cgroups_limit_swap="false" --cgroups_root="mesos" --container_disk_watch_interval="15secs"
--containerizers="mesos" --credential="/tmp/Endpoint_SlaveEndpointTest_NoAuthorizer_0_Wpy1uQ/credential"
--default_role="*" --disk_watch_interval="1mins" --docker="docker" --docker_kill_orphans="true"
--docker_registry="https://registry-1.docker.io" --docker_remove_delay="6hrs" --docker_socket="/var/run/docker.sock"
--docker_stop_timeout="0ns" --docker_store_dir="/tmp/Endpoint_SlaveEndpointTest_NoAuthorizer_0_Wpy1uQ/store/docker"
--docker_volume_checkpoint_dir="/var/run/mesos/isolators/docker/volume" --enforce_container_disk_quota="false"
--executor_registration_timeout="1mins" --executor_reregistration_timeout="2secs" --executor_shutdown_grace_period="5secs"
--fetcher_cache_dir="/tmp/Endpoint_SlaveEndpointTest_NoAuthorizer_0_Wpy1uQ/fetch" --fetcher_cache_size="2GB"
--frameworks_home="" --gc_delay="1weeks" --gc_disk_headroom="0.1" --hadoop_home="" --help="false"
--hostname_lookup="true" --http_command_executor="false" --http_credentials="/tmp/Endpoint_SlaveEndpointTest_NoAuthorizer_0_Wpy1uQ/http_credentials"
--http_heartbeat_interval="30secs" --initialize_driver_logging="true" --isolation="posix/cpu,posix/mem"
--launcher="posix" --launcher_dir="/mesos/mesos-1.4.0/_build/src" --logbufsecs="0" --logging_level="INFO"
--max_completed_executors_per_framework="150" --oversubscribed_resources_interval="15secs"
--perf_duration="10secs" --perf_interval="1mins" --port="5051" --qos_correction_interval_min="0ns"
--quiet="false" --recover="reconnect" --recovery_timeout="15mins" --registration_backoff_factor="10ms"
--resources="cpus:2;gpus:0;mem:1024;disk:1024;ports:[31000-32000]" --revocable_cpu_low_priority="true"
--runtime_dir="/tmp/Endpoint_SlaveEndpointTest_NoAuthorizer_0_Wpy1uQ" --sandbox_directory="/mnt/mesos/sandbox"
--strict="true" --switch_user="true" --systemd_enable_support="true" --systemd_runtime_directory="/run/systemd/system"
--version="false" --work_dir="/tmp/Endpoint_SlaveEndpointTest_NoAuthorizer_0_3b2FjE"
I0727 04:38:08.797991  5127 credentials.hpp:86] Loading credential for authentication from
'/tmp/Endpoint_SlaveEndpointTest_NoAuthorizer_0_Wpy1uQ/credential'
I0727 04:38:08.798460  5127 slave.cpp:283] Agent using credential for: test-principal
I0727 04:38:08.798496  5127 credentials.hpp:37] Loading credentials for authentication from
'/tmp/Endpoint_SlaveEndpointTest_NoAuthorizer_0_Wpy1uQ/http_credentials'
I0727 04:38:08.799005  5127 http.cpp:993] Creating default 'basic' HTTP authenticator for
realm 'mesos-agent-readonly'
I0727 04:38:08.799371  5127 http.cpp:993] Creating default 'basic' HTTP authenticator for
realm 'mesos-agent-readwrite'
I0727 04:38:08.801666  5127 slave.cpp:565] Agent resources: [{"name":"cpus","scalar":{"value":2.0},"type":"SCALAR"},{"name":"mem","scalar":{"value":1024.0},"type":"SCALAR"},{"name":"disk","scalar":{"value":1024.0},"type":"SCALAR"},{"name":"ports","ranges":{"range":[{"begin":31000,"end":32000}]},"type":"RANGES"}]
I0727 04:38:08.802096  5127 slave.cpp:573] Agent attributes: [  ]
I0727 04:38:08.802115  5127 slave.cpp:582] Agent hostname: 3b0966186cf9
I0727 04:38:08.802438  5122 status_update_manager.cpp:177] Pausing sending status updates
I0727 04:38:08.804514  5120 state.cpp:64] Recovering state from '/tmp/Endpoint_SlaveEndpointTest_NoAuthorizer_0_3b2FjE/meta'
I0727 04:38:08.805167  5126 status_update_manager.cpp:203] Recovering status update manager
I0727 04:38:08.805611  5124 containerizer.cpp:582] Recovering containerizer
I0727 04:38:08.807989  5127 provisioner.cpp:416] Provisioner recovery complete
I0727 04:38:08.808751  5122 slave.cpp:6207] Finished recovery
I0727 04:38:08.809558  5122 slave.cpp:6389] Querying resource estimator for oversubscribable
resources
I0727 04:38:08.809912  5125 slave.cpp:6403] Received oversubscribable resources {} from the
resource estimator
I0727 04:38:08.814154  5126 process.cpp:3837] Handling HTTP event for process 'slave(800)'
with path: '/slave(800)/monitor/statistics'
I0727 04:38:08.816107  5125 http.cpp:1133] HTTP GET for /slave(800)/monitor/statistics from
172.17.0.3:42952
I0727 04:38:08.816231  5125 http.cpp:957] Authorizing principal 'test-principal' to GET the
'/monitor/statistics' endpoint
I0727 04:38:08.821756  5125 slave.cpp:843] Agent terminating
[       OK ] Endpoint/SlaveEndpointTest.NoAuthorizer/0 (48 ms)
[ RUN      ] Endpoint/SlaveEndpointTest.NoAuthorizer/1
I0727 04:38:08.839177  5101 containerizer.cpp:230] Using isolation: posix/cpu,posix/mem,filesystem/posix,network/cni,environment_secret
W0727 04:38:08.840039  5101 backend.cpp:76] Failed to create 'overlay' backend: OverlayBackend
requires root privileges
W0727 04:38:08.840237  5101 backend.cpp:76] Failed to create 'bind' backend: BindBackend requires
root privileges
I0727 04:38:08.840298  5101 provisioner.cpp:255] Using default backend 'copy'
I0727 04:38:08.842711  5101 cluster.cpp:448] Creating default 'local' authorizer
I0727 04:38:08.845556  5123 slave.cpp:250] Mesos agent started on (801)@172.17.0.3:38411
I0727 04:38:08.845597  5123 slave.cpp:251] Flags at startup: --acls="" --appc_simple_discovery_uri_prefix="http://"
--appc_store_dir="/tmp/Endpoint_SlaveEndpointTest_NoAuthorizer_1_mvbhFD/store/appc" --authenticate_http_readonly="true"
--authenticate_http_readwrite="true" --authenticatee="crammd5" --authentication_backoff_factor="1secs"
--authorizer="local" --cgroups_cpu_enable_pids_and_tids_count="false" --cgroups_enable_cfs="false"
--cgroups_hierarchy="/sys/fs/cgroup" --cgroups_limit_swap="false" --cgroups_root="mesos" --container_disk_watch_interval="15secs"
--containerizers="mesos" --credential="/tmp/Endpoint_SlaveEndpointTest_NoAuthorizer_1_mvbhFD/credential"
--default_role="*" --disk_watch_interval="1mins" --docker="docker" --docker_kill_orphans="true"
--docker_registry="https://registry-1.docker.io" --docker_remove_delay="6hrs" --docker_socket="/var/run/docker.sock"
--docker_stop_timeout="0ns" --docker_store_dir="/tmp/Endpoint_SlaveEndpointTest_NoAuthorizer_1_mvbhFD/store/docker"
--docker_volume_checkpoint_dir="/var/run/mesos/isolators/docker/volume" --enforce_container_disk_quota="false"
--executor_registration_timeout="1mins" --executor_reregistration_timeout="2secs" --executor_shutdown_grace_period="5secs"
--fetcher_cache_dir="/tmp/Endpoint_SlaveEndpointTest_NoAuthorizer_1_mvbhFD/fetch" --fetcher_cache_size="2GB"
--frameworks_home="" --gc_delay="1weeks" --gc_disk_headroom="0.1" --hadoop_home="" --help="false"
--hostname_lookup="true" --http_command_executor="false" --http_credentials="/tmp/Endpoint_SlaveEndpointTest_NoAuthorizer_1_mvbhFD/http_credentials"
--http_heartbeat_interval="30secs" --initialize_driver_logging="true" --isolation="posix/cpu,posix/mem"
--launcher="posix" --launcher_dir="/mesos/mesos-1.4.0/_build/src" --logbufsecs="0" --logging_level="INFO"
--max_completed_executors_per_framework="150" --oversubscribed_resources_interval="15secs"
--perf_duration="10secs" --perf_interval="1mins" --port="5051" --qos_correction_interval_min="0ns"
--quiet="false" --recover="reconnect" --recovery_timeout="15mins" --registration_backoff_factor="10ms"
--resources="cpus:2;gpus:0;mem:1024;disk:1024;ports:[31000-32000]" --revocable_cpu_low_priority="true"
--runtime_dir="/tmp/Endpoint_SlaveEndpointTest_NoAuthorizer_1_mvbhFD" --sandbox_directory="/mnt/mesos/sandbox"
--strict="true" --switch_user="true" --systemd_enable_support="true" --systemd_runtime_directory="/run/systemd/system"
--version="false" --work_dir="/tmp/Endpoint_SlaveEndpointTest_NoAuthorizer_1_rqm4lr"
I0727 04:38:08.846456  5123 credentials.hpp:86] Loading credential for authentication from
'/tmp/Endpoint_SlaveEndpointTest_NoAuthorizer_1_mvbhFD/credential'
I0727 04:38:08.846880  5123 slave.cpp:283] Agent using credential for: test-principal
I0727 04:38:08.846915  5123 credentials.hpp:37] Loading credentials for authentication from
'/tmp/Endpoint_SlaveEndpointTest_NoAuthorizer_1_mvbhFD/http_credentials'
I0727 04:38:08.847381  5123 http.cpp:993] Creating default 'basic' HTTP authenticator for
realm 'mesos-agent-readonly'
I0727 04:38:08.847693  5123 http.cpp:993] Creating default 'basic' HTTP authenticator for
realm 'mesos-agent-readwrite'
I0727 04:38:08.850217  5123 slave.cpp:565] Agent resources: [{"name":"cpus","scalar":{"value":2.0},"type":"SCALAR"},{"name":"mem","scalar":{"value":1024.0},"type":"SCALAR"},{"name":"disk","scalar":{"value":1024.0},"type":"SCALAR"},{"name":"ports","ranges":{"range":[{"begin":31000,"end":32000}]},"type":"RANGES"}]
I0727 04:38:08.850656  5123 slave.cpp:573] Agent attributes: [  ]
I0727 04:38:08.850675  5123 slave.cpp:582] Agent hostname: 3b0966186cf9
I0727 04:38:08.850994  5127 status_update_manager.cpp:177] Pausing sending status updates
I0727 04:38:08.852983  5127 state.cpp:64] Recovering state from '/tmp/Endpoint_SlaveEndpointTest_NoAuthorizer_1_rqm4lr/meta'
I0727 04:38:08.853530  5123 status_update_manager.cpp:203] Recovering status update manager
I0727 04:38:08.854092  5127 containerizer.cpp:582] Recovering containerizer
I0727 04:38:08.856420  5125 provisioner.cpp:416] Provisioner recovery complete
I0727 04:38:08.857012  5121 slave.cpp:6207] Finished recovery
I0727 04:38:08.857750  5121 slave.cpp:6389] Querying resource estimator for oversubscribable
resources
I0727 04:38:08.858290  5125 slave.cpp:6403] Received oversubscribable resources {} from the
resource estimator
I0727 04:38:08.872824  5123 process.cpp:3837] Handling HTTP event for process 'slave(801)'
with path: '/slave(801)/monitor/statistics.json'
I0727 04:38:08.875025  5124 http.cpp:1133] HTTP GET for /slave(801)/monitor/statistics.json
from 172.17.0.3:42954
I0727 04:38:08.875167  5124 http.cpp:957] Authorizing principal 'test-principal' to GET the
'/monitor/statistics.json' endpoint
I0727 04:38:08.881074  5124 slave.cpp:843] Agent terminating
[       OK ] Endpoint/SlaveEndpointTest.NoAuthorizer/1 (70 ms)
[ RUN      ] Endpoint/SlaveEndpointTest.NoAuthorizer/2
I0727 04:38:08.909430  5101 containerizer.cpp:230] Using isolation: posix/cpu,posix/mem,filesystem/posix,network/cni,environment_secret
W0727 04:38:08.910249  5101 backend.cpp:76] Failed to create 'overlay' backend: OverlayBackend
requires root privileges
W0727 04:38:08.910426  5101 backend.cpp:76] Failed to create 'bind' backend: BindBackend requires
root privileges
I0727 04:38:08.910470  5101 provisioner.cpp:255] Using default backend 'copy'
I0727 04:38:08.912899  5101 cluster.cpp:448] Creating default 'local' authorizer
I0727 04:38:08.915771  5124 slave.cpp:250] Mesos agent started on (802)@172.17.0.3:38411
I0727 04:38:08.915820  5124 slave.cpp:251] Flags at startup: --acls="" --appc_simple_discovery_uri_prefix="http://"
--appc_store_dir="/tmp/Endpoint_SlaveEndpointTest_NoAuthorizer_2_6eItvr/store/appc" --authenticate_http_readonly="true"
--authenticate_http_readwrite="true" --authenticatee="crammd5" --authentication_backoff_factor="1secs"
--authorizer="local" --cgroups_cpu_enable_pids_and_tids_count="false" --cgroups_enable_cfs="false"
--cgroups_hierarchy="/sys/fs/cgroup" --cgroups_limit_swap="false" --cgroups_root="mesos" --container_disk_watch_interval="15secs"
--containerizers="mesos" --credential="/tmp/Endpoint_SlaveEndpointTest_NoAuthorizer_2_6eItvr/credential"
--default_role="*" --disk_watch_interval="1mins" --docker="docker" --docker_kill_orphans="true"
--docker_registry="https://registry-1.docker.io" --docker_remove_delay="6hrs" --docker_socket="/var/run/docker.sock"
--docker_stop_timeout="0ns" --docker_store_dir="/tmp/Endpoint_SlaveEndpointTest_NoAuthorizer_2_6eItvr/store/docker"
--docker_volume_checkpoint_dir="/var/run/mesos/isolators/docker/volume" --enforce_container_disk_quota="false"
--executor_registration_timeout="1mins" --executor_reregistration_timeout="2secs" --executor_shutdown_grace_period="5secs"
--fetcher_cache_dir="/tmp/Endpoint_SlaveEndpointTest_NoAuthorizer_2_6eItvr/fetch" --fetcher_cache_size="2GB"
--frameworks_home="" --gc_delay="1weeks" --gc_disk_headroom="0.1" --hadoop_home="" --help="false"
--hostname_lookup="true" --http_command_executor="false" --http_credentials="/tmp/Endpoint_SlaveEndpointTest_NoAuthorizer_2_6eItvr/http_credentials"
--http_heartbeat_interval="30secs" --initialize_driver_logging="true" --isolation="posix/cpu,posix/mem"
--launcher="posix" --launcher_dir="/mesos/mesos-1.4.0/_build/src" --logbufsecs="0" --logging_level="INFO"
--max_completed_executors_per_framework="150" --oversubscribed_resources_interval="15secs"
--perf_duration="10secs" --perf_interval="1mins" --port="5051" --qos_correction_interval_min="0ns"
--quiet="false" --recover="reconnect" --recovery_timeout="15mins" --registration_backoff_factor="10ms"
--resources="cpus:2;gpus:0;mem:1024;disk:1024;ports:[31000-32000]" --revocable_cpu_low_priority="true"
--runtime_dir="/tmp/Endpoint_SlaveEndpointTest_NoAuthorizer_2_6eItvr" --sandbox_directory="/mnt/mesos/sandbox"
--strict="true" --switch_user="true" --systemd_enable_support="true" --systemd_runtime_directory="/run/systemd/system"
--version="false" --work_dir="/tmp/Endpoint_SlaveEndpointTest_NoAuthorizer_2_xzsT0e"
I0727 04:38:08.916584  5124 credentials.hpp:86] Loading credential for authentication from
'/tmp/Endpoint_SlaveEndpointTest_NoAuthorizer_2_6eItvr/credential'
I0727 04:38:08.916848  5124 slave.cpp:283] Agent using credential for: test-principal
I0727 04:38:08.916877  5124 credentials.hpp:37] Loading credentials for authentication from
'/tmp/Endpoint_SlaveEndpointTest_NoAuthorizer_2_6eItvr/http_credentials'
I0727 04:38:08.917263  5124 http.cpp:993] Creating default 'basic' HTTP authenticator for
realm 'mesos-agent-readonly'
I0727 04:38:08.917524  5124 http.cpp:993] Creating default 'basic' HTTP authenticator for
realm 'mesos-agent-readwrite'
I0727 04:38:08.919885  5124 slave.cpp:565] Agent resources: [{"name":"cpus","scalar":{"value":2.0},"type":"SCALAR"},{"name":"mem","scalar":{"value":1024.0},"type":"SCALAR"},{"name":"disk","scalar":{"value":1024.0},"type":"SCALAR"},{"name":"ports","ranges":{"range":[{"begin":31000,"end":32000}]},"type":"RANGES"}]
I0727 04:38:08.920344  5124 slave.cpp:573] Agent attributes: [  ]
I0727 04:38:08.920369  5124 slave.cpp:582] Agent hostname: 3b0966186cf9
I0727 04:38:08.920610  5121 status_update_manager.cpp:177] Pausing sending status updates
I0727 04:38:08.922683  5121 state.cpp:64] Recovering state from '/tmp/Endpoint_SlaveEndpointTest_NoAuthorizer_2_xzsT0e/meta'
I0727 04:38:08.923260  5127 status_update_manager.cpp:203] Recovering status update manager
I0727 04:38:08.923596  5121 containerizer.cpp:582] Recovering containerizer
I0727 04:38:08.933374  5121 provisioner.cpp:416] Provisioner recovery complete
I0727 04:38:08.933979  5127 slave.cpp:6207] Finished recovery
I0727 04:38:08.934747  5127 slave.cpp:6389] Querying resource estimator for oversubscribable
resources
I0727 04:38:08.935230  5126 slave.cpp:6403] Received oversubscribable resources {} from the
resource estimator
I0727 04:38:08.939667  5127 process.cpp:3837] Handling HTTP event for process 'slave(802)'
with path: '/slave(802)/containers'
I0727 04:38:08.942181  5123 http.cpp:1133] HTTP GET for /slave(802)/containers from 172.17.0.3:42956
I0727 04:38:08.942313  5123 http.cpp:957] Authorizing principal 'test-principal' to GET the
'/containers' endpoint
I0727 04:38:08.949043  5101 slave.cpp:843] Agent terminating
[       OK ] Endpoint/SlaveEndpointTest.NoAuthorizer/2 (57 ms)
[----------] 9 tests from Endpoint/SlaveEndpointTest (464 ms total)

[----------] Global test environment tear-down
[==========] 1649 tests from 181 test cases ran. (742379 ms total)
[  PASSED  ] 1645 tests.
[  FAILED  ] 4 tests, listed below:
[  FAILED  ] DefaultExecutorCheckTest.CommandCheckDeliveredAndReconciled
[  FAILED  ] DefaultExecutorCheckTest.CommandCheckStatusChange
[  FAILED  ] DefaultExecutorCheckTest.CommandCheckSeesParentsEnv
[  FAILED  ] DefaultExecutorCheckTest.CommandCheckSharesWorkDirWithTask

 4 FAILED TESTS
  YOU HAVE 20 DISABLED TESTS

I0727 04:38:09.095098  5128 process.cpp:1006] Failed to accept socket: future discarded
make[4]: *** [check-local] Error 1
make[4]: Leaving directory `/mesos/mesos-1.4.0/_build/src'
make[3]: *** [check-am] Error 2
make[3]: Leaving directory `/mesos/mesos-1.4.0/_build/src'
make[2]: *** [check] Error 2
make[2]: Leaving directory `/mesos/mesos-1.4.0/_build/src'
make[1]: *** [check-recursive] Error 1
make[1]: Leaving directory `/mesos/mesos-1.4.0/_build'
make: *** [distcheck] Error 1
+ docker rmi mesos-1501124072-27203
Untagged: mesos-1501124072-27203:latest
Deleted: sha256:1533e725c9cc20d1c926df938daec2831eb7aa3332e5e3afc3fa4b2fec10847f
Deleted: sha256:17a98711f1343758a62490c7e1a49161e3df31d71b5aa0190d8bcd615fea40a3
Deleted: sha256:1c5008295b64fe5a7513919ae808b157db6238d8524a80ae66aea2e78fc2c6f8
Deleted: sha256:62b21213ec811dd46d808bdf4d209022076fce0f2b3d1973628bce72b9e1cfe0
Deleted: sha256:cc7ab8cda8c163094ae410f79cc4136779688a2a7d167f5307b6b139dc25da67
Deleted: sha256:530b52097f5ecca68e4af5fcca3359aa2fa5115f9728a301f9de0b96b380f873
Deleted: sha256:0b1be20da5e0c8cda7079169ba5c7013da191969f4ea5f7bc62cc912ce7b604d
Deleted: sha256:c2e2c0a161a457c8b7f93cb36041a924b47e8acd9ba017acc0e97e794a808576
Deleted: sha256:84099cbd5277c386c45736245db125935f0e1c316e5305220ef24175b9883453
Deleted: sha256:82fb02bed5a5f323844de559d5aa5fbd6bd17e4fc3fd262a86213f260701124f
Deleted: sha256:6e08aa70d3aecdaa7375c72f623624b775936ba7213ca3815367afd0e0e1e963
Deleted: sha256:475e768120290829707802989dba226a30059ff1d237fc6e0fd83635a5789fde
Deleted: sha256:4235b6bf3bba20eb57505174035c2ec21f8bc05b03af98b86516456402428f06
Deleted: sha256:afec6743a6bfe4e0d293b4ebff1daf3dacdaeb876e85cd0e24a67b3ccb422081
Deleted: sha256:90b830df50994991fc8bf7ad749ee80ccf936d19da39b7b8aa2978b711b325a5
Deleted: sha256:9c96106a4fe47daeeb4da28936b47183bc0be5b063a0515d5d89aa923f42ae05
Deleted: sha256:00ffcd6d9180d266a6ad1075ce88b2d94723bcbd8285711f0c83e63bfe3082e5
Deleted: sha256:8803e49e207cdb4199a71be762f0a5cc4aef613a2753985216fff84d7fddabef
Deleted: sha256:61fa75268318aab3606950b552e6f663ac905b407ef12a034b6a108de5696890
Deleted: sha256:29c3e1756c69f2806a37bfe0c51df2da2d76d1202d4b62699353e62900e49a56
Deleted: sha256:9ab11fa83266043bc68b1a9ac0d9c4e435744484849a8758d95b8026c5fa7879
Deleted: sha256:04cfd255d6efcba51341061339b4a114fb28fabc495feb4f8abe34de0a679035
Deleted: sha256:77610293de310b283302ed3ee7d4c06656e4ad91a39212da3ec917f99232fc35
Deleted: sha256:27c26370b5ea14ea5b56ede31d04ede3beb00928f8c7d704eab9bbafc3fa0556
Build step 'Execute shell' marked build as failure

Mime
View raw message