mesos-builds mailing list archives

Site index · List index
Message view « Date » · « Thread »
Top « Date » · « Thread »
From Apache Jenkins Server <jenk...@builds.apache.org>
Subject Build failed in Jenkins: Mesos-Buildbot » cmake,gcc,--verbose --enable-libevent --enable-ssl,GLOG_v=1 MESOS_VERBOSE=1,centos:7,(ubuntu)&&(!ubuntu-us1)&&(!ubuntu-eu2) #3909
Date Thu, 13 Jul 2017 23:49:48 GMT
See <https://builds.apache.org/job/Mesos-Buildbot/BUILDTOOL=cmake,COMPILER=gcc,CONFIGURATION=--verbose%20--enable-libevent%20--enable-ssl,ENVIRONMENT=GLOG_v=1%20MESOS_VERBOSE=1,OS=centos%3A7,label_exp=(ubuntu)&&(!ubuntu-us1)&&(!ubuntu-eu2)/3909/display/redirect?page=changes>

Changes:

[bmahler] Updated a stale link to the working groups.

[bmahler] Added the YouTube channel to the working groups documentation.

------------------------------------------
[...truncated 28.84 MB...]
I0713 23:49:42.801743  9124 slave.cpp:6425] Received oversubscribable resources {} from the
resource estimator
I0713 23:49:42.803517  9124 process.cpp:3820] Handling HTTP event for process 'slave(789)'
with path: '/slave(789)/containers'
I0713 23:49:42.805321  9124 http.cpp:1149] HTTP GET for /slave(789)/containers from 172.17.0.3:56980
I0713 23:49:42.805438  9124 http.cpp:970] Authorizing principal 'test-principal' to GET the
'/containers' endpoint
I0713 23:49:42.809592  9121 slave.cpp:843] Agent terminating
[       OK ] Endpoint/SlaveEndpointTest.AuthorizedRequest/2 (33 ms)
[ RUN      ] Endpoint/SlaveEndpointTest.UnauthorizedRequest/0
I0713 23:49:42.821576  1548 containerizer.cpp:230] Using isolation: posix/cpu,posix/mem,filesystem/posix,network/cni,environment_secret
W0713 23:49:42.822067  1548 backend.cpp:76] Failed to create 'aufs' backend: AufsBackend requires
root privileges
W0713 23:49:42.822158  1548 backend.cpp:76] Failed to create 'bind' backend: BindBackend requires
root privileges
I0713 23:49:42.822194  1548 provisioner.cpp:255] Using default backend 'copy'
I0713 23:49:42.825755  9117 slave.cpp:250] Mesos agent started on (790)@172.17.0.3:38270
I0713 23:49:42.825772  9117 slave.cpp:251] Flags at startup: --acls="" --appc_simple_discovery_uri_prefix="http://"
--appc_store_dir="/tmp/Endpoint_SlaveEndpointTest_UnauthorizedRequest_0_O0NRi7/store/appc"
--authenticate_http_executors="true" --authenticate_http_readonly="true" --authenticate_http_readwrite="true"
--authenticatee="crammd5" --authentication_backoff_factor="1secs" --authorizer="local" --cgroups_cpu_enable_pids_and_tids_count="false"
--cgroups_enable_cfs="false" --cgroups_hierarchy="/sys/fs/cgroup" --cgroups_limit_swap="false"
--cgroups_root="mesos" --container_disk_watch_interval="15secs" --containerizers="mesos" --credential="/tmp/Endpoint_SlaveEndpointTest_UnauthorizedRequest_0_O0NRi7/credential"
--default_role="*" --disk_watch_interval="1mins" --docker="docker" --docker_kill_orphans="true"
--docker_registry="https://registry-1.docker.io" --docker_remove_delay="6hrs" --docker_socket="/var/run/docker.sock"
--docker_stop_timeout="0ns" --docker_store_dir="/tmp/Endpoint_SlaveEndpointTest_UnauthorizedRequest_0_O0NRi7/store/docker"
--docker_volume_checkpoint_dir="/var/run/mesos/isolators/docker/volume" --enforce_container_disk_quota="false"
--executor_registration_timeout="1mins" --executor_reregistration_timeout="2secs" --executor_secret_key="/tmp/Endpoint_SlaveEndpointTest_UnauthorizedRequest_0_O0NRi7/executor_secret_key"
--executor_shutdown_grace_period="5secs" --fetcher_cache_dir="/tmp/Endpoint_SlaveEndpointTest_UnauthorizedRequest_0_O0NRi7/fetch"
--fetcher_cache_size="2GB" --frameworks_home="" --gc_delay="1weeks" --gc_disk_headroom="0.1"
--hadoop_home="" --help="false" --hostname_lookup="true" --http_command_executor="false" --http_credentials="/tmp/Endpoint_SlaveEndpointTest_UnauthorizedRequest_0_O0NRi7/http_credentials"
--http_heartbeat_interval="30secs" --initialize_driver_logging="true" --isolation="posix/cpu,posix/mem"
--launcher="posix" --launcher_dir="/mesos/build/src" --logbufsecs="0" --logging_level="INFO"
--max_completed_executors_per_framework="150" --oversubscribed_resources_interval="15secs"
--perf_duration="10secs" --perf_interval="1mins" --port="5051" --qos_correction_interval_min="0ns"
--quiet="false" --recover="reconnect" --recovery_timeout="15mins" --registration_backoff_factor="10ms"
--resources="cpus:2;gpus:0;mem:1024;disk:1024;ports:[31000-32000]" --revocable_cpu_low_priority="true"
--runtime_dir="/tmp/Endpoint_SlaveEndpointTest_UnauthorizedRequest_0_O0NRi7" --sandbox_directory="/mnt/mesos/sandbox"
--strict="true" --switch_user="true" --systemd_enable_support="true" --systemd_runtime_directory="/run/systemd/system"
--version="false" --work_dir="/tmp/Endpoint_SlaveEndpointTest_UnauthorizedRequest_0_wXl5Ca"
I0713 23:49:42.826141  9117 credentials.hpp:86] Loading credential for authentication from
'/tmp/Endpoint_SlaveEndpointTest_UnauthorizedRequest_0_O0NRi7/credential'
I0713 23:49:42.826277  9117 slave.cpp:283] Agent using credential for: test-principal
I0713 23:49:42.826295  9117 credentials.hpp:37] Loading credentials for authentication from
'/tmp/Endpoint_SlaveEndpointTest_UnauthorizedRequest_0_O0NRi7/http_credentials'
I0713 23:49:42.826539  9117 http.cpp:1009] Creating default 'basic' HTTP authenticator for
realm 'mesos-agent-executor'
I0713 23:49:42.826640  9117 http.cpp:1030] Creating default 'jwt' HTTP authenticator for realm
'mesos-agent-executor'
I0713 23:49:42.826841  9117 http.cpp:1009] Creating default 'basic' HTTP authenticator for
realm 'mesos-agent-readonly'
I0713 23:49:42.826948  9117 http.cpp:1030] Creating default 'jwt' HTTP authenticator for realm
'mesos-agent-readonly'
I0713 23:49:42.827180  9117 http.cpp:1009] Creating default 'basic' HTTP authenticator for
realm 'mesos-agent-readwrite'
I0713 23:49:42.827327  9117 http.cpp:1030] Creating default 'jwt' HTTP authenticator for realm
'mesos-agent-readwrite'
I0713 23:49:42.828871  9117 slave.cpp:565] Agent resources: [{"name":"cpus","scalar":{"value":2.0},"type":"SCALAR"},{"name":"mem","scalar":{"value":1024.0},"type":"SCALAR"},{"name":"disk","scalar":{"value":1024.0},"type":"SCALAR"},{"name":"ports","ranges":{"range":[{"begin":31000,"end":32000}]},"type":"RANGES"}]
I0713 23:49:42.829062  9117 slave.cpp:573] Agent attributes: [  ]
I0713 23:49:42.829073  9117 slave.cpp:582] Agent hostname: 35f00e1a4e1c
I0713 23:49:42.829201  9125 status_update_manager.cpp:177] Pausing sending status updates
I0713 23:49:42.830663  9122 state.cpp:64] Recovering state from '/tmp/Endpoint_SlaveEndpointTest_UnauthorizedRequest_0_wXl5Ca/meta'
I0713 23:49:42.831012  9123 status_update_manager.cpp:203] Recovering status update manager
I0713 23:49:42.831223  9124 containerizer.cpp:582] Recovering containerizer
I0713 23:49:42.832927  9132 provisioner.cpp:416] Provisioner recovery complete
I0713 23:49:42.833401  9135 slave.cpp:6229] Finished recovery
I0713 23:49:42.833822  9135 slave.cpp:6411] Querying resource estimator for oversubscribable
resources
I0713 23:49:42.834163  9125 slave.cpp:6425] Received oversubscribable resources {} from the
resource estimator
I0713 23:49:42.836073  9132 process.cpp:3820] Handling HTTP event for process 'slave(790)'
with path: '/slave(790)/monitor/statistics'
I0713 23:49:42.837793  9124 http.cpp:1149] HTTP GET for /slave(790)/monitor/statistics from
172.17.0.3:56982
I0713 23:49:42.837857  9124 http.cpp:970] Authorizing principal 'test-principal' to GET the
'/monitor/statistics' endpoint
I0713 23:49:42.840188  9120 slave.cpp:843] Agent terminating
[       OK ] Endpoint/SlaveEndpointTest.UnauthorizedRequest/0 (30 ms)
[ RUN      ] Endpoint/SlaveEndpointTest.UnauthorizedRequest/1
I0713 23:49:42.852210  1548 containerizer.cpp:230] Using isolation: posix/cpu,posix/mem,filesystem/posix,network/cni,environment_secret
W0713 23:49:42.852716  1548 backend.cpp:76] Failed to create 'aufs' backend: AufsBackend requires
root privileges
W0713 23:49:42.852821  1548 backend.cpp:76] Failed to create 'bind' backend: BindBackend requires
root privileges
I0713 23:49:42.852849  1548 provisioner.cpp:255] Using default backend 'copy'
I0713 23:49:42.856809  9135 slave.cpp:250] Mesos agent started on (791)@172.17.0.3:38270
I0713 23:49:42.856839  9135 slave.cpp:251] Flags at startup: --acls="" --appc_simple_discovery_uri_prefix="http://"
--appc_store_dir="/tmp/Endpoint_SlaveEndpointTest_UnauthorizedRequest_1_YuRyfU/store/appc"
--authenticate_http_executors="true" --authenticate_http_readonly="true" --authenticate_http_readwrite="true"
--authenticatee="crammd5" --authentication_backoff_factor="1secs" --authorizer="local" --cgroups_cpu_enable_pids_and_tids_count="false"
--cgroups_enable_cfs="false" --cgroups_hierarchy="/sys/fs/cgroup" --cgroups_limit_swap="false"
--cgroups_root="mesos" --container_disk_watch_interval="15secs" --containerizers="mesos" --credential="/tmp/Endpoint_SlaveEndpointTest_UnauthorizedRequest_1_YuRyfU/credential"
--default_role="*" --disk_watch_interval="1mins" --docker="docker" --docker_kill_orphans="true"
--docker_registry="https://registry-1.docker.io" --docker_remove_delay="6hrs" --docker_socket="/var/run/docker.sock"
--docker_stop_timeout="0ns" --docker_store_dir="/tmp/Endpoint_SlaveEndpointTest_UnauthorizedRequest_1_YuRyfU/store/docker"
--docker_volume_checkpoint_dir="/var/run/mesos/isolators/docker/volume" --enforce_container_disk_quota="false"
--executor_registration_timeout="1mins" --executor_reregistration_timeout="2secs" --executor_secret_key="/tmp/Endpoint_SlaveEndpointTest_UnauthorizedRequest_1_YuRyfU/executor_secret_key"
--executor_shutdown_grace_period="5secs" --fetcher_cache_dir="/tmp/Endpoint_SlaveEndpointTest_UnauthorizedRequest_1_YuRyfU/fetch"
--fetcher_cache_size="2GB" --frameworks_home="" --gc_delay="1weeks" --gc_disk_headroom="0.1"
--hadoop_home="" --help="false" --hostname_lookup="true" --http_command_executor="false" --http_credentials="/tmp/Endpoint_SlaveEndpointTest_UnauthorizedRequest_1_YuRyfU/http_credentials"
--http_heartbeat_interval="30secs" --initialize_driver_logging="true" --isolation="posix/cpu,posix/mem"
--launcher="posix" --launcher_dir="/mesos/build/src" --logbufsecs="0" --logging_level="INFO"
--max_completed_executors_per_framework="150" --oversubscribed_resources_interval="15secs"
--perf_duration="10secs" --perf_interval="1mins" --port="5051" --qos_correction_interval_min="0ns"
--quiet="false" --recover="reconnect" --recovery_timeout="15mins" --registration_backoff_factor="10ms"
--resources="cpus:2;gpus:0;mem:1024;disk:1024;ports:[31000-32000]" --revocable_cpu_low_priority="true"
--runtime_dir="/tmp/Endpoint_SlaveEndpointTest_UnauthorizedRequest_1_YuRyfU" --sandbox_directory="/mnt/mesos/sandbox"
--strict="true" --switch_user="true" --systemd_enable_support="true" --systemd_runtime_directory="/run/systemd/system"
--version="false" --work_dir="/tmp/Endpoint_SlaveEndpointTest_UnauthorizedRequest_1_EOFdvX"
I0713 23:49:42.857233  9135 credentials.hpp:86] Loading credential for authentication from
'/tmp/Endpoint_SlaveEndpointTest_UnauthorizedRequest_1_YuRyfU/credential'
I0713 23:49:42.857375  9135 slave.cpp:283] Agent using credential for: test-principal
I0713 23:49:42.857390  9135 credentials.hpp:37] Loading credentials for authentication from
'/tmp/Endpoint_SlaveEndpointTest_UnauthorizedRequest_1_YuRyfU/http_credentials'
I0713 23:49:42.857640  9135 http.cpp:1009] Creating default 'basic' HTTP authenticator for
realm 'mesos-agent-executor'
I0713 23:49:42.857733  9135 http.cpp:1030] Creating default 'jwt' HTTP authenticator for realm
'mesos-agent-executor'
I0713 23:49:42.857941  9135 http.cpp:1009] Creating default 'basic' HTTP authenticator for
realm 'mesos-agent-readonly'
I0713 23:49:42.858029  9135 http.cpp:1030] Creating default 'jwt' HTTP authenticator for realm
'mesos-agent-readonly'
I0713 23:49:42.858222  9135 http.cpp:1009] Creating default 'basic' HTTP authenticator for
realm 'mesos-agent-readwrite'
I0713 23:49:42.858309  9135 http.cpp:1030] Creating default 'jwt' HTTP authenticator for realm
'mesos-agent-readwrite'
I0713 23:49:42.860056  9135 slave.cpp:565] Agent resources: [{"name":"cpus","scalar":{"value":2.0},"type":"SCALAR"},{"name":"mem","scalar":{"value":1024.0},"type":"SCALAR"},{"name":"disk","scalar":{"value":1024.0},"type":"SCALAR"},{"name":"ports","ranges":{"range":[{"begin":31000,"end":32000}]},"type":"RANGES"}]
I0713 23:49:42.860250  9135 slave.cpp:573] Agent attributes: [  ]
I0713 23:49:42.860260  9135 slave.cpp:582] Agent hostname: 35f00e1a4e1c
I0713 23:49:42.860395  9133 status_update_manager.cpp:177] Pausing sending status updates
I0713 23:49:42.861733  9133 state.cpp:64] Recovering state from '/tmp/Endpoint_SlaveEndpointTest_UnauthorizedRequest_1_EOFdvX/meta'
I0713 23:49:42.862162  9113 status_update_manager.cpp:203] Recovering status update manager
I0713 23:49:42.862370  9126 containerizer.cpp:582] Recovering containerizer
I0713 23:49:42.863927  9122 provisioner.cpp:416] Provisioner recovery complete
I0713 23:49:42.864359  9128 slave.cpp:6229] Finished recovery
I0713 23:49:42.864881  9128 slave.cpp:6411] Querying resource estimator for oversubscribable
resources
I0713 23:49:42.865198  9117 slave.cpp:6425] Received oversubscribable resources {} from the
resource estimator
I0713 23:49:42.866822  9127 process.cpp:3820] Handling HTTP event for process 'slave(791)'
with path: '/slave(791)/monitor/statistics.json'
I0713 23:49:42.868492  9131 http.cpp:1149] HTTP GET for /slave(791)/monitor/statistics.json
from 172.17.0.3:56984
I0713 23:49:42.868568  9131 http.cpp:970] Authorizing principal 'test-principal' to GET the
'/monitor/statistics.json' endpoint
I0713 23:49:42.870781  9136 slave.cpp:843] Agent terminating
[       OK ] Endpoint/SlaveEndpointTest.UnauthorizedRequest/1 (30 ms)
[ RUN      ] Endpoint/SlaveEndpointTest.UnauthorizedRequest/2
I0713 23:49:42.882887  1548 containerizer.cpp:230] Using isolation: posix/cpu,posix/mem,filesystem/posix,network/cni,environment_secret
W0713 23:49:42.883450  1548 backend.cpp:76] Failed to create 'aufs' backend: AufsBackend requires
root privileges
W0713 23:49:42.883544  1548 backend.cpp:76] Failed to create 'bind' backend: BindBackend requires
root privileges
I0713 23:49:42.883577  1548 provisioner.cpp:255] Using default backend 'copy'
I0713 23:49:42.887151  9128 slave.cpp:250] Mesos agent started on (792)@172.17.0.3:38270
I0713 23:49:42.887184  9128 slave.cpp:251] Flags at startup: --acls="" --appc_simple_discovery_uri_prefix="http://"
--appc_store_dir="/tmp/Endpoint_SlaveEndpointTest_UnauthorizedRequest_2_CQozuH/store/appc"
--authenticate_http_executors="true" --authenticate_http_readonly="true" --authenticate_http_readwrite="true"
--authenticatee="crammd5" --authentication_backoff_factor="1secs" --authorizer="local" --cgroups_cpu_enable_pids_and_tids_count="false"
--cgroups_enable_cfs="false" --cgroups_hierarchy="/sys/fs/cgroup" --cgroups_limit_swap="false"
--cgroups_root="mesos" --container_disk_watch_interval="15secs" --containerizers="mesos" --credential="/tmp/Endpoint_SlaveEndpointTest_UnauthorizedRequest_2_CQozuH/credential"
--default_role="*" --disk_watch_interval="1mins" --docker="docker" --docker_kill_orphans="true"
--docker_registry="https://registry-1.docker.io" --docker_remove_delay="6hrs" --docker_socket="/var/run/docker.sock"
--docker_stop_timeout="0ns" --docker_store_dir="/tmp/Endpoint_SlaveEndpointTest_UnauthorizedRequest_2_CQozuH/store/docker"
--docker_volume_checkpoint_dir="/var/run/mesos/isolators/docker/volume" --enforce_container_disk_quota="false"
--executor_registration_timeout="1mins" --executor_reregistration_timeout="2secs" --executor_secret_key="/tmp/Endpoint_SlaveEndpointTest_UnauthorizedRequest_2_CQozuH/executor_secret_key"
--executor_shutdown_grace_period="5secs" --fetcher_cache_dir="/tmp/Endpoint_SlaveEndpointTest_UnauthorizedRequest_2_CQozuH/fetch"
--fetcher_cache_size="2GB" --frameworks_home="" --gc_delay="1weeks" --gc_disk_headroom="0.1"
--hadoop_home="" --help="false" --hostname_lookup="true" --http_command_executor="false" --http_credentials="/tmp/Endpoint_SlaveEndpointTest_UnauthorizedRequest_2_CQozuH/http_credentials"
--http_heartbeat_interval="30secs" --initialize_driver_logging="true" --isolation="posix/cpu,posix/mem"
--launcher="posix" --launcher_dir="/mesos/build/src" --logbufsecs="0" --logging_level="INFO"
--max_completed_executors_per_framework="150" --oversubscribed_resources_interval="15secs"
--perf_duration="10secs" --perf_interval="1mins" --port="5051" --qos_correction_interval_min="0ns"
--quiet="false" --recover="reconnect" --recovery_timeout="15mins" --registration_backoff_factor="10ms"
--resources="cpus:2;gpus:0;mem:1024;disk:1024;ports:[31000-32000]" --revocable_cpu_low_priority="true"
--runtime_dir="/tmp/Endpoint_SlaveEndpointTest_UnauthorizedRequest_2_CQozuH" --sandbox_directory="/mnt/mesos/sandbox"
--strict="true" --switch_user="true" --systemd_enable_support="true" --systemd_runtime_directory="/run/systemd/system"
--version="false" --work_dir="/tmp/Endpoint_SlaveEndpointTest_UnauthorizedRequest_2_SBhFFK"
I0713 23:49:42.887580  9128 credentials.hpp:86] Loading credential for authentication from
'/tmp/Endpoint_SlaveEndpointTest_UnauthorizedRequest_2_CQozuH/credential'
I0713 23:49:42.887712  9128 slave.cpp:283] Agent using credential for: test-principal
I0713 23:49:42.887727  9128 credentials.hpp:37] Loading credentials for authentication from
'/tmp/Endpoint_SlaveEndpointTest_UnauthorizedRequest_2_CQozuH/http_credentials'
I0713 23:49:42.887959  9128 http.cpp:1009] Creating default 'basic' HTTP authenticator for
realm 'mesos-agent-executor'
I0713 23:49:42.888053  9128 http.cpp:1030] Creating default 'jwt' HTTP authenticator for realm
'mesos-agent-executor'
I0713 23:49:42.888284  9128 http.cpp:1009] Creating default 'basic' HTTP authenticator for
realm 'mesos-agent-readonly'
I0713 23:49:42.888376  9128 http.cpp:1030] Creating default 'jwt' HTTP authenticator for realm
'mesos-agent-readonly'
I0713 23:49:42.888774  9128 http.cpp:1009] Creating default 'basic' HTTP authenticator for
realm 'mesos-agent-readwrite'
I0713 23:49:42.888928  9128 http.cpp:1030] Creating default 'jwt' HTTP authenticator for realm
'mesos-agent-readwrite'
I0713 23:49:42.890377  9128 slave.cpp:565] Agent resources: [{"name":"cpus","scalar":{"value":2.0},"type":"SCALAR"},{"name":"mem","scalar":{"value":1024.0},"type":"SCALAR"},{"name":"disk","scalar":{"value":1024.0},"type":"SCALAR"},{"name":"ports","ranges":{"range":[{"begin":31000,"end":32000}]},"type":"RANGES"}]
I0713 23:49:42.890568  9128 slave.cpp:573] Agent attributes: [  ]
I0713 23:49:42.890579  9128 slave.cpp:582] Agent hostname: 35f00e1a4e1c
I0713 23:49:42.890702  9113 status_update_manager.cpp:177] Pausing sending status updates
I0713 23:49:42.892138  9113 state.cpp:64] Recovering state from '/tmp/Endpoint_SlaveEndpointTest_UnauthorizedRequest_2_SBhFFK/meta'
I0713 23:49:42.892388  9120 status_update_manager.cpp:203] Recovering status update manager
I0713 23:49:42.892629  9117 containerizer.cpp:582] Recovering containerizer
I0713 23:49:42.894059  9116 provisioner.cpp:416] Provisioner recovery complete
I0713 23:49:42.894451  9122 slave.cpp:6229] Finished recovery
I0713 23:49:42.894953  9122 slave.cpp:6411] Querying resource estimator for oversubscribable
resources
I0713 23:49:42.895246  9126 slave.cpp:6425] Received oversubscribable resources {} from the
resource estimator
I0713 23:49:42.897172  9114 process.cpp:3820] Handling HTTP event for process 'slave(792)'
with path: '/slave(792)/containers'
I0713 23:49:42.899014  9118 http.cpp:1149] HTTP GET for /slave(792)/containers from 172.17.0.3:56986
I0713 23:49:42.899086  9118 http.cpp:970] Authorizing principal 'test-principal' to GET the
'/containers' endpoint
I0713 23:49:42.901672  9118 slave.cpp:843] Agent terminating
[       OK ] Endpoint/SlaveEndpointTest.UnauthorizedRequest/2 (31 ms)
[ RUN      ] Endpoint/SlaveEndpointTest.NoAuthorizer/0
I0713 23:49:42.914469  1548 containerizer.cpp:230] Using isolation: posix/cpu,posix/mem,filesystem/posix,network/cni,environment_secret
W0713 23:49:42.915030  1548 backend.cpp:76] Failed to create 'aufs' backend: AufsBackend requires
root privileges
W0713 23:49:42.915133  1548 backend.cpp:76] Failed to create 'bind' backend: BindBackend requires
root privileges
I0713 23:49:42.915191  1548 provisioner.cpp:255] Using default backend 'copy'
I0713 23:49:42.917429  1548 cluster.cpp:448] Creating default 'local' authorizer
I0713 23:49:42.919224  9125 slave.cpp:250] Mesos agent started on (793)@172.17.0.3:38270
I0713 23:49:42.919242  9125 slave.cpp:251] Flags at startup: --acls="" --appc_simple_discovery_uri_prefix="http://"
--appc_store_dir="/tmp/Endpoint_SlaveEndpointTest_NoAuthorizer_0_uC7T1u/store/appc" --authenticate_http_executors="true"
--authenticate_http_readonly="true" --authenticate_http_readwrite="true" --authenticatee="crammd5"
--authentication_backoff_factor="1secs" --authorizer="local" --cgroups_cpu_enable_pids_and_tids_count="false"
--cgroups_enable_cfs="false" --cgroups_hierarchy="/sys/fs/cgroup" --cgroups_limit_swap="false"
--cgroups_root="mesos" --container_disk_watch_interval="15secs" --containerizers="mesos" --credential="/tmp/Endpoint_SlaveEndpointTest_NoAuthorizer_0_uC7T1u/credential"
--default_role="*" --disk_watch_interval="1mins" --docker="docker" --docker_kill_orphans="true"
--docker_registry="https://registry-1.docker.io" --docker_remove_delay="6hrs" --docker_socket="/var/run/docker.sock"
--docker_stop_timeout="0ns" --docker_store_dir="/tmp/Endpoint_SlaveEndpointTest_NoAuthorizer_0_uC7T1u/store/docker"
--docker_volume_checkpoint_dir="/var/run/mesos/isolators/docker/volume" --enforce_container_disk_quota="false"
--executor_registration_timeout="1mins" --executor_reregistration_timeout="2secs" --executor_secret_key="/tmp/Endpoint_SlaveEndpointTest_NoAuthorizer_0_uC7T1u/executor_secret_key"
--executor_shutdown_grace_period="5secs" --fetcher_cache_dir="/tmp/Endpoint_SlaveEndpointTest_NoAuthorizer_0_uC7T1u/fetch"
--fetcher_cache_size="2GB" --frameworks_home="" --gc_delay="1weeks" --gc_disk_headroom="0.1"
--hadoop_home="" --help="false" --hostname_lookup="true" --http_command_executor="false" --http_credentials="/tmp/Endpoint_SlaveEndpointTest_NoAuthorizer_0_uC7T1u/http_credentials"
--http_heartbeat_interval="30secs" --initialize_driver_logging="true" --isolation="posix/cpu,posix/mem"
--launcher="posix" --launcher_dir="/mesos/build/src" --logbufsecs="0" --logging_level="INFO"
--max_completed_executors_per_framework="150" --oversubscribed_resources_interval="15secs"
--perf_duration="10secs" --perf_interval="1mins" --port="5051" --qos_correction_interval_min="0ns"
--quiet="false" --recover="reconnect" --recovery_timeout="15mins" --registration_backoff_factor="10ms"
--resources="cpus:2;gpus:0;mem:1024;disk:1024;ports:[31000-32000]" --revocable_cpu_low_priority="true"
--runtime_dir="/tmp/Endpoint_SlaveEndpointTest_NoAuthorizer_0_uC7T1u" --sandbox_directory="/mnt/mesos/sandbox"
--strict="true" --switch_user="true" --systemd_enable_support="true" --systemd_runtime_directory="/run/systemd/system"
--version="false" --work_dir="/tmp/Endpoint_SlaveEndpointTest_NoAuthorizer_0_4I8n8x"
I0713 23:49:42.919672  9125 credentials.hpp:86] Loading credential for authentication from
'/tmp/Endpoint_SlaveEndpointTest_NoAuthorizer_0_uC7T1u/credential'
I0713 23:49:42.919808  9125 slave.cpp:283] Agent using credential for: test-principal
I0713 23:49:42.919827  9125 credentials.hpp:37] Loading credentials for authentication from
'/tmp/Endpoint_SlaveEndpointTest_NoAuthorizer_0_uC7T1u/http_credentials'
I0713 23:49:42.920083  9125 http.cpp:1009] Creating default 'basic' HTTP authenticator for
realm 'mesos-agent-executor'
I0713 23:49:42.920188  9125 http.cpp:1030] Creating default 'jwt' HTTP authenticator for realm
'mesos-agent-executor'
I0713 23:49:42.920374  9125 http.cpp:1009] Creating default 'basic' HTTP authenticator for
realm 'mesos-agent-readonly'
I0713 23:49:42.920490  9125 http.cpp:1030] Creating default 'jwt' HTTP authenticator for realm
'mesos-agent-readonly'
I0713 23:49:42.920727  9125 http.cpp:1009] Creating default 'basic' HTTP authenticator for
realm 'mesos-agent-readwrite'
I0713 23:49:42.920845  9125 http.cpp:1030] Creating default 'jwt' HTTP authenticator for realm
'mesos-agent-readwrite'
I0713 23:49:42.922379  9125 slave.cpp:565] Agent resources: [{"name":"cpus","scalar":{"value":2.0},"type":"SCALAR"},{"name":"mem","scalar":{"value":1024.0},"type":"SCALAR"},{"name":"disk","scalar":{"value":1024.0},"type":"SCALAR"},{"name":"ports","ranges":{"range":[{"begin":31000,"end":32000}]},"type":"RANGES"}]
I0713 23:49:42.922593  9125 slave.cpp:573] Agent attributes: [  ]
I0713 23:49:42.922603  9125 slave.cpp:582] Agent hostname: 35f00e1a4e1c
I0713 23:49:42.922740  9131 status_update_manager.cpp:177] Pausing sending status updates
I0713 23:49:42.924026  9119 state.cpp:64] Recovering state from '/tmp/Endpoint_SlaveEndpointTest_NoAuthorizer_0_4I8n8x/meta'
I0713 23:49:42.924540  9118 status_update_manager.cpp:203] Recovering status update manager
I0713 23:49:42.924732  9123 containerizer.cpp:582] Recovering containerizer
I0713 23:49:42.926399  9127 provisioner.cpp:416] Provisioner recovery complete
I0713 23:49:42.926920  9135 slave.cpp:6229] Finished recovery
I0713 23:49:42.927544  9135 slave.cpp:6411] Querying resource estimator for oversubscribable
resources
I0713 23:49:42.927883  9128 slave.cpp:6425] Received oversubscribable resources {} from the
resource estimator
I0713 23:49:42.930645  9121 process.cpp:3820] Handling HTTP event for process 'slave(793)'
with path: '/slave(793)/monitor/statistics'
I0713 23:49:42.932438  9131 http.cpp:1149] HTTP GET for /slave(793)/monitor/statistics from
172.17.0.3:56988
I0713 23:49:42.932533  9131 http.cpp:970] Authorizing principal 'test-principal' to GET the
'/monitor/statistics' endpoint
I0713 23:49:42.936661  9133 slave.cpp:843] Agent terminating
[       OK ] Endpoint/SlaveEndpointTest.NoAuthorizer/0 (35 ms)
[ RUN      ] Endpoint/SlaveEndpointTest.NoAuthorizer/1
I0713 23:49:42.949555  1548 containerizer.cpp:230] Using isolation: posix/cpu,posix/mem,filesystem/posix,network/cni,environment_secret
W0713 23:49:42.950134  1548 backend.cpp:76] Failed to create 'aufs' backend: AufsBackend requires
root privileges
W0713 23:49:42.950263  1548 backend.cpp:76] Failed to create 'bind' backend: BindBackend requires
root privileges
I0713 23:49:42.950294  1548 provisioner.cpp:255] Using default backend 'copy'
I0713 23:49:42.952524  1548 cluster.cpp:448] Creating default 'local' authorizer
I0713 23:49:42.954267  9130 slave.cpp:250] Mesos agent started on (794)@172.17.0.3:38270
I0713 23:49:42.954283  9130 slave.cpp:251] Flags at startup: --acls="" --appc_simple_discovery_uri_prefix="http://"
--appc_store_dir="/tmp/Endpoint_SlaveEndpointTest_NoAuthorizer_1_gVdKTi/store/appc" --authenticate_http_executors="true"
--authenticate_http_readonly="true" --authenticate_http_readwrite="true" --authenticatee="crammd5"
--authentication_backoff_factor="1secs" --authorizer="local" --cgroups_cpu_enable_pids_and_tids_count="false"
--cgroups_enable_cfs="false" --cgroups_hierarchy="/sys/fs/cgroup" --cgroups_limit_swap="false"
--cgroups_root="mesos" --container_disk_watch_interval="15secs" --containerizers="mesos" --credential="/tmp/Endpoint_SlaveEndpointTest_NoAuthorizer_1_gVdKTi/credential"
--default_role="*" --disk_watch_interval="1mins" --docker="docker" --docker_kill_orphans="true"
--docker_registry="https://registry-1.docker.io" --docker_remove_delay="6hrs" --docker_socket="/var/run/docker.sock"
--docker_stop_timeout="0ns" --docker_store_dir="/tmp/Endpoint_SlaveEndpointTest_NoAuthorizer_1_gVdKTi/store/docker"
--docker_volume_checkpoint_dir="/var/run/mesos/isolators/docker/volume" --enforce_container_disk_quota="false"
--executor_registration_timeout="1mins" --executor_reregistration_timeout="2secs" --executor_secret_key="/tmp/Endpoint_SlaveEndpointTest_NoAuthorizer_1_gVdKTi/executor_secret_key"
--executor_shutdown_grace_period="5secs" --fetcher_cache_dir="/tmp/Endpoint_SlaveEndpointTest_NoAuthorizer_1_gVdKTi/fetch"
--fetcher_cache_size="2GB" --frameworks_home="" --gc_delay="1weeks" --gc_disk_headroom="0.1"
--hadoop_home="" --help="false" --hostname_lookup="true" --http_command_executor="false" --http_credentials="/tmp/Endpoint_SlaveEndpointTest_NoAuthorizer_1_gVdKTi/http_credentials"
--http_heartbeat_interval="30secs" --initialize_driver_logging="true" --isolation="posix/cpu,posix/mem"
--launcher="posix" --launcher_dir="/mesos/build/src" --logbufsecs="0" --logging_level="INFO"
--max_completed_executors_per_framework="150" --oversubscribed_resources_interval="15secs"
--perf_duration="10secs" --perf_interval="1mins" --port="5051" --qos_correction_interval_min="0ns"
--quiet="false" --recover="reconnect" --recovery_timeout="15mins" --registration_backoff_factor="10ms"
--resources="cpus:2;gpus:0;mem:1024;disk:1024;ports:[31000-32000]" --revocable_cpu_low_priority="true"
--runtime_dir="/tmp/Endpoint_SlaveEndpointTest_NoAuthorizer_1_gVdKTi" --sandbox_directory="/mnt/mesos/sandbox"
--strict="true" --switch_user="true" --systemd_enable_support="true" --systemd_runtime_directory="/run/systemd/system"
--version="false" --work_dir="/tmp/Endpoint_SlaveEndpointTest_NoAuthorizer_1_KquZUl"
I0713 23:49:42.954644  9130 credentials.hpp:86] Loading credential for authentication from
'/tmp/Endpoint_SlaveEndpointTest_NoAuthorizer_1_gVdKTi/credential'
I0713 23:49:42.954824  9130 slave.cpp:283] Agent using credential for: test-principal
I0713 23:49:42.954846  9130 credentials.hpp:37] Loading credentials for authentication from
'/tmp/Endpoint_SlaveEndpointTest_NoAuthorizer_1_gVdKTi/http_credentials'
I0713 23:49:42.955129  9130 http.cpp:1009] Creating default 'basic' HTTP authenticator for
realm 'mesos-agent-executor'
I0713 23:49:42.955237  9130 http.cpp:1030] Creating default 'jwt' HTTP authenticator for realm
'mesos-agent-executor'
I0713 23:49:42.955421  9130 http.cpp:1009] Creating default 'basic' HTTP authenticator for
realm 'mesos-agent-readonly'
I0713 23:49:42.955670  9130 http.cpp:1030] Creating default 'jwt' HTTP authenticator for realm
'mesos-agent-readonly'
I0713 23:49:42.956008  9130 http.cpp:1009] Creating default 'basic' HTTP authenticator for
realm 'mesos-agent-readwrite'
I0713 23:49:42.956127  9130 http.cpp:1030] Creating default 'jwt' HTTP authenticator for realm
'mesos-agent-readwrite'
I0713 23:49:42.957864  9130 slave.cpp:565] Agent resources: [{"name":"cpus","scalar":{"value":2.0},"type":"SCALAR"},{"name":"mem","scalar":{"value":1024.0},"type":"SCALAR"},{"name":"disk","scalar":{"value":1024.0},"type":"SCALAR"},{"name":"ports","ranges":{"range":[{"begin":31000,"end":32000}]},"type":"RANGES"}]
I0713 23:49:42.958076  9130 slave.cpp:573] Agent attributes: [  ]
I0713 23:49:42.958089  9130 slave.cpp:582] Agent hostname: 35f00e1a4e1c
I0713 23:49:42.958240  9116 status_update_manager.cpp:177] Pausing sending status updates
I0713 23:49:42.959969  9118 state.cpp:64] Recovering state from '/tmp/Endpoint_SlaveEndpointTest_NoAuthorizer_1_KquZUl/meta'
I0713 23:49:42.960304  9132 status_update_manager.cpp:203] Recovering status update manager
I0713 23:49:42.960577  9121 containerizer.cpp:582] Recovering containerizer
I0713 23:49:42.962327  9123 provisioner.cpp:416] Provisioner recovery complete
I0713 23:49:42.962873  9123 slave.cpp:6229] Finished recovery
I0713 23:49:42.963433  9123 slave.cpp:6411] Querying resource estimator for oversubscribable
resources
I0713 23:49:42.964197  9123 slave.cpp:6425] Received oversubscribable resources {} from the
resource estimator
I0713 23:49:42.966938  9129 process.cpp:3820] Handling HTTP event for process 'slave(794)'
with path: '/slave(794)/monitor/statistics.json'
I0713 23:49:42.968950  9125 http.cpp:1149] HTTP GET for /slave(794)/monitor/statistics.json
from 172.17.0.3:56990
I0713 23:49:42.969032  9125 http.cpp:970] Authorizing principal 'test-principal' to GET the
'/monitor/statistics.json' endpoint
I0713 23:49:42.972702  9133 slave.cpp:843] Agent terminating
[       OK ] Endpoint/SlaveEndpointTest.NoAuthorizer/1 (36 ms)
[ RUN      ] Endpoint/SlaveEndpointTest.NoAuthorizer/2
I0713 23:49:42.985690  1548 containerizer.cpp:230] Using isolation: posix/cpu,posix/mem,filesystem/posix,network/cni,environment_secret
W0713 23:49:42.986222  1548 backend.cpp:76] Failed to create 'aufs' backend: AufsBackend requires
root privileges
W0713 23:49:42.986326  1548 backend.cpp:76] Failed to create 'bind' backend: BindBackend requires
root privileges
I0713 23:49:42.986358  1548 provisioner.cpp:255] Using default backend 'copy'
I0713 23:49:42.988203  1548 cluster.cpp:448] Creating default 'local' authorizer
I0713 23:49:42.989866  9120 slave.cpp:250] Mesos agent started on (795)@172.17.0.3:38270
I0713 23:49:42.989883  9120 slave.cpp:251] Flags at startup: --acls="" --appc_simple_discovery_uri_prefix="http://"
--appc_store_dir="/tmp/Endpoint_SlaveEndpointTest_NoAuthorizer_2_Wft966/store/appc" --authenticate_http_executors="true"
--authenticate_http_readonly="true" --authenticate_http_readwrite="true" --authenticatee="crammd5"
--authentication_backoff_factor="1secs" --authorizer="local" --cgroups_cpu_enable_pids_and_tids_count="false"
--cgroups_enable_cfs="false" --cgroups_hierarchy="/sys/fs/cgroup" --cgroups_limit_swap="false"
--cgroups_root="mesos" --container_disk_watch_interval="15secs" --containerizers="mesos" --credential="/tmp/Endpoint_SlaveEndpointTest_NoAuthorizer_2_Wft966/credential"
--default_role="*" --disk_watch_interval="1mins" --docker="docker" --docker_kill_orphans="true"
--docker_registry="https://registry-1.docker.io" --docker_remove_delay="6hrs" --docker_socket="/var/run/docker.sock"
--docker_stop_timeout="0ns" --docker_store_dir="/tmp/Endpoint_SlaveEndpointTest_NoAuthorizer_2_Wft966/store/docker"
--docker_volume_checkpoint_dir="/var/run/mesos/isolators/docker/volume" --enforce_container_disk_quota="false"
--executor_registration_timeout="1mins" --executor_reregistration_timeout="2secs" --executor_secret_key="/tmp/Endpoint_SlaveEndpointTest_NoAuthorizer_2_Wft966/executor_secret_key"
--executor_shutdown_grace_period="5secs" --fetcher_cache_dir="/tmp/Endpoint_SlaveEndpointTest_NoAuthorizer_2_Wft966/fetch"
--fetcher_cache_size="2GB" --frameworks_home="" --gc_delay="1weeks" --gc_disk_headroom="0.1"
--hadoop_home="" --help="false" --hostname_lookup="true" --http_command_executor="false" --http_credentials="/tmp/Endpoint_SlaveEndpointTest_NoAuthorizer_2_Wft966/http_credentials"
--http_heartbeat_interval="30secs" --initialize_driver_logging="true" --isolation="posix/cpu,posix/mem"
--launcher="posix" --launcher_dir="/mesos/build/src" --logbufsecs="0" --logging_level="INFO"
--max_completed_executors_per_framework="150" --oversubscribed_resources_interval="15secs"
--perf_duration="10secs" --perf_interval="1mins" --port="5051" --qos_correction_interval_min="0ns"
--quiet="false" --recover="reconnect" --recovery_timeout="15mins" --registration_backoff_factor="10ms"
--resources="cpus:2;gpus:0;mem:1024;disk:1024;ports:[31000-32000]" --revocable_cpu_low_priority="true"
--runtime_dir="/tmp/Endpoint_SlaveEndpointTest_NoAuthorizer_2_Wft966" --sandbox_directory="/mnt/mesos/sandbox"
--strict="true" --switch_user="true" --systemd_enable_support="true" --systemd_runtime_directory="/run/systemd/system"
--version="false" --work_dir="/tmp/Endpoint_SlaveEndpointTest_NoAuthorizer_2_OTPZ29"
I0713 23:49:42.990272  9120 credentials.hpp:86] Loading credential for authentication from
'/tmp/Endpoint_SlaveEndpointTest_NoAuthorizer_2_Wft966/credential'
I0713 23:49:42.990437  9120 slave.cpp:283] Agent using credential for: test-principal
I0713 23:49:42.990453  9120 credentials.hpp:37] Loading credentials for authentication from
'/tmp/Endpoint_SlaveEndpointTest_NoAuthorizer_2_Wft966/http_credentials'
I0713 23:49:42.990733  9120 http.cpp:1009] Creating default 'basic' HTTP authenticator for
realm 'mesos-agent-executor'
I0713 23:49:42.990862  9120 http.cpp:1030] Creating default 'jwt' HTTP authenticator for realm
'mesos-agent-executor'
I0713 23:49:42.991221  9120 http.cpp:1009] Creating default 'basic' HTTP authenticator for
realm 'mesos-agent-readonly'
I0713 23:49:42.991359  9120 http.cpp:1030] Creating default 'jwt' HTTP authenticator for realm
'mesos-agent-readonly'
I0713 23:49:42.991538  9120 http.cpp:1009] Creating default 'basic' HTTP authenticator for
realm 'mesos-agent-readwrite'
I0713 23:49:42.991696  9120 http.cpp:1030] Creating default 'jwt' HTTP authenticator for realm
'mesos-agent-readwrite'
I0713 23:49:42.993226  9120 slave.cpp:565] Agent resources: [{"name":"cpus","scalar":{"value":2.0},"type":"SCALAR"},{"name":"mem","scalar":{"value":1024.0},"type":"SCALAR"},{"name":"disk","scalar":{"value":1024.0},"type":"SCALAR"},{"name":"ports","ranges":{"range":[{"begin":31000,"end":32000}]},"type":"RANGES"}]
I0713 23:49:42.993422  9120 slave.cpp:573] Agent attributes: [  ]
I0713 23:49:42.993433  9120 slave.cpp:582] Agent hostname: 35f00e1a4e1c
I0713 23:49:42.993587  9123 status_update_manager.cpp:177] Pausing sending status updates
I0713 23:49:42.995227  9122 state.cpp:64] Recovering state from '/tmp/Endpoint_SlaveEndpointTest_NoAuthorizer_2_OTPZ29/meta'
I0713 23:49:42.995831  9131 status_update_manager.cpp:203] Recovering status update manager
I0713 23:49:42.996088  9120 containerizer.cpp:582] Recovering containerizer
I0713 23:49:42.997594  9130 provisioner.cpp:416] Provisioner recovery complete
I0713 23:49:42.998162  9133 slave.cpp:6229] Finished recovery
I0713 23:49:42.998946  9133 slave.cpp:6411] Querying resource estimator for oversubscribable
resources
I0713 23:49:42.999472  9127 slave.cpp:6425] Received oversubscribable resources {} from the
resource estimator
I0713 23:49:43.001530  9131 process.cpp:3820] Handling HTTP event for process 'slave(795)'
with path: '/slave(795)/containers'
I0713 23:49:43.003556  9127 http.cpp:1149] HTTP GET for /slave(795)/containers from 172.17.0.3:56992
I0713 23:49:43.003639  9127 http.cpp:970] Authorizing principal 'test-principal' to GET the
'/containers' endpoint
I0713 23:49:43.008221  9127 slave.cpp:843] Agent terminating
[       OK ] Endpoint/SlaveEndpointTest.NoAuthorizer/2 (34 ms)
[----------] 9 tests from Endpoint/SlaveEndpointTest (297 ms total)

[----------] Global test environment tear-down
[==========] 1594 tests from 174 test cases ran. (300621 ms total)
[  PASSED  ] 1593 tests.
[  FAILED  ] 1 test, listed below:
[  FAILED  ] DefaultExecutorCheckTest.HTTPCheckDelivered

 1 FAILED TEST
  YOU HAVE 20 DISABLED TESTS

I0713 23:49:43.078300  9137 process.cpp:993] Failed to accept socket: future discarded
make[3]: *** [CMakeFiles/check] Error 1
make[3]: Leaving directory `/mesos/build'
make[2]: *** [CMakeFiles/check.dir/all] Error 2
make[2]: Leaving directory `/mesos/build'
make[1]: *** [CMakeFiles/check.dir/rule] Error 2
make[1]: Leaving directory `/mesos/build'
make: *** [check] Error 2
+ docker rmi mesos-1499987359-16409
Untagged: mesos-1499987359-16409:latest
Deleted: sha256:32aae52e4f126a851a5f35cccc3fde1527477d108c0c8481561acc80e597e396
Deleted: sha256:68040de25913523f4a4183cf6bc15fdd2ed697bc6e53284e0615cb8b07be17ad
Deleted: sha256:12059f58b0336e4e4ac91d0a3754a0968598d6b8781dbd5f9d86b9386aa4768b
Deleted: sha256:d16ad89c66ac59edec77f05efc3647cc7d90104ea2fcd1901b9e48e29e959fd5
Deleted: sha256:9fc2e2d73e0594ba8b7ee055a6cca711828988a9e9bd95c562505fbfb102251b
Deleted: sha256:a13d62b0531f06e6034a3d227c714c2dc5275e6200746c1bbf058dfc574ed78e
Deleted: sha256:0ac41a127615fa0d33a57e810bf1a999299c3e7fbc66a6d1c701bd0736330518
Deleted: sha256:a3180c8ce79e6deace0b0b439f5a53bd687b566c11bf98bce695e5d95aa6e1f1
Deleted: sha256:c3cfb3abf356915ae5ca894ffe966e765da66d2af938b1e2adb882751bb9fdf9
Deleted: sha256:4214809984157f7eced69915965c0e7ea67e9958f88ffe36ac6d092ad456aa33
Deleted: sha256:0ffd00ebc5af6434ae2f2708a9add09a70a6cec4237891fd8eb3c0c6b75b510a
Deleted: sha256:a153711a57d8be9052b1bde1ecb30188d3357ad057a2c93a459f6b528756981f
Deleted: sha256:ed6a481bbaaa1155f5c9233fc3874e7cc07280f3e21ab568496dc26869a04e61
Deleted: sha256:201eea0303ac9f31c6842c32f420e185ba05c5af9f281082d790b87bf682761e
Deleted: sha256:61f55d6aefceaea89318d7a73630426ae9f3adf819feb6d41bfb84ed0e47f456
Deleted: sha256:793e42db53214df836bdc67a9101d6fbfb1ab59990595463b84c583f915d5521
Deleted: sha256:dde732ebdde09d65d5682ead2882141ddba038599360decd0837851b4c64736c
Deleted: sha256:d13e942a1162d6e76a1b9d123379299d89be7ca7a6c0b45e275e498a120870d8
Deleted: sha256:86b7373aa44942fd80db219b22fae9787c83800423eeb09e224f7a59013e1ef4
Deleted: sha256:ef3ae71603d2a7b57a3a5daa0538f9e6e6535187c611bdf2630ad0ebaabb7cb8
Deleted: sha256:8b81929c4e27f91f04ed63b16e0c182faaea7fa40e134b07668495bd4f748e1f
Deleted: sha256:f6f45d8d64d2bb1ed97b0f983a69b8f407f282a421bf113c7806bee37ccf9e38
Deleted: sha256:802f72cff2bcb6549ab36297fc2b82d1493819db40a40a386e409eee5e50d424
Deleted: sha256:9f5bb408b4eeb07ebf3055f1ab1d8dad1510db2e60f40d4f8c8a3b71f49c2842
Deleted: sha256:d063c8ef99ca91457e1e79faf14739abcf81d764073f47a17a441cf750f647e0
Build step 'Execute shell' marked build as failure
Not sending mail to unregistered user alexander@mesosphere.io

Mime
View raw message