mesos-builds mailing list archives

Site index · List index
Message view « Date » · « Thread »
Top « Date » · « Thread »
From Apache Jenkins Server <jenk...@builds.apache.org>
Subject Build failed in Jenkins: Mesos-Buildbot » autotools,gcc,--verbose --enable-libevent --enable-ssl,GLOG_v=1 MESOS_VERBOSE=1,centos:7,(ubuntu)&&(!ubuntu-us1)&&(!ubuntu-eu2) #3926
Date Tue, 18 Jul 2017 16:41:57 GMT
See <https://builds.apache.org/job/Mesos-Buildbot/BUILDTOOL=autotools,COMPILER=gcc,CONFIGURATION=--verbose%20--enable-libevent%20--enable-ssl,ENVIRONMENT=GLOG_v=1%20MESOS_VERBOSE=1,OS=centos%3A7,label_exp=(ubuntu)&&(!ubuntu-us1)&&(!ubuntu-eu2)/3926/display/redirect?page=changes>

Changes:

[xujyan] Updated documentation for MESOS-6223.

------------------------------------------
[...truncated 31.21 MB...]
[ RUN      ] Endpoint/SlaveEndpointTest.UnauthorizedRequest/0
I0718 16:41:49.913969  9217 containerizer.cpp:230] Using isolation: posix/cpu,posix/mem,filesystem/posix,network/cni,environment_secret
W0718 16:41:49.914608  9217 backend.cpp:76] Failed to create 'aufs' backend: AufsBackend requires
root privileges
W0718 16:41:49.914705  9217 backend.cpp:76] Failed to create 'bind' backend: BindBackend requires
root privileges
I0718 16:41:49.914767  9217 provisioner.cpp:255] Using default backend 'copy'
I0718 16:41:49.917971 30015 slave.cpp:250] Mesos agent started on (793)@172.17.0.6:44705
I0718 16:41:49.917994 30015 slave.cpp:251] Flags at startup: --acls="" --appc_simple_discovery_uri_prefix="http://"
--appc_store_dir="/tmp/Endpoint_SlaveEndpointTest_UnauthorizedRequest_0_EajYSf/store/appc"
--authenticate_http_executors="true" --authenticate_http_readonly="true" --authenticate_http_readwrite="true"
--authenticatee="crammd5" --authentication_backoff_factor="1secs" --authorizer="local" --cgroups_cpu_enable_pids_and_tids_count="false"
--cgroups_enable_cfs="false" --cgroups_hierarchy="/sys/fs/cgroup" --cgroups_limit_swap="false"
--cgroups_root="mesos" --container_disk_watch_interval="15secs" --containerizers="mesos" --credential="/tmp/Endpoint_SlaveEndpointTest_UnauthorizedRequest_0_EajYSf/credential"
--default_role="*" --disk_watch_interval="1mins" --docker="docker" --docker_kill_orphans="true"
--docker_registry="https://registry-1.docker.io" --docker_remove_delay="6hrs" --docker_socket="/var/run/docker.sock"
--docker_stop_timeout="0ns" --docker_store_dir="/tmp/Endpoint_SlaveEndpointTest_UnauthorizedRequest_0_EajYSf/store/docker"
--docker_volume_checkpoint_dir="/var/run/mesos/isolators/docker/volume" --enforce_container_disk_quota="false"
--executor_registration_timeout="1mins" --executor_reregistration_timeout="2secs" --executor_secret_key="/tmp/Endpoint_SlaveEndpointTest_UnauthorizedRequest_0_EajYSf/executor_secret_key"
--executor_shutdown_grace_period="5secs" --fetcher_cache_dir="/tmp/Endpoint_SlaveEndpointTest_UnauthorizedRequest_0_EajYSf/fetch"
--fetcher_cache_size="2GB" --frameworks_home="" --gc_delay="1weeks" --gc_disk_headroom="0.1"
--hadoop_home="" --help="false" --hostname_lookup="true" --http_command_executor="false" --http_credentials="/tmp/Endpoint_SlaveEndpointTest_UnauthorizedRequest_0_EajYSf/http_credentials"
--http_heartbeat_interval="30secs" --initialize_driver_logging="true" --isolation="posix/cpu,posix/mem"
--launcher="posix" --launcher_dir="/mesos/mesos-1.4.0/_build/src" --logbufsecs="0" --logging_level="INFO"
--max_completed_executors_per_framework="150" --oversubscribed_resources_interval="15secs"
--perf_duration="10secs" --perf_interval="1mins" --port="5051" --qos_correction_interval_min="0ns"
--quiet="false" --recover="reconnect" --recovery_timeout="15mins" --registration_backoff_factor="10ms"
--resources="cpus:2;gpus:0;mem:1024;disk:1024;ports:[31000-32000]" --revocable_cpu_low_priority="true"
--runtime_dir="/tmp/Endpoint_SlaveEndpointTest_UnauthorizedRequest_0_EajYSf" --sandbox_directory="/mnt/mesos/sandbox"
--strict="true" --switch_user="true" --systemd_enable_support="true" --systemd_runtime_directory="/run/systemd/system"
--version="false" --work_dir="/tmp/Endpoint_SlaveEndpointTest_UnauthorizedRequest_0_ZksIzc"
I0718 16:41:49.918395 30015 credentials.hpp:86] Loading credential for authentication from
'/tmp/Endpoint_SlaveEndpointTest_UnauthorizedRequest_0_EajYSf/credential'
I0718 16:41:49.918536 30015 slave.cpp:283] Agent using credential for: test-principal
I0718 16:41:49.918560 30015 credentials.hpp:37] Loading credentials for authentication from
'/tmp/Endpoint_SlaveEndpointTest_UnauthorizedRequest_0_EajYSf/http_credentials'
I0718 16:41:49.918840 30015 http.cpp:993] Creating default 'basic' HTTP authenticator for
realm 'mesos-agent-executor'
I0718 16:41:49.918951 30015 http.cpp:1014] Creating default 'jwt' HTTP authenticator for realm
'mesos-agent-executor'
I0718 16:41:49.919268 30015 http.cpp:993] Creating default 'basic' HTTP authenticator for
realm 'mesos-agent-readonly'
I0718 16:41:49.919371 30015 http.cpp:1014] Creating default 'jwt' HTTP authenticator for realm
'mesos-agent-readonly'
I0718 16:41:49.919585 30015 http.cpp:993] Creating default 'basic' HTTP authenticator for
realm 'mesos-agent-readwrite'
I0718 16:41:49.919699 30015 http.cpp:1014] Creating default 'jwt' HTTP authenticator for realm
'mesos-agent-readwrite'
I0718 16:41:49.921164 30015 slave.cpp:565] Agent resources: [{"name":"cpus","scalar":{"value":2.0},"type":"SCALAR"},{"name":"mem","scalar":{"value":1024.0},"type":"SCALAR"},{"name":"disk","scalar":{"value":1024.0},"type":"SCALAR"},{"name":"ports","ranges":{"range":[{"begin":31000,"end":32000}]},"type":"RANGES"}]
I0718 16:41:49.921423 30015 slave.cpp:573] Agent attributes: [  ]
I0718 16:41:49.921438 30015 slave.cpp:582] Agent hostname: e0e0108bb183
I0718 16:41:49.921558 30026 status_update_manager.cpp:177] Pausing sending status updates
I0718 16:41:49.923367 30010 state.cpp:64] Recovering state from '/tmp/Endpoint_SlaveEndpointTest_UnauthorizedRequest_0_ZksIzc/meta'
I0718 16:41:49.923828 30017 status_update_manager.cpp:203] Recovering status update manager
I0718 16:41:49.924017 30009 containerizer.cpp:582] Recovering containerizer
I0718 16:41:49.925761 30024 provisioner.cpp:416] Provisioner recovery complete
I0718 16:41:49.926257 30015 slave.cpp:6207] Finished recovery
I0718 16:41:49.926759 30015 slave.cpp:6389] Querying resource estimator for oversubscribable
resources
I0718 16:41:49.927057 30024 slave.cpp:6403] Received oversubscribable resources {} from the
resource estimator
I0718 16:41:49.929203 30014 process.cpp:3820] Handling HTTP event for process 'slave(793)'
with path: '/slave(793)/monitor/statistics'
I0718 16:41:49.930948 30018 http.cpp:1133] HTTP GET for /slave(793)/monitor/statistics from
172.17.0.6:46194
I0718 16:41:49.931036 30018 http.cpp:957] Authorizing principal 'test-principal' to GET the
'/monitor/statistics' endpoint
I0718 16:41:49.933380 30022 slave.cpp:843] Agent terminating
[       OK ] Endpoint/SlaveEndpointTest.UnauthorizedRequest/0 (31 ms)
[ RUN      ] Endpoint/SlaveEndpointTest.UnauthorizedRequest/1
I0718 16:41:49.945142  9217 containerizer.cpp:230] Using isolation: posix/cpu,posix/mem,filesystem/posix,network/cni,environment_secret
W0718 16:41:49.945760  9217 backend.cpp:76] Failed to create 'aufs' backend: AufsBackend requires
root privileges
W0718 16:41:49.945873  9217 backend.cpp:76] Failed to create 'bind' backend: BindBackend requires
root privileges
I0718 16:41:49.945914  9217 provisioner.cpp:255] Using default backend 'copy'
I0718 16:41:49.949298 30014 slave.cpp:250] Mesos agent started on (794)@172.17.0.6:44705
I0718 16:41:49.949326 30014 slave.cpp:251] Flags at startup: --acls="" --appc_simple_discovery_uri_prefix="http://"
--appc_store_dir="/tmp/Endpoint_SlaveEndpointTest_UnauthorizedRequest_1_cSFRnt/store/appc"
--authenticate_http_executors="true" --authenticate_http_readonly="true" --authenticate_http_readwrite="true"
--authenticatee="crammd5" --authentication_backoff_factor="1secs" --authorizer="local" --cgroups_cpu_enable_pids_and_tids_count="false"
--cgroups_enable_cfs="false" --cgroups_hierarchy="/sys/fs/cgroup" --cgroups_limit_swap="false"
--cgroups_root="mesos" --container_disk_watch_interval="15secs" --containerizers="mesos" --credential="/tmp/Endpoint_SlaveEndpointTest_UnauthorizedRequest_1_cSFRnt/credential"
--default_role="*" --disk_watch_interval="1mins" --docker="docker" --docker_kill_orphans="true"
--docker_registry="https://registry-1.docker.io" --docker_remove_delay="6hrs" --docker_socket="/var/run/docker.sock"
--docker_stop_timeout="0ns" --docker_store_dir="/tmp/Endpoint_SlaveEndpointTest_UnauthorizedRequest_1_cSFRnt/store/docker"
--docker_volume_checkpoint_dir="/var/run/mesos/isolators/docker/volume" --enforce_container_disk_quota="false"
--executor_registration_timeout="1mins" --executor_reregistration_timeout="2secs" --executor_secret_key="/tmp/Endpoint_SlaveEndpointTest_UnauthorizedRequest_1_cSFRnt/executor_secret_key"
--executor_shutdown_grace_period="5secs" --fetcher_cache_dir="/tmp/Endpoint_SlaveEndpointTest_UnauthorizedRequest_1_cSFRnt/fetch"
--fetcher_cache_size="2GB" --frameworks_home="" --gc_delay="1weeks" --gc_disk_headroom="0.1"
--hadoop_home="" --help="false" --hostname_lookup="true" --http_command_executor="false" --http_credentials="/tmp/Endpoint_SlaveEndpointTest_UnauthorizedRequest_1_cSFRnt/http_credentials"
--http_heartbeat_interval="30secs" --initialize_driver_logging="true" --isolation="posix/cpu,posix/mem"
--launcher="posix" --launcher_dir="/mesos/mesos-1.4.0/_build/src" --logbufsecs="0" --logging_level="INFO"
--max_completed_executors_per_framework="150" --oversubscribed_resources_interval="15secs"
--perf_duration="10secs" --perf_interval="1mins" --port="5051" --qos_correction_interval_min="0ns"
--quiet="false" --recover="reconnect" --recovery_timeout="15mins" --registration_backoff_factor="10ms"
--resources="cpus:2;gpus:0;mem:1024;disk:1024;ports:[31000-32000]" --revocable_cpu_low_priority="true"
--runtime_dir="/tmp/Endpoint_SlaveEndpointTest_UnauthorizedRequest_1_cSFRnt" --sandbox_directory="/mnt/mesos/sandbox"
--strict="true" --switch_user="true" --systemd_enable_support="true" --systemd_runtime_directory="/run/systemd/system"
--version="false" --work_dir="/tmp/Endpoint_SlaveEndpointTest_UnauthorizedRequest_1_z1BYZp"
I0718 16:41:49.949771 30014 credentials.hpp:86] Loading credential for authentication from
'/tmp/Endpoint_SlaveEndpointTest_UnauthorizedRequest_1_cSFRnt/credential'
I0718 16:41:49.949949 30014 slave.cpp:283] Agent using credential for: test-principal
I0718 16:41:49.949971 30014 credentials.hpp:37] Loading credentials for authentication from
'/tmp/Endpoint_SlaveEndpointTest_UnauthorizedRequest_1_cSFRnt/http_credentials'
I0718 16:41:49.950297 30014 http.cpp:993] Creating default 'basic' HTTP authenticator for
realm 'mesos-agent-executor'
I0718 16:41:49.950434 30014 http.cpp:1014] Creating default 'jwt' HTTP authenticator for realm
'mesos-agent-executor'
I0718 16:41:49.950664 30014 http.cpp:993] Creating default 'basic' HTTP authenticator for
realm 'mesos-agent-readonly'
I0718 16:41:49.950759 30014 http.cpp:1014] Creating default 'jwt' HTTP authenticator for realm
'mesos-agent-readonly'
I0718 16:41:49.950944 30014 http.cpp:993] Creating default 'basic' HTTP authenticator for
realm 'mesos-agent-readwrite'
I0718 16:41:49.951047 30014 http.cpp:1014] Creating default 'jwt' HTTP authenticator for realm
'mesos-agent-readwrite'
I0718 16:41:49.953289 30014 slave.cpp:565] Agent resources: [{"name":"cpus","scalar":{"value":2.0},"type":"SCALAR"},{"name":"mem","scalar":{"value":1024.0},"type":"SCALAR"},{"name":"disk","scalar":{"value":1024.0},"type":"SCALAR"},{"name":"ports","ranges":{"range":[{"begin":31000,"end":32000}]},"type":"RANGES"}]
I0718 16:41:49.953548 30014 slave.cpp:573] Agent attributes: [  ]
I0718 16:41:49.953565 30014 slave.cpp:582] Agent hostname: e0e0108bb183
I0718 16:41:49.953712 30024 status_update_manager.cpp:177] Pausing sending status updates
I0718 16:41:49.955461 30007 state.cpp:64] Recovering state from '/tmp/Endpoint_SlaveEndpointTest_UnauthorizedRequest_1_z1BYZp/meta'
I0718 16:41:49.955931 30014 status_update_manager.cpp:203] Recovering status update manager
I0718 16:41:49.956287 30023 containerizer.cpp:582] Recovering containerizer
I0718 16:41:49.958050 30027 provisioner.cpp:416] Provisioner recovery complete
I0718 16:41:49.958564 30018 slave.cpp:6207] Finished recovery
I0718 16:41:49.959122 30018 slave.cpp:6389] Querying resource estimator for oversubscribable
resources
I0718 16:41:49.959421 30019 slave.cpp:6403] Received oversubscribable resources {} from the
resource estimator
I0718 16:41:49.962246 30023 process.cpp:3820] Handling HTTP event for process 'slave(794)'
with path: '/slave(794)/monitor/statistics.json'
I0718 16:41:49.964236 30006 http.cpp:1133] HTTP GET for /slave(794)/monitor/statistics.json
from 172.17.0.6:46198
I0718 16:41:49.964334 30006 http.cpp:957] Authorizing principal 'test-principal' to GET the
'/monitor/statistics.json' endpoint
I0718 16:41:49.966719 30025 slave.cpp:843] Agent terminating
[       OK ] Endpoint/SlaveEndpointTest.UnauthorizedRequest/1 (34 ms)
[ RUN      ] Endpoint/SlaveEndpointTest.UnauthorizedRequest/2
I0718 16:41:49.990845  9217 containerizer.cpp:230] Using isolation: posix/cpu,posix/mem,filesystem/posix,network/cni,environment_secret
W0718 16:41:49.991397  9217 backend.cpp:76] Failed to create 'aufs' backend: AufsBackend requires
root privileges
W0718 16:41:49.991506  9217 backend.cpp:76] Failed to create 'bind' backend: BindBackend requires
root privileges
I0718 16:41:49.991541  9217 provisioner.cpp:255] Using default backend 'copy'
I0718 16:41:49.995525 30015 slave.cpp:250] Mesos agent started on (795)@172.17.0.6:44705
I0718 16:41:49.995566 30015 slave.cpp:251] Flags at startup: --acls="" --appc_simple_discovery_uri_prefix="http://"
--appc_store_dir="/tmp/Endpoint_SlaveEndpointTest_UnauthorizedRequest_2_ShJrgH/store/appc"
--authenticate_http_executors="true" --authenticate_http_readonly="true" --authenticate_http_readwrite="true"
--authenticatee="crammd5" --authentication_backoff_factor="1secs" --authorizer="local" --cgroups_cpu_enable_pids_and_tids_count="false"
--cgroups_enable_cfs="false" --cgroups_hierarchy="/sys/fs/cgroup" --cgroups_limit_swap="false"
--cgroups_root="mesos" --container_disk_watch_interval="15secs" --containerizers="mesos" --credential="/tmp/Endpoint_SlaveEndpointTest_UnauthorizedRequest_2_ShJrgH/credential"
--default_role="*" --disk_watch_interval="1mins" --docker="docker" --docker_kill_orphans="true"
--docker_registry="https://registry-1.docker.io" --docker_remove_delay="6hrs" --docker_socket="/var/run/docker.sock"
--docker_stop_timeout="0ns" --docker_store_dir="/tmp/Endpoint_SlaveEndpointTest_UnauthorizedRequest_2_ShJrgH/store/docker"
--docker_volume_checkpoint_dir="/var/run/mesos/isolators/docker/volume" --enforce_container_disk_quota="false"
--executor_registration_timeout="1mins" --executor_reregistration_timeout="2secs" --executor_secret_key="/tmp/Endpoint_SlaveEndpointTest_UnauthorizedRequest_2_ShJrgH/executor_secret_key"
--executor_shutdown_grace_period="5secs" --fetcher_cache_dir="/tmp/Endpoint_SlaveEndpointTest_UnauthorizedRequest_2_ShJrgH/fetch"
--fetcher_cache_size="2GB" --frameworks_home="" --gc_delay="1weeks" --gc_disk_headroom="0.1"
--hadoop_home="" --help="false" --hostname_lookup="true" --http_command_executor="false" --http_credentials="/tmp/Endpoint_SlaveEndpointTest_UnauthorizedRequest_2_ShJrgH/http_credentials"
--http_heartbeat_interval="30secs" --initialize_driver_logging="true" --isolation="posix/cpu,posix/mem"
--launcher="posix" --launcher_dir="/mesos/mesos-1.4.0/_build/src" --logbufsecs="0" --logging_level="INFO"
--max_completed_executors_per_framework="150" --oversubscribed_resources_interval="15secs"
--perf_duration="10secs" --perf_interval="1mins" --port="5051" --qos_correction_interval_min="0ns"
--quiet="false" --recover="reconnect" --recovery_timeout="15mins" --registration_backoff_factor="10ms"
--resources="cpus:2;gpus:0;mem:1024;disk:1024;ports:[31000-32000]" --revocable_cpu_low_priority="true"
--runtime_dir="/tmp/Endpoint_SlaveEndpointTest_UnauthorizedRequest_2_ShJrgH" --sandbox_directory="/mnt/mesos/sandbox"
--strict="true" --switch_user="true" --systemd_enable_support="true" --systemd_runtime_directory="/run/systemd/system"
--version="false" --work_dir="/tmp/Endpoint_SlaveEndpointTest_UnauthorizedRequest_2_V1THLD"
I0718 16:41:49.996085 30015 credentials.hpp:86] Loading credential for authentication from
'/tmp/Endpoint_SlaveEndpointTest_UnauthorizedRequest_2_ShJrgH/credential'
I0718 16:41:49.996294 30015 slave.cpp:283] Agent using credential for: test-principal
I0718 16:41:49.996315 30015 credentials.hpp:37] Loading credentials for authentication from
'/tmp/Endpoint_SlaveEndpointTest_UnauthorizedRequest_2_ShJrgH/http_credentials'
I0718 16:41:49.996601 30015 http.cpp:993] Creating default 'basic' HTTP authenticator for
realm 'mesos-agent-executor'
I0718 16:41:49.996748 30015 http.cpp:1014] Creating default 'jwt' HTTP authenticator for realm
'mesos-agent-executor'
I0718 16:41:49.997041 30015 http.cpp:993] Creating default 'basic' HTTP authenticator for
realm 'mesos-agent-readonly'
I0718 16:41:49.997144 30015 http.cpp:1014] Creating default 'jwt' HTTP authenticator for realm
'mesos-agent-readonly'
I0718 16:41:49.997392 30015 http.cpp:993] Creating default 'basic' HTTP authenticator for
realm 'mesos-agent-readwrite'
I0718 16:41:49.997515 30015 http.cpp:1014] Creating default 'jwt' HTTP authenticator for realm
'mesos-agent-readwrite'
I0718 16:41:49.999466 30015 slave.cpp:565] Agent resources: [{"name":"cpus","scalar":{"value":2.0},"type":"SCALAR"},{"name":"mem","scalar":{"value":1024.0},"type":"SCALAR"},{"name":"disk","scalar":{"value":1024.0},"type":"SCALAR"},{"name":"ports","ranges":{"range":[{"begin":31000,"end":32000}]},"type":"RANGES"}]
I0718 16:41:49.999768 30015 slave.cpp:573] Agent attributes: [  ]
I0718 16:41:49.999788 30015 slave.cpp:582] Agent hostname: e0e0108bb183
I0718 16:41:49.999935 30010 status_update_manager.cpp:177] Pausing sending status updates
I0718 16:41:50.001745 30009 state.cpp:64] Recovering state from '/tmp/Endpoint_SlaveEndpointTest_UnauthorizedRequest_2_V1THLD/meta'
I0718 16:41:50.002110 30019 status_update_manager.cpp:203] Recovering status update manager
I0718 16:41:50.002431 30009 containerizer.cpp:582] Recovering containerizer
I0718 16:41:50.004173 30019 provisioner.cpp:416] Provisioner recovery complete
I0718 16:41:50.004640 30017 slave.cpp:6207] Finished recovery
I0718 16:41:50.005142 30017 slave.cpp:6389] Querying resource estimator for oversubscribable
resources
I0718 16:41:50.005439 30010 slave.cpp:6403] Received oversubscribable resources {} from the
resource estimator
I0718 16:41:50.007983 30007 process.cpp:3820] Handling HTTP event for process 'slave(795)'
with path: '/slave(795)/containers'
I0718 16:41:50.010144 30027 http.cpp:1133] HTTP GET for /slave(795)/containers from 172.17.0.6:46200
I0718 16:41:50.010259 30027 http.cpp:957] Authorizing principal 'test-principal' to GET the
'/containers' endpoint
I0718 16:41:50.012791 30024 slave.cpp:843] Agent terminating
[       OK ] Endpoint/SlaveEndpointTest.UnauthorizedRequest/2 (44 ms)
[ RUN      ] Endpoint/SlaveEndpointTest.NoAuthorizer/0
I0718 16:41:50.024721  9217 containerizer.cpp:230] Using isolation: posix/cpu,posix/mem,filesystem/posix,network/cni,environment_secret
W0718 16:41:50.025274  9217 backend.cpp:76] Failed to create 'aufs' backend: AufsBackend requires
root privileges
W0718 16:41:50.025408  9217 backend.cpp:76] Failed to create 'bind' backend: BindBackend requires
root privileges
I0718 16:41:50.025451  9217 provisioner.cpp:255] Using default backend 'copy'
I0718 16:41:50.027231  9217 cluster.cpp:448] Creating default 'local' authorizer
I0718 16:41:50.029101 30023 slave.cpp:250] Mesos agent started on (796)@172.17.0.6:44705
I0718 16:41:50.029124 30023 slave.cpp:251] Flags at startup: --acls="" --appc_simple_discovery_uri_prefix="http://"
--appc_store_dir="/tmp/Endpoint_SlaveEndpointTest_NoAuthorizer_0_GohAwV/store/appc" --authenticate_http_executors="true"
--authenticate_http_readonly="true" --authenticate_http_readwrite="true" --authenticatee="crammd5"
--authentication_backoff_factor="1secs" --authorizer="local" --cgroups_cpu_enable_pids_and_tids_count="false"
--cgroups_enable_cfs="false" --cgroups_hierarchy="/sys/fs/cgroup" --cgroups_limit_swap="false"
--cgroups_root="mesos" --container_disk_watch_interval="15secs" --containerizers="mesos" --credential="/tmp/Endpoint_SlaveEndpointTest_NoAuthorizer_0_GohAwV/credential"
--default_role="*" --disk_watch_interval="1mins" --docker="docker" --docker_kill_orphans="true"
--docker_registry="https://registry-1.docker.io" --docker_remove_delay="6hrs" --docker_socket="/var/run/docker.sock"
--docker_stop_timeout="0ns" --docker_store_dir="/tmp/Endpoint_SlaveEndpointTest_NoAuthorizer_0_GohAwV/store/docker"
--docker_volume_checkpoint_dir="/var/run/mesos/isolators/docker/volume" --enforce_container_disk_quota="false"
--executor_registration_timeout="1mins" --executor_reregistration_timeout="2secs" --executor_secret_key="/tmp/Endpoint_SlaveEndpointTest_NoAuthorizer_0_GohAwV/executor_secret_key"
--executor_shutdown_grace_period="5secs" --fetcher_cache_dir="/tmp/Endpoint_SlaveEndpointTest_NoAuthorizer_0_GohAwV/fetch"
--fetcher_cache_size="2GB" --frameworks_home="" --gc_delay="1weeks" --gc_disk_headroom="0.1"
--hadoop_home="" --help="false" --hostname_lookup="true" --http_command_executor="false" --http_credentials="/tmp/Endpoint_SlaveEndpointTest_NoAuthorizer_0_GohAwV/http_credentials"
--http_heartbeat_interval="30secs" --initialize_driver_logging="true" --isolation="posix/cpu,posix/mem"
--launcher="posix" --launcher_dir="/mesos/mesos-1.4.0/_build/src" --logbufsecs="0" --logging_level="INFO"
--max_completed_executors_per_framework="150" --oversubscribed_resources_interval="15secs"
--perf_duration="10secs" --perf_interval="1mins" --port="5051" --qos_correction_interval_min="0ns"
--quiet="false" --recover="reconnect" --recovery_timeout="15mins" --registration_backoff_factor="10ms"
--resources="cpus:2;gpus:0;mem:1024;disk:1024;ports:[31000-32000]" --revocable_cpu_low_priority="true"
--runtime_dir="/tmp/Endpoint_SlaveEndpointTest_NoAuthorizer_0_GohAwV" --sandbox_directory="/mnt/mesos/sandbox"
--strict="true" --switch_user="true" --systemd_enable_support="true" --systemd_runtime_directory="/run/systemd/system"
--version="false" --work_dir="/tmp/Endpoint_SlaveEndpointTest_NoAuthorizer_0_pVBQWR"
I0718 16:41:50.029520 30023 credentials.hpp:86] Loading credential for authentication from
'/tmp/Endpoint_SlaveEndpointTest_NoAuthorizer_0_GohAwV/credential'
I0718 16:41:50.029701 30023 slave.cpp:283] Agent using credential for: test-principal
I0718 16:41:50.029726 30023 credentials.hpp:37] Loading credentials for authentication from
'/tmp/Endpoint_SlaveEndpointTest_NoAuthorizer_0_GohAwV/http_credentials'
I0718 16:41:50.030020 30023 http.cpp:993] Creating default 'basic' HTTP authenticator for
realm 'mesos-agent-executor'
I0718 16:41:50.030140 30023 http.cpp:1014] Creating default 'jwt' HTTP authenticator for realm
'mesos-agent-executor'
I0718 16:41:50.030493 30023 http.cpp:993] Creating default 'basic' HTTP authenticator for
realm 'mesos-agent-readonly'
I0718 16:41:50.030606 30023 http.cpp:1014] Creating default 'jwt' HTTP authenticator for realm
'mesos-agent-readonly'
I0718 16:41:50.030802 30023 http.cpp:993] Creating default 'basic' HTTP authenticator for
realm 'mesos-agent-readwrite'
I0718 16:41:50.030966 30023 http.cpp:1014] Creating default 'jwt' HTTP authenticator for realm
'mesos-agent-readwrite'
I0718 16:41:50.032724 30023 slave.cpp:565] Agent resources: [{"name":"cpus","scalar":{"value":2.0},"type":"SCALAR"},{"name":"mem","scalar":{"value":1024.0},"type":"SCALAR"},{"name":"disk","scalar":{"value":1024.0},"type":"SCALAR"},{"name":"ports","ranges":{"range":[{"begin":31000,"end":32000}]},"type":"RANGES"}]
I0718 16:41:50.032968 30023 slave.cpp:573] Agent attributes: [  ]
I0718 16:41:50.032982 30023 slave.cpp:582] Agent hostname: e0e0108bb183
I0718 16:41:50.033123 30009 status_update_manager.cpp:177] Pausing sending status updates
I0718 16:41:50.034899 30025 state.cpp:64] Recovering state from '/tmp/Endpoint_SlaveEndpointTest_NoAuthorizer_0_pVBQWR/meta'
I0718 16:41:50.035244 30023 status_update_manager.cpp:203] Recovering status update manager
I0718 16:41:50.035459 30013 containerizer.cpp:582] Recovering containerizer
I0718 16:41:50.036856 30017 provisioner.cpp:416] Provisioner recovery complete
I0718 16:41:50.037305 30015 slave.cpp:6207] Finished recovery
I0718 16:41:50.037799 30015 slave.cpp:6389] Querying resource estimator for oversubscribable
resources
I0718 16:41:50.038080 30008 slave.cpp:6403] Received oversubscribable resources {} from the
resource estimator
I0718 16:41:50.040403 30009 process.cpp:3820] Handling HTTP event for process 'slave(796)'
with path: '/slave(796)/monitor/statistics'
I0718 16:41:50.042219 30020 http.cpp:1133] HTTP GET for /slave(796)/monitor/statistics from
172.17.0.6:46202
I0718 16:41:50.042302 30020 http.cpp:957] Authorizing principal 'test-principal' to GET the
'/monitor/statistics' endpoint
I0718 16:41:50.045529 30017 slave.cpp:843] Agent terminating
[       OK ] Endpoint/SlaveEndpointTest.NoAuthorizer/0 (32 ms)
[ RUN      ] Endpoint/SlaveEndpointTest.NoAuthorizer/1
I0718 16:41:50.057296  9217 containerizer.cpp:230] Using isolation: posix/cpu,posix/mem,filesystem/posix,network/cni,environment_secret
W0718 16:41:50.057852  9217 backend.cpp:76] Failed to create 'aufs' backend: AufsBackend requires
root privileges
W0718 16:41:50.057965  9217 backend.cpp:76] Failed to create 'bind' backend: BindBackend requires
root privileges
I0718 16:41:50.058008  9217 provisioner.cpp:255] Using default backend 'copy'
I0718 16:41:50.059835  9217 cluster.cpp:448] Creating default 'local' authorizer
I0718 16:41:50.061434 30006 slave.cpp:250] Mesos agent started on (797)@172.17.0.6:44705
I0718 16:41:50.061456 30006 slave.cpp:251] Flags at startup: --acls="" --appc_simple_discovery_uri_prefix="http://"
--appc_store_dir="/tmp/Endpoint_SlaveEndpointTest_NoAuthorizer_1_2pT959/store/appc" --authenticate_http_executors="true"
--authenticate_http_readonly="true" --authenticate_http_readwrite="true" --authenticatee="crammd5"
--authentication_backoff_factor="1secs" --authorizer="local" --cgroups_cpu_enable_pids_and_tids_count="false"
--cgroups_enable_cfs="false" --cgroups_hierarchy="/sys/fs/cgroup" --cgroups_limit_swap="false"
--cgroups_root="mesos" --container_disk_watch_interval="15secs" --containerizers="mesos" --credential="/tmp/Endpoint_SlaveEndpointTest_NoAuthorizer_1_2pT959/credential"
--default_role="*" --disk_watch_interval="1mins" --docker="docker" --docker_kill_orphans="true"
--docker_registry="https://registry-1.docker.io" --docker_remove_delay="6hrs" --docker_socket="/var/run/docker.sock"
--docker_stop_timeout="0ns" --docker_store_dir="/tmp/Endpoint_SlaveEndpointTest_NoAuthorizer_1_2pT959/store/docker"
--docker_volume_checkpoint_dir="/var/run/mesos/isolators/docker/volume" --enforce_container_disk_quota="false"
--executor_registration_timeout="1mins" --executor_reregistration_timeout="2secs" --executor_secret_key="/tmp/Endpoint_SlaveEndpointTest_NoAuthorizer_1_2pT959/executor_secret_key"
--executor_shutdown_grace_period="5secs" --fetcher_cache_dir="/tmp/Endpoint_SlaveEndpointTest_NoAuthorizer_1_2pT959/fetch"
--fetcher_cache_size="2GB" --frameworks_home="" --gc_delay="1weeks" --gc_disk_headroom="0.1"
--hadoop_home="" --help="false" --hostname_lookup="true" --http_command_executor="false" --http_credentials="/tmp/Endpoint_SlaveEndpointTest_NoAuthorizer_1_2pT959/http_credentials"
--http_heartbeat_interval="30secs" --initialize_driver_logging="true" --isolation="posix/cpu,posix/mem"
--launcher="posix" --launcher_dir="/mesos/mesos-1.4.0/_build/src" --logbufsecs="0" --logging_level="INFO"
--max_completed_executors_per_framework="150" --oversubscribed_resources_interval="15secs"
--perf_duration="10secs" --perf_interval="1mins" --port="5051" --qos_correction_interval_min="0ns"
--quiet="false" --recover="reconnect" --recovery_timeout="15mins" --registration_backoff_factor="10ms"
--resources="cpus:2;gpus:0;mem:1024;disk:1024;ports:[31000-32000]" --revocable_cpu_low_priority="true"
--runtime_dir="/tmp/Endpoint_SlaveEndpointTest_NoAuthorizer_1_2pT959" --sandbox_directory="/mnt/mesos/sandbox"
--strict="true" --switch_user="true" --systemd_enable_support="true" --systemd_runtime_directory="/run/systemd/system"
--version="false" --work_dir="/tmp/Endpoint_SlaveEndpointTest_NoAuthorizer_1_jOZyr6"
I0718 16:41:50.061867 30006 credentials.hpp:86] Loading credential for authentication from
'/tmp/Endpoint_SlaveEndpointTest_NoAuthorizer_1_2pT959/credential'
I0718 16:41:50.062031 30006 slave.cpp:283] Agent using credential for: test-principal
I0718 16:41:50.062054 30006 credentials.hpp:37] Loading credentials for authentication from
'/tmp/Endpoint_SlaveEndpointTest_NoAuthorizer_1_2pT959/http_credentials'
I0718 16:41:50.062369 30006 http.cpp:993] Creating default 'basic' HTTP authenticator for
realm 'mesos-agent-executor'
I0718 16:41:50.062482 30006 http.cpp:1014] Creating default 'jwt' HTTP authenticator for realm
'mesos-agent-executor'
I0718 16:41:50.062822 30006 http.cpp:993] Creating default 'basic' HTTP authenticator for
realm 'mesos-agent-readonly'
I0718 16:41:50.062981 30006 http.cpp:1014] Creating default 'jwt' HTTP authenticator for realm
'mesos-agent-readonly'
I0718 16:41:50.063226 30006 http.cpp:993] Creating default 'basic' HTTP authenticator for
realm 'mesos-agent-readwrite'
I0718 16:41:50.063325 30006 http.cpp:1014] Creating default 'jwt' HTTP authenticator for realm
'mesos-agent-readwrite'
I0718 16:41:50.064709 30006 slave.cpp:565] Agent resources: [{"name":"cpus","scalar":{"value":2.0},"type":"SCALAR"},{"name":"mem","scalar":{"value":1024.0},"type":"SCALAR"},{"name":"disk","scalar":{"value":1024.0},"type":"SCALAR"},{"name":"ports","ranges":{"range":[{"begin":31000,"end":32000}]},"type":"RANGES"}]
I0718 16:41:50.064946 30006 slave.cpp:573] Agent attributes: [  ]
I0718 16:41:50.064961 30006 slave.cpp:582] Agent hostname: e0e0108bb183
I0718 16:41:50.065083 30020 status_update_manager.cpp:177] Pausing sending status updates
I0718 16:41:50.066551 30025 state.cpp:64] Recovering state from '/tmp/Endpoint_SlaveEndpointTest_NoAuthorizer_1_jOZyr6/meta'
I0718 16:41:50.066830 30017 status_update_manager.cpp:203] Recovering status update manager
I0718 16:41:50.067111 30022 containerizer.cpp:582] Recovering containerizer
I0718 16:41:50.068819 30011 provisioner.cpp:416] Provisioner recovery complete
I0718 16:41:50.069365 30020 slave.cpp:6207] Finished recovery
I0718 16:41:50.069808 30020 slave.cpp:6389] Querying resource estimator for oversubscribable
resources
I0718 16:41:50.070060 30009 slave.cpp:6403] Received oversubscribable resources {} from the
resource estimator
I0718 16:41:50.072093 30015 process.cpp:3820] Handling HTTP event for process 'slave(797)'
with path: '/slave(797)/monitor/statistics.json'
I0718 16:41:50.073851 30026 http.cpp:1133] HTTP GET for /slave(797)/monitor/statistics.json
from 172.17.0.6:46204
I0718 16:41:50.073925 30026 http.cpp:957] Authorizing principal 'test-principal' to GET the
'/monitor/statistics.json' endpoint
I0718 16:41:50.076962 30022 slave.cpp:843] Agent terminating
[       OK ] Endpoint/SlaveEndpointTest.NoAuthorizer/1 (30 ms)
[ RUN      ] Endpoint/SlaveEndpointTest.NoAuthorizer/2
I0718 16:41:50.088152  9217 containerizer.cpp:230] Using isolation: posix/cpu,posix/mem,filesystem/posix,network/cni,environment_secret
W0718 16:41:50.088685  9217 backend.cpp:76] Failed to create 'aufs' backend: AufsBackend requires
root privileges
W0718 16:41:50.088804  9217 backend.cpp:76] Failed to create 'bind' backend: BindBackend requires
root privileges
I0718 16:41:50.088843  9217 provisioner.cpp:255] Using default backend 'copy'
I0718 16:41:50.090548  9217 cluster.cpp:448] Creating default 'local' authorizer
I0718 16:41:50.092078 30015 slave.cpp:250] Mesos agent started on (798)@172.17.0.6:44705
I0718 16:41:50.092104 30015 slave.cpp:251] Flags at startup: --acls="" --appc_simple_discovery_uri_prefix="http://"
--appc_store_dir="/tmp/Endpoint_SlaveEndpointTest_NoAuthorizer_2_tOukYo/store/appc" --authenticate_http_executors="true"
--authenticate_http_readonly="true" --authenticate_http_readwrite="true" --authenticatee="crammd5"
--authentication_backoff_factor="1secs" --authorizer="local" --cgroups_cpu_enable_pids_and_tids_count="false"
--cgroups_enable_cfs="false" --cgroups_hierarchy="/sys/fs/cgroup" --cgroups_limit_swap="false"
--cgroups_root="mesos" --container_disk_watch_interval="15secs" --containerizers="mesos" --credential="/tmp/Endpoint_SlaveEndpointTest_NoAuthorizer_2_tOukYo/credential"
--default_role="*" --disk_watch_interval="1mins" --docker="docker" --docker_kill_orphans="true"
--docker_registry="https://registry-1.docker.io" --docker_remove_delay="6hrs" --docker_socket="/var/run/docker.sock"
--docker_stop_timeout="0ns" --docker_store_dir="/tmp/Endpoint_SlaveEndpointTest_NoAuthorizer_2_tOukYo/store/docker"
--docker_volume_checkpoint_dir="/var/run/mesos/isolators/docker/volume" --enforce_container_disk_quota="false"
--executor_registration_timeout="1mins" --executor_reregistration_timeout="2secs" --executor_secret_key="/tmp/Endpoint_SlaveEndpointTest_NoAuthorizer_2_tOukYo/executor_secret_key"
--executor_shutdown_grace_period="5secs" --fetcher_cache_dir="/tmp/Endpoint_SlaveEndpointTest_NoAuthorizer_2_tOukYo/fetch"
--fetcher_cache_size="2GB" --frameworks_home="" --gc_delay="1weeks" --gc_disk_headroom="0.1"
--hadoop_home="" --help="false" --hostname_lookup="true" --http_command_executor="false" --http_credentials="/tmp/Endpoint_SlaveEndpointTest_NoAuthorizer_2_tOukYo/http_credentials"
--http_heartbeat_interval="30secs" --initialize_driver_logging="true" --isolation="posix/cpu,posix/mem"
--launcher="posix" --launcher_dir="/mesos/mesos-1.4.0/_build/src" --logbufsecs="0" --logging_level="INFO"
--max_completed_executors_per_framework="150" --oversubscribed_resources_interval="15secs"
--perf_duration="10secs" --perf_interval="1mins" --port="5051" --qos_correction_interval_min="0ns"
--quiet="false" --recover="reconnect" --recovery_timeout="15mins" --registration_backoff_factor="10ms"
--resources="cpus:2;gpus:0;mem:1024;disk:1024;ports:[31000-32000]" --revocable_cpu_low_priority="true"
--runtime_dir="/tmp/Endpoint_SlaveEndpointTest_NoAuthorizer_2_tOukYo" --sandbox_directory="/mnt/mesos/sandbox"
--strict="true" --switch_user="true" --systemd_enable_support="true" --systemd_runtime_directory="/run/systemd/system"
--version="false" --work_dir="/tmp/Endpoint_SlaveEndpointTest_NoAuthorizer_2_cTt8el"
I0718 16:41:50.092686 30015 credentials.hpp:86] Loading credential for authentication from
'/tmp/Endpoint_SlaveEndpointTest_NoAuthorizer_2_tOukYo/credential'
I0718 16:41:50.092871 30015 slave.cpp:283] Agent using credential for: test-principal
I0718 16:41:50.092895 30015 credentials.hpp:37] Loading credentials for authentication from
'/tmp/Endpoint_SlaveEndpointTest_NoAuthorizer_2_tOukYo/http_credentials'
I0718 16:41:50.093235 30015 http.cpp:993] Creating default 'basic' HTTP authenticator for
realm 'mesos-agent-executor'
I0718 16:41:50.093353 30015 http.cpp:1014] Creating default 'jwt' HTTP authenticator for realm
'mesos-agent-executor'
I0718 16:41:50.093554 30015 http.cpp:993] Creating default 'basic' HTTP authenticator for
realm 'mesos-agent-readonly'
I0718 16:41:50.093757 30015 http.cpp:1014] Creating default 'jwt' HTTP authenticator for realm
'mesos-agent-readonly'
I0718 16:41:50.094048 30015 http.cpp:993] Creating default 'basic' HTTP authenticator for
realm 'mesos-agent-readwrite'
I0718 16:41:50.094168 30015 http.cpp:1014] Creating default 'jwt' HTTP authenticator for realm
'mesos-agent-readwrite'
I0718 16:41:50.095844 30015 slave.cpp:565] Agent resources: [{"name":"cpus","scalar":{"value":2.0},"type":"SCALAR"},{"name":"mem","scalar":{"value":1024.0},"type":"SCALAR"},{"name":"disk","scalar":{"value":1024.0},"type":"SCALAR"},{"name":"ports","ranges":{"range":[{"begin":31000,"end":32000}]},"type":"RANGES"}]
I0718 16:41:50.096079 30015 slave.cpp:573] Agent attributes: [  ]
I0718 16:41:50.096094 30015 slave.cpp:582] Agent hostname: e0e0108bb183
I0718 16:41:50.096215 30011 status_update_manager.cpp:177] Pausing sending status updates
I0718 16:41:50.097595 30014 state.cpp:64] Recovering state from '/tmp/Endpoint_SlaveEndpointTest_NoAuthorizer_2_cTt8el/meta'
I0718 16:41:50.097880 30020 status_update_manager.cpp:203] Recovering status update manager
I0718 16:41:50.098213 30025 containerizer.cpp:582] Recovering containerizer
I0718 16:41:50.099588 30023 provisioner.cpp:416] Provisioner recovery complete
I0718 16:41:50.100020 30015 slave.cpp:6207] Finished recovery
I0718 16:41:50.100510 30015 slave.cpp:6389] Querying resource estimator for oversubscribable
resources
I0718 16:41:50.100857 30018 slave.cpp:6403] Received oversubscribable resources {} from the
resource estimator
I0718 16:41:50.102591 30020 process.cpp:3820] Handling HTTP event for process 'slave(798)'
with path: '/slave(798)/containers'
I0718 16:41:50.104338 30008 http.cpp:1133] HTTP GET for /slave(798)/containers from 172.17.0.6:46206
I0718 16:41:50.104426 30008 http.cpp:957] Authorizing principal 'test-principal' to GET the
'/containers' endpoint
I0718 16:41:50.107939 30028 slave.cpp:843] Agent terminating
[       OK ] Endpoint/SlaveEndpointTest.NoAuthorizer/2 (31 ms)
[----------] 9 tests from Endpoint/SlaveEndpointTest (302 ms total)

[----------] Global test environment tear-down
[==========] 1641 tests from 181 test cases ran. (648505 ms total)
[  PASSED  ] 1636 tests.
[  FAILED  ] 5 tests, listed below:
[  FAILED  ] CommandExecutorCheckTest.CommandCheckDeliveredAndReconciled
[  FAILED  ] DefaultExecutorCheckTest.CommandCheckDeliveredAndReconciled
[  FAILED  ] DefaultExecutorCheckTest.CommandCheckStatusChange
[  FAILED  ] DefaultExecutorCheckTest.CommandCheckSeesParentsEnv
[  FAILED  ] DefaultExecutorCheckTest.CommandCheckSharesWorkDirWithTask

 5 FAILED TESTS
  YOU HAVE 20 DISABLED TESTS

I0718 16:41:50.181470 30029 process.cpp:993] Failed to accept socket: future discarded
make[4]: *** [check-local] Error 1
make[4]: Leaving directory `/mesos/mesos-1.4.0/_build/src'
make[3]: *** [check-am] Error 2
make[3]: Leaving directory `/mesos/mesos-1.4.0/_build/src'
make[2]: *** [check] Error 2
make[2]: Leaving directory `/mesos/mesos-1.4.0/_build/src'
make[1]: *** [check-recursive] Error 1
make[1]: Leaving directory `/mesos/mesos-1.4.0/_build'
make: *** [distcheck] Error 1
+ docker rmi mesos-1500393447-16035
Untagged: mesos-1500393447-16035:latest
Deleted: sha256:f9556d372b675fe68eb6788ace0a3cd6c84a646e1ddbd78a9511f22f6ec163f1
Deleted: sha256:cea6adc163ae08c1189807c9ed85ac7952b2b47d20cd881de4726cde65fcf311
Deleted: sha256:983fc2da601fc3672504df99a6811242e9d52a8c9f115c661e3ce2bdbd709ec0
Deleted: sha256:593ffc867f09e92f01b9c529f6ff213f0d4e1e2b4a48dca1144c0db56c18119a
Deleted: sha256:46b760f38105245c30190ce714f295688a0e15c87e3071fa950031d23ba04fc1
Deleted: sha256:8e0c4fd474aa0bed95d142423eb472edea84f9b90188150f83dd2b49e7e2dc41
Deleted: sha256:10902aab995fc17c578384b6da09033eea87862a600a24ea96859f63d233e352
Deleted: sha256:c5174772e3fe9c2979ee2aa2bc8db4a964b7969cbf2e35eb9c2d2c6e1c88e8a2
Deleted: sha256:01776dde984c25ef232e28e50c261c0950ddd29cf598ccbbea4cdd3d7a9b810e
Deleted: sha256:cd32851f8311cd1e5c749bb2fdd00526a60a10fb491b2488dee5c75f6ae4d72f
Deleted: sha256:ec052e9cc37222f94b6960a096be3c0430166a542ade9a06d9c8e86069627031
Deleted: sha256:120842f31b54e752e5b7fa126a5cf8d641d35aed88c5e953c016d1f33ba8868e
Deleted: sha256:ccef3a66f2431dba9eb353caf4845f9c6ee2e6c3951c75ebf2d083ada3472840
Deleted: sha256:233db173e4986a86b38c1972eadb614b462c2c4085a63e7c8e9c7f2f399dd216
Deleted: sha256:902aa20c2f62ff7533c9ef93295c34e203d7343ed1babcf6feb323ff3f914036
Deleted: sha256:1825f2ce17d5b6f8e52fe8c05a85649629b5777cba38e39686ea89313242af0d
Deleted: sha256:06439298f92af8616af2c5952f89d24ace25757d9ca74ea766652fce3c55f528
Deleted: sha256:4f249da8f48bba09cb99569b1ba200aef720eee0fd768cd723a037efb68cd251
Deleted: sha256:15806c437d63ed17827d89fd4e0555317f79cdfad94402a7c38ea946bce4a3a2
Deleted: sha256:b5f65df4eb1ffed946494ed6312f286a0c980ec6b0055b26c34c89fcff714e3c
Deleted: sha256:583c349bf3984505758a1b8a356561ef6425e3afe85fd4a093f71b3157f701a6
Deleted: sha256:fff27b075ed3ee8b67753e7611e80818a94f95de5da44e045f9392866d1c6d6d
Deleted: sha256:9864a390a9c4f7122a066ecb7f2955cf2345e71f46b4e1e94f5ec9b8713dea17
Deleted: sha256:7c0df1f5c97e785fba6d6517f35fdd5313298ccb0fe87f036e0faca55fd284d1
Deleted: sha256:7bacc577b8c9accf84649ada93e00a2cf8b207e4b5be244e4755c7d614294a1b
Build step 'Execute shell' marked build as failure
Not sending mail to unregistered user xujyan@apple.com

Mime
View raw message