mesos-builds mailing list archives

Site index · List index
Message view « Date » · « Thread »
Top « Date » · « Thread »
From Apache Jenkins Server <jenk...@builds.apache.org>
Subject Build failed in Jenkins: Mesos-Buildbot » autotools,gcc,--verbose --enable-libevent --enable-ssl,GLOG_v=1 MESOS_VERBOSE=1,centos:7,(ubuntu)&&(!ubuntu-us1)&&(!ubuntu-eu2) #3934
Date Thu, 20 Jul 2017 00:28:31 GMT
See <https://builds.apache.org/job/Mesos-Buildbot/BUILDTOOL=autotools,COMPILER=gcc,CONFIGURATION=--verbose%20--enable-libevent%20--enable-ssl,ENVIRONMENT=GLOG_v=1%20MESOS_VERBOSE=1,OS=centos%3A7,label_exp=(ubuntu)&&(!ubuntu-us1)&&(!ubuntu-eu2)/3934/display/redirect?page=changes>

Changes:

[yujie.jay] Set the `LIBPROCESS_IP` env variable before starting the fetcher.

[yujie.jay] Added MESOS-7796 to 1.3.1 CHANGELOG.

------------------------------------------
[...truncated 28.10 MB...]
[       OK ] Endpoint/SlaveEndpointTest.AuthorizedRequest/2 (31 ms)
[ RUN      ] Endpoint/SlaveEndpointTest.UnauthorizedRequest/0
I0720 00:28:20.098105  2255 containerizer.cpp:221] Using isolation: posix/cpu,posix/mem,filesystem/posix,network/cni
W0720 00:28:20.098644  2255 backend.cpp:76] Failed to create 'aufs' backend: AufsBackend requires
root privileges
W0720 00:28:20.098759  2255 backend.cpp:76] Failed to create 'bind' backend: BindBackend requires
root privileges
I0720 00:28:20.098794  2255 provisioner.cpp:249] Using default backend 'copy'
I0720 00:28:20.101902 21542 slave.cpp:231] Mesos agent started on (744)@172.17.0.2:44756
I0720 00:28:20.101924 21542 slave.cpp:232] Flags at startup: --acls="" --appc_simple_discovery_uri_prefix="http://"
--appc_store_dir="/tmp/mesos/store/appc" --authenticate_http_executors="true" --authenticate_http_readonly="true"
--authenticate_http_readwrite="true" --authenticatee="crammd5" --authentication_backoff_factor="1secs"
--authorizer="local" --cgroups_cpu_enable_pids_and_tids_count="false" --cgroups_enable_cfs="false"
--cgroups_hierarchy="/sys/fs/cgroup" --cgroups_limit_swap="false" --cgroups_root="mesos" --container_disk_watch_interval="15secs"
--containerizers="mesos" --credential="/tmp/Endpoint_SlaveEndpointTest_UnauthorizedRequest_0_O3qlGE/credential"
--default_role="*" --disk_watch_interval="1mins" --docker="docker" --docker_kill_orphans="true"
--docker_registry="https://registry-1.docker.io" --docker_remove_delay="6hrs" --docker_socket="/var/run/docker.sock"
--docker_stop_timeout="0ns" --docker_store_dir="/tmp/mesos/store/docker" --docker_volume_checkpoint_dir="/var/run/mesos/isolators/docker/volume"
--enforce_container_disk_quota="false" --executor_registration_timeout="1mins" --executor_reregistration_timeout="2secs"
--executor_secret_key="/tmp/Endpoint_SlaveEndpointTest_UnauthorizedRequest_0_O3qlGE/executor_secret_key"
--executor_shutdown_grace_period="5secs" --fetcher_cache_dir="/tmp/Endpoint_SlaveEndpointTest_UnauthorizedRequest_0_O3qlGE/fetch"
--fetcher_cache_size="2GB" --frameworks_home="" --gc_delay="1weeks" --gc_disk_headroom="0.1"
--hadoop_home="" --help="false" --hostname_lookup="true" --http_command_executor="false" --http_credentials="/tmp/Endpoint_SlaveEndpointTest_UnauthorizedRequest_0_O3qlGE/http_credentials"
--http_heartbeat_interval="30secs" --initialize_driver_logging="true" --isolation="posix/cpu,posix/mem"
--launcher="posix" --launcher_dir="/mesos/mesos-1.3.1/_build/src" --logbufsecs="0" --logging_level="INFO"
--max_completed_executors_per_framework="150" --oversubscribed_resources_interval="15secs"
--perf_duration="10secs" --perf_interval="1mins" --port="5051" --qos_correction_interval_min="0ns"
--quiet="false" --recover="reconnect" --recovery_timeout="15mins" --registration_backoff_factor="10ms"
--resources="cpus:2;gpus:0;mem:1024;disk:1024;ports:[31000-32000]" --revocable_cpu_low_priority="true"
--runtime_dir="/tmp/Endpoint_SlaveEndpointTest_UnauthorizedRequest_0_O3qlGE" --sandbox_directory="/mnt/mesos/sandbox"
--strict="true" --switch_user="true" --systemd_enable_support="true" --systemd_runtime_directory="/run/systemd/system"
--version="false" --work_dir="/tmp/Endpoint_SlaveEndpointTest_UnauthorizedRequest_0_pnTrWI"
I0720 00:28:20.102372 21542 credentials.hpp:86] Loading credential for authentication from
'/tmp/Endpoint_SlaveEndpointTest_UnauthorizedRequest_0_O3qlGE/credential'
I0720 00:28:20.102566 21542 slave.cpp:264] Agent using credential for: test-principal
I0720 00:28:20.102584 21542 credentials.hpp:37] Loading credentials for authentication from
'/tmp/Endpoint_SlaveEndpointTest_UnauthorizedRequest_0_O3qlGE/http_credentials'
I0720 00:28:20.102859 21542 http.cpp:975] Creating default 'basic' HTTP authenticator for
realm 'mesos-agent-executor'
I0720 00:28:20.102972 21542 http.cpp:996] Creating default 'jwt' HTTP authenticator for realm
'mesos-agent-executor'
I0720 00:28:20.103248 21542 http.cpp:975] Creating default 'basic' HTTP authenticator for
realm 'mesos-agent-readonly'
I0720 00:28:20.103353 21542 http.cpp:996] Creating default 'jwt' HTTP authenticator for realm
'mesos-agent-readonly'
I0720 00:28:20.103673 21542 http.cpp:975] Creating default 'basic' HTTP authenticator for
realm 'mesos-agent-readwrite'
I0720 00:28:20.103773 21542 http.cpp:996] Creating default 'jwt' HTTP authenticator for realm
'mesos-agent-readwrite'
I0720 00:28:20.105183 21542 slave.cpp:531] Agent resources: cpus(*):2; mem(*):1024; disk(*):1024;
ports(*):[31000-32000]
I0720 00:28:20.105262 21542 slave.cpp:539] Agent attributes: [  ]
I0720 00:28:20.105273 21542 slave.cpp:544] Agent hostname: 5290a327ba2f
I0720 00:28:20.105413 21527 status_update_manager.cpp:177] Pausing sending status updates
I0720 00:28:20.107008 21544 state.cpp:62] Recovering state from '/tmp/Endpoint_SlaveEndpointTest_UnauthorizedRequest_0_pnTrWI/meta'
I0720 00:28:20.107481 21537 status_update_manager.cpp:203] Recovering status update manager
I0720 00:28:20.107674 21526 containerizer.cpp:608] Recovering containerizer
I0720 00:28:20.109047 21526 provisioner.cpp:410] Provisioner recovery complete
I0720 00:28:20.109560 21543 slave.cpp:6075] Finished recovery
I0720 00:28:20.110054 21543 slave.cpp:6257] Querying resource estimator for oversubscribable
resources
I0720 00:28:20.110360 21549 slave.cpp:6271] Received oversubscribable resources {} from the
resource estimator
I0720 00:28:20.112457 21540 process.cpp:3741] Handling HTTP event for process 'slave(744)'
with path: '/slave(744)/monitor/statistics'
I0720 00:28:20.114104 21530 http.cpp:1115] HTTP GET for /slave(744)/monitor/statistics from
172.17.0.2:57932
I0720 00:28:20.114162 21530 http.cpp:936] Authorizing principal 'test-principal' to GET the
'/monitor/statistics' endpoint
I0720 00:28:20.116128 21546 slave.cpp:796] Agent terminating
[       OK ] Endpoint/SlaveEndpointTest.UnauthorizedRequest/0 (28 ms)
[ RUN      ] Endpoint/SlaveEndpointTest.UnauthorizedRequest/1
I0720 00:28:20.125841  2255 containerizer.cpp:221] Using isolation: posix/cpu,posix/mem,filesystem/posix,network/cni
W0720 00:28:20.126394  2255 backend.cpp:76] Failed to create 'aufs' backend: AufsBackend requires
root privileges
W0720 00:28:20.126497  2255 backend.cpp:76] Failed to create 'bind' backend: BindBackend requires
root privileges
I0720 00:28:20.126528  2255 provisioner.cpp:249] Using default backend 'copy'
I0720 00:28:20.129293 21542 slave.cpp:231] Mesos agent started on (745)@172.17.0.2:44756
I0720 00:28:20.129315 21542 slave.cpp:232] Flags at startup: --acls="" --appc_simple_discovery_uri_prefix="http://"
--appc_store_dir="/tmp/mesos/store/appc" --authenticate_http_executors="true" --authenticate_http_readonly="true"
--authenticate_http_readwrite="true" --authenticatee="crammd5" --authentication_backoff_factor="1secs"
--authorizer="local" --cgroups_cpu_enable_pids_and_tids_count="false" --cgroups_enable_cfs="false"
--cgroups_hierarchy="/sys/fs/cgroup" --cgroups_limit_swap="false" --cgroups_root="mesos" --container_disk_watch_interval="15secs"
--containerizers="mesos" --credential="/tmp/Endpoint_SlaveEndpointTest_UnauthorizedRequest_1_CdjbSn/credential"
--default_role="*" --disk_watch_interval="1mins" --docker="docker" --docker_kill_orphans="true"
--docker_registry="https://registry-1.docker.io" --docker_remove_delay="6hrs" --docker_socket="/var/run/docker.sock"
--docker_stop_timeout="0ns" --docker_store_dir="/tmp/mesos/store/docker" --docker_volume_checkpoint_dir="/var/run/mesos/isolators/docker/volume"
--enforce_container_disk_quota="false" --executor_registration_timeout="1mins" --executor_reregistration_timeout="2secs"
--executor_secret_key="/tmp/Endpoint_SlaveEndpointTest_UnauthorizedRequest_1_CdjbSn/executor_secret_key"
--executor_shutdown_grace_period="5secs" --fetcher_cache_dir="/tmp/Endpoint_SlaveEndpointTest_UnauthorizedRequest_1_CdjbSn/fetch"
--fetcher_cache_size="2GB" --frameworks_home="" --gc_delay="1weeks" --gc_disk_headroom="0.1"
--hadoop_home="" --help="false" --hostname_lookup="true" --http_command_executor="false" --http_credentials="/tmp/Endpoint_SlaveEndpointTest_UnauthorizedRequest_1_CdjbSn/http_credentials"
--http_heartbeat_interval="30secs" --initialize_driver_logging="true" --isolation="posix/cpu,posix/mem"
--launcher="posix" --launcher_dir="/mesos/mesos-1.3.1/_build/src" --logbufsecs="0" --logging_level="INFO"
--max_completed_executors_per_framework="150" --oversubscribed_resources_interval="15secs"
--perf_duration="10secs" --perf_interval="1mins" --port="5051" --qos_correction_interval_min="0ns"
--quiet="false" --recover="reconnect" --recovery_timeout="15mins" --registration_backoff_factor="10ms"
--resources="cpus:2;gpus:0;mem:1024;disk:1024;ports:[31000-32000]" --revocable_cpu_low_priority="true"
--runtime_dir="/tmp/Endpoint_SlaveEndpointTest_UnauthorizedRequest_1_CdjbSn" --sandbox_directory="/mnt/mesos/sandbox"
--strict="true" --switch_user="true" --systemd_enable_support="true" --systemd_runtime_directory="/run/systemd/system"
--version="false" --work_dir="/tmp/Endpoint_SlaveEndpointTest_UnauthorizedRequest_1_HPx83r"
I0720 00:28:20.129679 21542 credentials.hpp:86] Loading credential for authentication from
'/tmp/Endpoint_SlaveEndpointTest_UnauthorizedRequest_1_CdjbSn/credential'
I0720 00:28:20.129837 21542 slave.cpp:264] Agent using credential for: test-principal
I0720 00:28:20.129859 21542 credentials.hpp:37] Loading credentials for authentication from
'/tmp/Endpoint_SlaveEndpointTest_UnauthorizedRequest_1_CdjbSn/http_credentials'
I0720 00:28:20.130163 21542 http.cpp:975] Creating default 'basic' HTTP authenticator for
realm 'mesos-agent-executor'
I0720 00:28:20.130280 21542 http.cpp:996] Creating default 'jwt' HTTP authenticator for realm
'mesos-agent-executor'
I0720 00:28:20.130580 21542 http.cpp:975] Creating default 'basic' HTTP authenticator for
realm 'mesos-agent-readonly'
I0720 00:28:20.130684 21542 http.cpp:996] Creating default 'jwt' HTTP authenticator for realm
'mesos-agent-readonly'
I0720 00:28:20.130885 21542 http.cpp:975] Creating default 'basic' HTTP authenticator for
realm 'mesos-agent-readwrite'
I0720 00:28:20.130987 21542 http.cpp:996] Creating default 'jwt' HTTP authenticator for realm
'mesos-agent-readwrite'
I0720 00:28:20.132370 21542 slave.cpp:531] Agent resources: cpus(*):2; mem(*):1024; disk(*):1024;
ports(*):[31000-32000]
I0720 00:28:20.132457 21542 slave.cpp:539] Agent attributes: [  ]
I0720 00:28:20.132469 21542 slave.cpp:544] Agent hostname: 5290a327ba2f
I0720 00:28:20.132606 21538 status_update_manager.cpp:177] Pausing sending status updates
I0720 00:28:20.134376 21526 state.cpp:62] Recovering state from '/tmp/Endpoint_SlaveEndpointTest_UnauthorizedRequest_1_HPx83r/meta'
I0720 00:28:20.134724 21544 status_update_manager.cpp:203] Recovering status update manager
I0720 00:28:20.135042 21528 containerizer.cpp:608] Recovering containerizer
I0720 00:28:20.136554 21546 provisioner.cpp:410] Provisioner recovery complete
I0720 00:28:20.136970 21536 slave.cpp:6075] Finished recovery
I0720 00:28:20.137450 21536 slave.cpp:6257] Querying resource estimator for oversubscribable
resources
I0720 00:28:20.137771 21545 slave.cpp:6271] Received oversubscribable resources {} from the
resource estimator
I0720 00:28:20.139745 21537 process.cpp:3741] Handling HTTP event for process 'slave(745)'
with path: '/slave(745)/monitor/statistics.json'
I0720 00:28:20.141564 21544 http.cpp:1115] HTTP GET for /slave(745)/monitor/statistics.json
from 172.17.0.2:57936
I0720 00:28:20.141630 21544 http.cpp:936] Authorizing principal 'test-principal' to GET the
'/monitor/statistics.json' endpoint
I0720 00:28:20.143826 21547 slave.cpp:796] Agent terminating
[       OK ] Endpoint/SlaveEndpointTest.UnauthorizedRequest/1 (28 ms)
[ RUN      ] Endpoint/SlaveEndpointTest.UnauthorizedRequest/2
I0720 00:28:20.154284  2255 containerizer.cpp:221] Using isolation: posix/cpu,posix/mem,filesystem/posix,network/cni
W0720 00:28:20.154831  2255 backend.cpp:76] Failed to create 'aufs' backend: AufsBackend requires
root privileges
W0720 00:28:20.154939  2255 backend.cpp:76] Failed to create 'bind' backend: BindBackend requires
root privileges
I0720 00:28:20.154973  2255 provisioner.cpp:249] Using default backend 'copy'
I0720 00:28:20.158040 21539 slave.cpp:231] Mesos agent started on (746)@172.17.0.2:44756
I0720 00:28:20.158061 21539 slave.cpp:232] Flags at startup: --acls="" --appc_simple_discovery_uri_prefix="http://"
--appc_store_dir="/tmp/mesos/store/appc" --authenticate_http_executors="true" --authenticate_http_readonly="true"
--authenticate_http_readwrite="true" --authenticatee="crammd5" --authentication_backoff_factor="1secs"
--authorizer="local" --cgroups_cpu_enable_pids_and_tids_count="false" --cgroups_enable_cfs="false"
--cgroups_hierarchy="/sys/fs/cgroup" --cgroups_limit_swap="false" --cgroups_root="mesos" --container_disk_watch_interval="15secs"
--containerizers="mesos" --credential="/tmp/Endpoint_SlaveEndpointTest_UnauthorizedRequest_2_KCYFk7/credential"
--default_role="*" --disk_watch_interval="1mins" --docker="docker" --docker_kill_orphans="true"
--docker_registry="https://registry-1.docker.io" --docker_remove_delay="6hrs" --docker_socket="/var/run/docker.sock"
--docker_stop_timeout="0ns" --docker_store_dir="/tmp/mesos/store/docker" --docker_volume_checkpoint_dir="/var/run/mesos/isolators/docker/volume"
--enforce_container_disk_quota="false" --executor_registration_timeout="1mins" --executor_reregistration_timeout="2secs"
--executor_secret_key="/tmp/Endpoint_SlaveEndpointTest_UnauthorizedRequest_2_KCYFk7/executor_secret_key"
--executor_shutdown_grace_period="5secs" --fetcher_cache_dir="/tmp/Endpoint_SlaveEndpointTest_UnauthorizedRequest_2_KCYFk7/fetch"
--fetcher_cache_size="2GB" --frameworks_home="" --gc_delay="1weeks" --gc_disk_headroom="0.1"
--hadoop_home="" --help="false" --hostname_lookup="true" --http_command_executor="false" --http_credentials="/tmp/Endpoint_SlaveEndpointTest_UnauthorizedRequest_2_KCYFk7/http_credentials"
--http_heartbeat_interval="30secs" --initialize_driver_logging="true" --isolation="posix/cpu,posix/mem"
--launcher="posix" --launcher_dir="/mesos/mesos-1.3.1/_build/src" --logbufsecs="0" --logging_level="INFO"
--max_completed_executors_per_framework="150" --oversubscribed_resources_interval="15secs"
--perf_duration="10secs" --perf_interval="1mins" --port="5051" --qos_correction_interval_min="0ns"
--quiet="false" --recover="reconnect" --recovery_timeout="15mins" --registration_backoff_factor="10ms"
--resources="cpus:2;gpus:0;mem:1024;disk:1024;ports:[31000-32000]" --revocable_cpu_low_priority="true"
--runtime_dir="/tmp/Endpoint_SlaveEndpointTest_UnauthorizedRequest_2_KCYFk7" --sandbox_directory="/mnt/mesos/sandbox"
--strict="true" --switch_user="true" --systemd_enable_support="true" --systemd_runtime_directory="/run/systemd/system"
--version="false" --work_dir="/tmp/Endpoint_SlaveEndpointTest_UnauthorizedRequest_2_N2Vqsb"
I0720 00:28:20.158442 21539 credentials.hpp:86] Loading credential for authentication from
'/tmp/Endpoint_SlaveEndpointTest_UnauthorizedRequest_2_KCYFk7/credential'
I0720 00:28:20.158615 21539 slave.cpp:264] Agent using credential for: test-principal
I0720 00:28:20.158638 21539 credentials.hpp:37] Loading credentials for authentication from
'/tmp/Endpoint_SlaveEndpointTest_UnauthorizedRequest_2_KCYFk7/http_credentials'
I0720 00:28:20.158921 21539 http.cpp:975] Creating default 'basic' HTTP authenticator for
realm 'mesos-agent-executor'
I0720 00:28:20.159047 21539 http.cpp:996] Creating default 'jwt' HTTP authenticator for realm
'mesos-agent-executor'
I0720 00:28:20.159286 21539 http.cpp:975] Creating default 'basic' HTTP authenticator for
realm 'mesos-agent-readonly'
I0720 00:28:20.159452 21539 http.cpp:996] Creating default 'jwt' HTTP authenticator for realm
'mesos-agent-readonly'
I0720 00:28:20.159692 21539 http.cpp:975] Creating default 'basic' HTTP authenticator for
realm 'mesos-agent-readwrite'
I0720 00:28:20.159801 21539 http.cpp:996] Creating default 'jwt' HTTP authenticator for realm
'mesos-agent-readwrite'
I0720 00:28:20.161227 21539 slave.cpp:531] Agent resources: cpus(*):2; mem(*):1024; disk(*):1024;
ports(*):[31000-32000]
I0720 00:28:20.161315 21539 slave.cpp:539] Agent attributes: [  ]
I0720 00:28:20.161329 21539 slave.cpp:544] Agent hostname: 5290a327ba2f
I0720 00:28:20.161459 21549 status_update_manager.cpp:177] Pausing sending status updates
I0720 00:28:20.163101 21532 state.cpp:62] Recovering state from '/tmp/Endpoint_SlaveEndpointTest_UnauthorizedRequest_2_N2Vqsb/meta'
I0720 00:28:20.163447 21545 status_update_manager.cpp:203] Recovering status update manager
I0720 00:28:20.163743 21535 containerizer.cpp:608] Recovering containerizer
I0720 00:28:20.165560 21548 provisioner.cpp:410] Provisioner recovery complete
I0720 00:28:20.165925 21536 slave.cpp:6075] Finished recovery
I0720 00:28:20.166453 21536 slave.cpp:6257] Querying resource estimator for oversubscribable
resources
I0720 00:28:20.166733 21549 slave.cpp:6271] Received oversubscribable resources {} from the
resource estimator
I0720 00:28:20.169198 21533 process.cpp:3741] Handling HTTP event for process 'slave(746)'
with path: '/slave(746)/containers'
I0720 00:28:20.171279 21546 http.cpp:1115] HTTP GET for /slave(746)/containers from 172.17.0.2:57946
I0720 00:28:20.171356 21546 http.cpp:936] Authorizing principal 'test-principal' to GET the
'/containers' endpoint
I0720 00:28:20.173849 21537 slave.cpp:796] Agent terminating
[       OK ] Endpoint/SlaveEndpointTest.UnauthorizedRequest/2 (30 ms)
[ RUN      ] Endpoint/SlaveEndpointTest.NoAuthorizer/0
I0720 00:28:20.184679  2255 containerizer.cpp:221] Using isolation: posix/cpu,posix/mem,filesystem/posix,network/cni
W0720 00:28:20.185189  2255 backend.cpp:76] Failed to create 'aufs' backend: AufsBackend requires
root privileges
W0720 00:28:20.185294  2255 backend.cpp:76] Failed to create 'bind' backend: BindBackend requires
root privileges
I0720 00:28:20.185329  2255 provisioner.cpp:249] Using default backend 'copy'
I0720 00:28:20.187438  2255 cluster.cpp:448] Creating default 'local' authorizer
I0720 00:28:20.189689 21537 slave.cpp:231] Mesos agent started on (747)@172.17.0.2:44756
I0720 00:28:20.189709 21537 slave.cpp:232] Flags at startup: --acls="" --appc_simple_discovery_uri_prefix="http://"
--appc_store_dir="/tmp/mesos/store/appc" --authenticate_http_executors="true" --authenticate_http_readonly="true"
--authenticate_http_readwrite="true" --authenticatee="crammd5" --authentication_backoff_factor="1secs"
--authorizer="local" --cgroups_cpu_enable_pids_and_tids_count="false" --cgroups_enable_cfs="false"
--cgroups_hierarchy="/sys/fs/cgroup" --cgroups_limit_swap="false" --cgroups_root="mesos" --container_disk_watch_interval="15secs"
--containerizers="mesos" --credential="/tmp/Endpoint_SlaveEndpointTest_NoAuthorizer_0_E4lY4Q/credential"
--default_role="*" --disk_watch_interval="1mins" --docker="docker" --docker_kill_orphans="true"
--docker_registry="https://registry-1.docker.io" --docker_remove_delay="6hrs" --docker_socket="/var/run/docker.sock"
--docker_stop_timeout="0ns" --docker_store_dir="/tmp/mesos/store/docker" --docker_volume_checkpoint_dir="/var/run/mesos/isolators/docker/volume"
--enforce_container_disk_quota="false" --executor_registration_timeout="1mins" --executor_reregistration_timeout="2secs"
--executor_secret_key="/tmp/Endpoint_SlaveEndpointTest_NoAuthorizer_0_E4lY4Q/executor_secret_key"
--executor_shutdown_grace_period="5secs" --fetcher_cache_dir="/tmp/Endpoint_SlaveEndpointTest_NoAuthorizer_0_E4lY4Q/fetch"
--fetcher_cache_size="2GB" --frameworks_home="" --gc_delay="1weeks" --gc_disk_headroom="0.1"
--hadoop_home="" --help="false" --hostname_lookup="true" --http_command_executor="false" --http_credentials="/tmp/Endpoint_SlaveEndpointTest_NoAuthorizer_0_E4lY4Q/http_credentials"
--http_heartbeat_interval="30secs" --initialize_driver_logging="true" --isolation="posix/cpu,posix/mem"
--launcher="posix" --launcher_dir="/mesos/mesos-1.3.1/_build/src" --logbufsecs="0" --logging_level="INFO"
--max_completed_executors_per_framework="150" --oversubscribed_resources_interval="15secs"
--perf_duration="10secs" --perf_interval="1mins" --port="5051" --qos_correction_interval_min="0ns"
--quiet="false" --recover="reconnect" --recovery_timeout="15mins" --registration_backoff_factor="10ms"
--resources="cpus:2;gpus:0;mem:1024;disk:1024;ports:[31000-32000]" --revocable_cpu_low_priority="true"
--runtime_dir="/tmp/Endpoint_SlaveEndpointTest_NoAuthorizer_0_E4lY4Q" --sandbox_directory="/mnt/mesos/sandbox"
--strict="true" --switch_user="true" --systemd_enable_support="true" --systemd_runtime_directory="/run/systemd/system"
--version="false" --work_dir="/tmp/Endpoint_SlaveEndpointTest_NoAuthorizer_0_alke8U"
I0720 00:28:20.190155 21537 credentials.hpp:86] Loading credential for authentication from
'/tmp/Endpoint_SlaveEndpointTest_NoAuthorizer_0_E4lY4Q/credential'
I0720 00:28:20.190332 21537 slave.cpp:264] Agent using credential for: test-principal
I0720 00:28:20.190351 21537 credentials.hpp:37] Loading credentials for authentication from
'/tmp/Endpoint_SlaveEndpointTest_NoAuthorizer_0_E4lY4Q/http_credentials'
I0720 00:28:20.190615 21537 http.cpp:975] Creating default 'basic' HTTP authenticator for
realm 'mesos-agent-executor'
I0720 00:28:20.190743 21537 http.cpp:996] Creating default 'jwt' HTTP authenticator for realm
'mesos-agent-executor'
I0720 00:28:20.191010 21537 http.cpp:975] Creating default 'basic' HTTP authenticator for
realm 'mesos-agent-readonly'
I0720 00:28:20.191129 21537 http.cpp:996] Creating default 'jwt' HTTP authenticator for realm
'mesos-agent-readonly'
I0720 00:28:20.191359 21537 http.cpp:975] Creating default 'basic' HTTP authenticator for
realm 'mesos-agent-readwrite'
I0720 00:28:20.191467 21537 http.cpp:996] Creating default 'jwt' HTTP authenticator for realm
'mesos-agent-readwrite'
I0720 00:28:20.192937 21537 slave.cpp:531] Agent resources: cpus(*):2; mem(*):1024; disk(*):1024;
ports(*):[31000-32000]
I0720 00:28:20.193028 21537 slave.cpp:539] Agent attributes: [  ]
I0720 00:28:20.193042 21537 slave.cpp:544] Agent hostname: 5290a327ba2f
I0720 00:28:20.193193 21548 status_update_manager.cpp:177] Pausing sending status updates
I0720 00:28:20.194761 21531 state.cpp:62] Recovering state from '/tmp/Endpoint_SlaveEndpointTest_NoAuthorizer_0_alke8U/meta'
I0720 00:28:20.195173 21528 status_update_manager.cpp:203] Recovering status update manager
I0720 00:28:20.195492 21539 containerizer.cpp:608] Recovering containerizer
I0720 00:28:20.197029 21544 provisioner.cpp:410] Provisioner recovery complete
I0720 00:28:20.197408 21543 slave.cpp:6075] Finished recovery
I0720 00:28:20.197978 21543 slave.cpp:6257] Querying resource estimator for oversubscribable
resources
I0720 00:28:20.198385 21539 slave.cpp:6271] Received oversubscribable resources {} from the
resource estimator
I0720 00:28:20.201253 21537 process.cpp:3741] Handling HTTP event for process 'slave(747)'
with path: '/slave(747)/monitor/statistics'
I0720 00:28:20.203074 21533 http.cpp:1115] HTTP GET for /slave(747)/monitor/statistics from
172.17.0.2:57948
I0720 00:28:20.203153 21533 http.cpp:936] Authorizing principal 'test-principal' to GET the
'/monitor/statistics' endpoint
I0720 00:28:20.206781 21533 slave.cpp:796] Agent terminating
[       OK ] Endpoint/SlaveEndpointTest.NoAuthorizer/0 (33 ms)
[ RUN      ] Endpoint/SlaveEndpointTest.NoAuthorizer/1
I0720 00:28:20.217874  2255 containerizer.cpp:221] Using isolation: posix/cpu,posix/mem,filesystem/posix,network/cni
W0720 00:28:20.218426  2255 backend.cpp:76] Failed to create 'aufs' backend: AufsBackend requires
root privileges
W0720 00:28:20.218545  2255 backend.cpp:76] Failed to create 'bind' backend: BindBackend requires
root privileges
I0720 00:28:20.218590  2255 provisioner.cpp:249] Using default backend 'copy'
I0720 00:28:20.220484  2255 cluster.cpp:448] Creating default 'local' authorizer
I0720 00:28:20.222306 21529 slave.cpp:231] Mesos agent started on (748)@172.17.0.2:44756
I0720 00:28:20.222334 21529 slave.cpp:232] Flags at startup: --acls="" --appc_simple_discovery_uri_prefix="http://"
--appc_store_dir="/tmp/mesos/store/appc" --authenticate_http_executors="true" --authenticate_http_readonly="true"
--authenticate_http_readwrite="true" --authenticatee="crammd5" --authentication_backoff_factor="1secs"
--authorizer="local" --cgroups_cpu_enable_pids_and_tids_count="false" --cgroups_enable_cfs="false"
--cgroups_hierarchy="/sys/fs/cgroup" --cgroups_limit_swap="false" --cgroups_root="mesos" --container_disk_watch_interval="15secs"
--containerizers="mesos" --credential="/tmp/Endpoint_SlaveEndpointTest_NoAuthorizer_1_s7zL8A/credential"
--default_role="*" --disk_watch_interval="1mins" --docker="docker" --docker_kill_orphans="true"
--docker_registry="https://registry-1.docker.io" --docker_remove_delay="6hrs" --docker_socket="/var/run/docker.sock"
--docker_stop_timeout="0ns" --docker_store_dir="/tmp/mesos/store/docker" --docker_volume_checkpoint_dir="/var/run/mesos/isolators/docker/volume"
--enforce_container_disk_quota="false" --executor_registration_timeout="1mins" --executor_reregistration_timeout="2secs"
--executor_secret_key="/tmp/Endpoint_SlaveEndpointTest_NoAuthorizer_1_s7zL8A/executor_secret_key"
--executor_shutdown_grace_period="5secs" --fetcher_cache_dir="/tmp/Endpoint_SlaveEndpointTest_NoAuthorizer_1_s7zL8A/fetch"
--fetcher_cache_size="2GB" --frameworks_home="" --gc_delay="1weeks" --gc_disk_headroom="0.1"
--hadoop_home="" --help="false" --hostname_lookup="true" --http_command_executor="false" --http_credentials="/tmp/Endpoint_SlaveEndpointTest_NoAuthorizer_1_s7zL8A/http_credentials"
--http_heartbeat_interval="30secs" --initialize_driver_logging="true" --isolation="posix/cpu,posix/mem"
--launcher="posix" --launcher_dir="/mesos/mesos-1.3.1/_build/src" --logbufsecs="0" --logging_level="INFO"
--max_completed_executors_per_framework="150" --oversubscribed_resources_interval="15secs"
--perf_duration="10secs" --perf_interval="1mins" --port="5051" --qos_correction_interval_min="0ns"
--quiet="false" --recover="reconnect" --recovery_timeout="15mins" --registration_backoff_factor="10ms"
--resources="cpus:2;gpus:0;mem:1024;disk:1024;ports:[31000-32000]" --revocable_cpu_low_priority="true"
--runtime_dir="/tmp/Endpoint_SlaveEndpointTest_NoAuthorizer_1_s7zL8A" --sandbox_directory="/mnt/mesos/sandbox"
--strict="true" --switch_user="true" --systemd_enable_support="true" --systemd_runtime_directory="/run/systemd/system"
--version="false" --work_dir="/tmp/Endpoint_SlaveEndpointTest_NoAuthorizer_1_wuF46E"
I0720 00:28:20.222774 21529 credentials.hpp:86] Loading credential for authentication from
'/tmp/Endpoint_SlaveEndpointTest_NoAuthorizer_1_s7zL8A/credential'
I0720 00:28:20.222965 21529 slave.cpp:264] Agent using credential for: test-principal
I0720 00:28:20.222986 21529 credentials.hpp:37] Loading credentials for authentication from
'/tmp/Endpoint_SlaveEndpointTest_NoAuthorizer_1_s7zL8A/http_credentials'
I0720 00:28:20.223273 21529 http.cpp:975] Creating default 'basic' HTTP authenticator for
realm 'mesos-agent-executor'
I0720 00:28:20.223387 21529 http.cpp:996] Creating default 'jwt' HTTP authenticator for realm
'mesos-agent-executor'
I0720 00:28:20.223670 21529 http.cpp:975] Creating default 'basic' HTTP authenticator for
realm 'mesos-agent-readonly'
I0720 00:28:20.223817 21529 http.cpp:996] Creating default 'jwt' HTTP authenticator for realm
'mesos-agent-readonly'
I0720 00:28:20.224004 21529 http.cpp:975] Creating default 'basic' HTTP authenticator for
realm 'mesos-agent-readwrite'
I0720 00:28:20.224114 21529 http.cpp:996] Creating default 'jwt' HTTP authenticator for realm
'mesos-agent-readwrite'
I0720 00:28:20.225505 21529 slave.cpp:531] Agent resources: cpus(*):2; mem(*):1024; disk(*):1024;
ports(*):[31000-32000]
I0720 00:28:20.225591 21529 slave.cpp:539] Agent attributes: [  ]
I0720 00:28:20.225605 21529 slave.cpp:544] Agent hostname: 5290a327ba2f
I0720 00:28:20.225735 21535 status_update_manager.cpp:177] Pausing sending status updates
I0720 00:28:20.227155 21547 state.cpp:62] Recovering state from '/tmp/Endpoint_SlaveEndpointTest_NoAuthorizer_1_wuF46E/meta'
I0720 00:28:20.227416 21543 status_update_manager.cpp:203] Recovering status update manager
I0720 00:28:20.227615 21527 containerizer.cpp:608] Recovering containerizer
I0720 00:28:20.229321 21532 provisioner.cpp:410] Provisioner recovery complete
I0720 00:28:20.229694 21545 slave.cpp:6075] Finished recovery
I0720 00:28:20.230267 21545 slave.cpp:6257] Querying resource estimator for oversubscribable
resources
I0720 00:28:20.230690 21537 slave.cpp:6271] Received oversubscribable resources {} from the
resource estimator
I0720 00:28:20.233259 21533 process.cpp:3741] Handling HTTP event for process 'slave(748)'
with path: '/slave(748)/monitor/statistics.json'
I0720 00:28:20.235312 21547 http.cpp:1115] HTTP GET for /slave(748)/monitor/statistics.json
from 172.17.0.2:57950
I0720 00:28:20.235402 21547 http.cpp:936] Authorizing principal 'test-principal' to GET the
'/monitor/statistics.json' endpoint
I0720 00:28:20.239512 21527 slave.cpp:796] Agent terminating
[       OK ] Endpoint/SlaveEndpointTest.NoAuthorizer/1 (33 ms)
[ RUN      ] Endpoint/SlaveEndpointTest.NoAuthorizer/2
I0720 00:28:20.251175  2255 containerizer.cpp:221] Using isolation: posix/cpu,posix/mem,filesystem/posix,network/cni
W0720 00:28:20.251744  2255 backend.cpp:76] Failed to create 'aufs' backend: AufsBackend requires
root privileges
W0720 00:28:20.251850  2255 backend.cpp:76] Failed to create 'bind' backend: BindBackend requires
root privileges
I0720 00:28:20.251885  2255 provisioner.cpp:249] Using default backend 'copy'
I0720 00:28:20.253798  2255 cluster.cpp:448] Creating default 'local' authorizer
I0720 00:28:20.255815 21528 slave.cpp:231] Mesos agent started on (749)@172.17.0.2:44756
I0720 00:28:20.255836 21528 slave.cpp:232] Flags at startup: --acls="" --appc_simple_discovery_uri_prefix="http://"
--appc_store_dir="/tmp/mesos/store/appc" --authenticate_http_executors="true" --authenticate_http_readonly="true"
--authenticate_http_readwrite="true" --authenticatee="crammd5" --authentication_backoff_factor="1secs"
--authorizer="local" --cgroups_cpu_enable_pids_and_tids_count="false" --cgroups_enable_cfs="false"
--cgroups_hierarchy="/sys/fs/cgroup" --cgroups_limit_swap="false" --cgroups_root="mesos" --container_disk_watch_interval="15secs"
--containerizers="mesos" --credential="/tmp/Endpoint_SlaveEndpointTest_NoAuthorizer_2_OVxcwl/credential"
--default_role="*" --disk_watch_interval="1mins" --docker="docker" --docker_kill_orphans="true"
--docker_registry="https://registry-1.docker.io" --docker_remove_delay="6hrs" --docker_socket="/var/run/docker.sock"
--docker_stop_timeout="0ns" --docker_store_dir="/tmp/mesos/store/docker" --docker_volume_checkpoint_dir="/var/run/mesos/isolators/docker/volume"
--enforce_container_disk_quota="false" --executor_registration_timeout="1mins" --executor_reregistration_timeout="2secs"
--executor_secret_key="/tmp/Endpoint_SlaveEndpointTest_NoAuthorizer_2_OVxcwl/executor_secret_key"
--executor_shutdown_grace_period="5secs" --fetcher_cache_dir="/tmp/Endpoint_SlaveEndpointTest_NoAuthorizer_2_OVxcwl/fetch"
--fetcher_cache_size="2GB" --frameworks_home="" --gc_delay="1weeks" --gc_disk_headroom="0.1"
--hadoop_home="" --help="false" --hostname_lookup="true" --http_command_executor="false" --http_credentials="/tmp/Endpoint_SlaveEndpointTest_NoAuthorizer_2_OVxcwl/http_credentials"
--http_heartbeat_interval="30secs" --initialize_driver_logging="true" --isolation="posix/cpu,posix/mem"
--launcher="posix" --launcher_dir="/mesos/mesos-1.3.1/_build/src" --logbufsecs="0" --logging_level="INFO"
--max_completed_executors_per_framework="150" --oversubscribed_resources_interval="15secs"
--perf_duration="10secs" --perf_interval="1mins" --port="5051" --qos_correction_interval_min="0ns"
--quiet="false" --recover="reconnect" --recovery_timeout="15mins" --registration_backoff_factor="10ms"
--resources="cpus:2;gpus:0;mem:1024;disk:1024;ports:[31000-32000]" --revocable_cpu_low_priority="true"
--runtime_dir="/tmp/Endpoint_SlaveEndpointTest_NoAuthorizer_2_OVxcwl" --sandbox_directory="/mnt/mesos/sandbox"
--strict="true" --switch_user="true" --systemd_enable_support="true" --systemd_runtime_directory="/run/systemd/system"
--version="false" --work_dir="/tmp/Endpoint_SlaveEndpointTest_NoAuthorizer_2_HGzzpp"
I0720 00:28:20.256219 21528 credentials.hpp:86] Loading credential for authentication from
'/tmp/Endpoint_SlaveEndpointTest_NoAuthorizer_2_OVxcwl/credential'
I0720 00:28:20.256366 21528 slave.cpp:264] Agent using credential for: test-principal
I0720 00:28:20.256387 21528 credentials.hpp:37] Loading credentials for authentication from
'/tmp/Endpoint_SlaveEndpointTest_NoAuthorizer_2_OVxcwl/http_credentials'
I0720 00:28:20.256657 21528 http.cpp:975] Creating default 'basic' HTTP authenticator for
realm 'mesos-agent-executor'
I0720 00:28:20.256778 21528 http.cpp:996] Creating default 'jwt' HTTP authenticator for realm
'mesos-agent-executor'
I0720 00:28:20.256980 21528 http.cpp:975] Creating default 'basic' HTTP authenticator for
realm 'mesos-agent-readonly'
I0720 00:28:20.257130 21528 http.cpp:996] Creating default 'jwt' HTTP authenticator for realm
'mesos-agent-readonly'
I0720 00:28:20.257401 21528 http.cpp:975] Creating default 'basic' HTTP authenticator for
realm 'mesos-agent-readwrite'
I0720 00:28:20.257544 21528 http.cpp:996] Creating default 'jwt' HTTP authenticator for realm
'mesos-agent-readwrite'
I0720 00:28:20.259155 21528 slave.cpp:531] Agent resources: cpus(*):2; mem(*):1024; disk(*):1024;
ports(*):[31000-32000]
I0720 00:28:20.259243 21528 slave.cpp:539] Agent attributes: [  ]
I0720 00:28:20.259256 21528 slave.cpp:544] Agent hostname: 5290a327ba2f
I0720 00:28:20.259393 21533 status_update_manager.cpp:177] Pausing sending status updates
I0720 00:28:20.261014 21535 state.cpp:62] Recovering state from '/tmp/Endpoint_SlaveEndpointTest_NoAuthorizer_2_HGzzpp/meta'
I0720 00:28:20.261438 21530 status_update_manager.cpp:203] Recovering status update manager
I0720 00:28:20.261840 21533 containerizer.cpp:608] Recovering containerizer
I0720 00:28:20.263921 21539 provisioner.cpp:410] Provisioner recovery complete
I0720 00:28:20.264449 21541 slave.cpp:6075] Finished recovery
I0720 00:28:20.264961 21541 slave.cpp:6257] Querying resource estimator for oversubscribable
resources
I0720 00:28:20.265245 21533 slave.cpp:6271] Received oversubscribable resources {} from the
resource estimator
I0720 00:28:20.267786 21541 process.cpp:3741] Handling HTTP event for process 'slave(749)'
with path: '/slave(749)/containers'
I0720 00:28:20.269801 21541 http.cpp:1115] HTTP GET for /slave(749)/containers from 172.17.0.2:57956
I0720 00:28:20.269881 21541 http.cpp:936] Authorizing principal 'test-principal' to GET the
'/containers' endpoint
I0720 00:28:20.273843 21536 slave.cpp:796] Agent terminating
[       OK ] Endpoint/SlaveEndpointTest.NoAuthorizer/2 (33 ms)
[----------] 9 tests from Endpoint/SlaveEndpointTest (281 ms total)

[----------] Global test environment tear-down
[==========] 1575 tests from 177 test cases ran. (589105 ms total)
[  PASSED  ] 1571 tests.
[  FAILED  ] 4 tests, listed below:
[  FAILED  ] CommandExecutorCheckTest.CommandCheckDeliveredAndReconciled
[  FAILED  ] DefaultExecutorCheckTest.CommandCheckDeliveredAndReconciled
[  FAILED  ] DefaultExecutorCheckTest.CommandCheckStatusChange
[  FAILED  ] DefaultExecutorCheckTest.CommandCheckTimeout

 4 FAILED TESTS
  YOU HAVE 22 DISABLED TESTS

E0720 00:28:20.338258 21550 process.cpp:956] Failed to accept socket: future discarded
make[4]: *** [check-local] Error 1
make[4]: Leaving directory `/mesos/mesos-1.3.1/_build/src'
make[3]: *** [check-am] Error 2
make[3]: Leaving directory `/mesos/mesos-1.3.1/_build/src'
make[2]: *** [check] Error 2
make[2]: Leaving directory `/mesos/mesos-1.3.1/_build/src'
make[1]: *** [check-recursive] Error 1
make[1]: Leaving directory `/mesos/mesos-1.3.1/_build'
make: *** [distcheck] Error 1
+ docker rmi mesos-1500507727-2303
Untagged: mesos-1500507727-2303:latest
Deleted: sha256:8bff6b4e56b5efde71363b170b10648574263a12c2cca72f503981494822844d
Deleted: sha256:5a7a6550df4cfea1db02d3130426d28339eb6ac44a25cdbf0280bb51a222e48a
Deleted: sha256:069207909fdc45af9e95e20a34638bf41ce8b1ade918fc9f06de4b51597aaeb1
Deleted: sha256:a6b44a9b4d43b35c278d3f765ffe5a15768e7803699e1d9810cbee6e28a7746d
Deleted: sha256:1cdac8038b9b31833de8aea17e5b0561d6c4828c3270a0b2d3418fe726241728
Deleted: sha256:c3559b8d0bc92578ac9a297ed87b01c212f0fdc08148cd35e239ad39388356fb
Deleted: sha256:77650bddd00b23be84af851b2fd747f64ba68372aa918a8fec915eb72e9ab19d
Deleted: sha256:bfc4597b4c283e0014303436e0db66b3d3e28ec121a7a35daa3349e9f9f27557
Deleted: sha256:172d2644602f4ca9fa4615508c066f0a3611c4771467b141a7e994ae825a7581
Deleted: sha256:e9f388aedfe7b9e39ff8ff31e24b9a92b4d56b8d3ea34f7ecc975ef0979eeb53
Deleted: sha256:4c5e15680fa7ad4c2d66b5a49da6a77867a189bb7e615655229968ec9414bc99
Deleted: sha256:37d361386ccf7798757100dff6afca34e968c6590228746424cca49677f5c311
Deleted: sha256:376f735d1a3a9cb913aff711f19264ee9fd1ddc4440c690c2cd727ebafc0551c
Deleted: sha256:4ed75d8df5ce0329b3964d2e3bdb078f52eec7c4ca1dd4a80396b8b164fe28a2
Deleted: sha256:54c0a586f2beaff367e9de0bcf910cca057e67efc3b78909d085aa6b368ee255
Deleted: sha256:03735b2fa2c3695b3708b114f81ea0abd83aa1adb112b8e7c4568b82e2989030
Deleted: sha256:592c7ae54cfafa2d2d172c51cbc6f8f18bc0f4fbc7b76c8fb1da1ff4a36d980b
Deleted: sha256:8a07a31984333fc493b1c984606bd0883f148cf1515497aad15706574a038464
Deleted: sha256:d4b94cfa6905cd326916118ff06e0467bb91fe68c2a7856587093b73f22ffe98
Deleted: sha256:07e5cd2129a78bb2dfae5ab237e304ce8a832704776f08d857da37923b800f2d
Deleted: sha256:dac1b4efd023a8c27ce25ed2e064e46bd09eb1ac9e42efe7dab619777c584f3a
Deleted: sha256:8950c3c9319e4b59ecd714628121b6fda93995dec0fa944cbf600a61f1677515
Deleted: sha256:640dd0d2197eb85f39bc825b244bb6d1275e63bfae79e250f42dd60a95a1d558
Deleted: sha256:f1d3d7680857a85cc34e45358fa16a1af6761e97a125119ff206532771c87b9b
Deleted: sha256:6c7936c8b58ca5d37a935c7af37d956ee13510f869bd823f8579e0a925142e7e
Build step 'Execute shell' marked build as failure
Not sending mail to unregistered user yujie.jay@gmail.com

Mime
View raw message