mesos-builds mailing list archives

Site index · List index
Message view « Date » · « Thread »
Top « Date » · « Thread »
From Apache Jenkins Server <jenk...@builds.apache.org>
Subject Build failed in Jenkins: Mesos-Reviewbot #18500
Date Mon, 17 Jul 2017 12:10:59 GMT
See <https://builds.apache.org/job/Mesos-Reviewbot/18500/display/redirect>

------------------------------------------
[...truncated 30.00 MB...]
I0717 12:10:53.583709  4983 containerizer.cpp:230] Using isolation: posix/cpu,posix/mem,filesystem/posix,network/cni,environment_secret
W0717 12:10:53.584563  4983 backend.cpp:76] Failed to create 'overlay' backend: OverlayBackend
requires root privileges
W0717 12:10:53.584753  4983 backend.cpp:76] Failed to create 'bind' backend: BindBackend requires
root privileges
I0717 12:10:53.584800  4983 provisioner.cpp:255] Using default backend 'copy'
I0717 12:10:53.590015  5003 slave.cpp:250] Mesos agent started on (789)@172.17.0.2:32957
I0717 12:10:53.590056  5003 slave.cpp:251] Flags at startup: --acls="" --appc_simple_discovery_uri_prefix="http://"
--appc_store_dir="/tmp/Endpoint_SlaveEndpointTest_AuthorizedRequest_2_7XqxIQ/store/appc" --authenticate_http_readonly="true"
--authenticate_http_readwrite="true" --authenticatee="crammd5" --authentication_backoff_factor="1secs"
--authorizer="local" --cgroups_cpu_enable_pids_and_tids_count="false" --cgroups_enable_cfs="false"
--cgroups_hierarchy="/sys/fs/cgroup" --cgroups_limit_swap="false" --cgroups_root="mesos" --container_disk_watch_interval="15secs"
--containerizers="mesos" --credential="/tmp/Endpoint_SlaveEndpointTest_AuthorizedRequest_2_7XqxIQ/credential"
--default_role="*" --disk_watch_interval="1mins" --docker="docker" --docker_kill_orphans="true"
--docker_registry="https://registry-1.docker.io" --docker_remove_delay="6hrs" --docker_socket="/var/run/docker.sock"
--docker_stop_timeout="0ns" --docker_store_dir="/tmp/Endpoint_SlaveEndpointTest_AuthorizedRequest_2_7XqxIQ/store/docker"
--docker_volume_checkpoint_dir="/var/run/mesos/isolators/docker/volume" --enforce_container_disk_quota="false"
--executor_registration_timeout="1mins" --executor_reregistration_timeout="2secs" --executor_shutdown_grace_period="5secs"
--fetcher_cache_dir="/tmp/Endpoint_SlaveEndpointTest_AuthorizedRequest_2_7XqxIQ/fetch" --fetcher_cache_size="2GB"
--frameworks_home="" --gc_delay="1weeks" --gc_disk_headroom="0.1" --hadoop_home="" --help="false"
--hostname_lookup="true" --http_command_executor="false" --http_credentials="/tmp/Endpoint_SlaveEndpointTest_AuthorizedRequest_2_7XqxIQ/http_credentials"
--http_heartbeat_interval="30secs" --initialize_driver_logging="true" --isolation="posix/cpu,posix/mem"
--launcher="posix" --launcher_dir="/mesos/mesos-1.4.0/_build/src" --logbufsecs="0" --logging_level="INFO"
--max_completed_executors_per_framework="150" --oversubscribed_resources_interval="15secs"
--perf_duration="10secs" --perf_interval="1mins" --port="5051" --qos_correction_interval_min="0ns"
--quiet="false" --recover="reconnect" --recovery_timeout="15mins" --registration_backoff_factor="10ms"
--resources="cpus:2;gpus:0;mem:1024;disk:1024;ports:[31000-32000]" --revocable_cpu_low_priority="true"
--runtime_dir="/tmp/Endpoint_SlaveEndpointTest_AuthorizedRequest_2_7XqxIQ" --sandbox_directory="/mnt/mesos/sandbox"
--strict="true" --switch_user="true" --systemd_enable_support="true" --systemd_runtime_directory="/run/systemd/system"
--version="false" --work_dir="/tmp/Endpoint_SlaveEndpointTest_AuthorizedRequest_2_AkLYBC"
I0717 12:10:53.590941  5003 credentials.hpp:86] Loading credential for authentication from
'/tmp/Endpoint_SlaveEndpointTest_AuthorizedRequest_2_7XqxIQ/credential'
I0717 12:10:53.591377  5003 slave.cpp:283] Agent using credential for: test-principal
I0717 12:10:53.591408  5003 credentials.hpp:37] Loading credentials for authentication from
'/tmp/Endpoint_SlaveEndpointTest_AuthorizedRequest_2_7XqxIQ/http_credentials'
I0717 12:10:53.591920  5003 http.cpp:993] Creating default 'basic' HTTP authenticator for
realm 'mesos-agent-readonly'
I0717 12:10:53.592303  5003 http.cpp:993] Creating default 'basic' HTTP authenticator for
realm 'mesos-agent-readwrite'
I0717 12:10:53.594687  5003 slave.cpp:565] Agent resources: [{"name":"cpus","scalar":{"value":2.0},"type":"SCALAR"},{"name":"mem","scalar":{"value":1024.0},"type":"SCALAR"},{"name":"disk","scalar":{"value":1024.0},"type":"SCALAR"},{"name":"ports","ranges":{"range":[{"begin":31000,"end":32000}]},"type":"RANGES"}]
I0717 12:10:53.595122  5003 slave.cpp:573] Agent attributes: [  ]
I0717 12:10:53.595144  5003 slave.cpp:582] Agent hostname: 23118b6a738b
I0717 12:10:53.595561  5009 status_update_manager.cpp:177] Pausing sending status updates
I0717 12:10:53.597807  5002 state.cpp:64] Recovering state from '/tmp/Endpoint_SlaveEndpointTest_AuthorizedRequest_2_AkLYBC/meta'
I0717 12:10:53.598318  5002 status_update_manager.cpp:203] Recovering status update manager
I0717 12:10:53.598685  5007 containerizer.cpp:582] Recovering containerizer
I0717 12:10:53.601058  5008 provisioner.cpp:416] Provisioner recovery complete
I0717 12:10:53.601807  5009 slave.cpp:6229] Finished recovery
I0717 12:10:53.602591  5009 slave.cpp:6411] Querying resource estimator for oversubscribable
resources
I0717 12:10:53.603219  5009 slave.cpp:6425] Received oversubscribable resources {} from the
resource estimator
I0717 12:10:53.607764  5002 process.cpp:3820] Handling HTTP event for process 'slave(789)'
with path: '/slave(789)/containers'
I0717 12:10:53.609719  5007 http.cpp:1133] HTTP GET for /slave(789)/containers from 172.17.0.2:50698
I0717 12:10:53.610044  5007 http.cpp:957] Authorizing principal 'test-principal' to GET the
'/containers' endpoint
I0717 12:10:53.615548  5003 slave.cpp:843] Agent terminating
[       OK ] Endpoint/SlaveEndpointTest.AuthorizedRequest/2 (48 ms)
[ RUN      ] Endpoint/SlaveEndpointTest.UnauthorizedRequest/0
I0717 12:10:53.631435  4983 containerizer.cpp:230] Using isolation: posix/cpu,posix/mem,filesystem/posix,network/cni,environment_secret
W0717 12:10:53.632237  4983 backend.cpp:76] Failed to create 'overlay' backend: OverlayBackend
requires root privileges
W0717 12:10:53.632418  4983 backend.cpp:76] Failed to create 'bind' backend: BindBackend requires
root privileges
I0717 12:10:53.632463  4983 provisioner.cpp:255] Using default backend 'copy'
I0717 12:10:53.637770  5006 slave.cpp:250] Mesos agent started on (790)@172.17.0.2:32957
I0717 12:10:53.637811  5006 slave.cpp:251] Flags at startup: --acls="" --appc_simple_discovery_uri_prefix="http://"
--appc_store_dir="/tmp/Endpoint_SlaveEndpointTest_UnauthorizedRequest_0_RjFtzL/store/appc"
--authenticate_http_readonly="true" --authenticate_http_readwrite="true" --authenticatee="crammd5"
--authentication_backoff_factor="1secs" --authorizer="local" --cgroups_cpu_enable_pids_and_tids_count="false"
--cgroups_enable_cfs="false" --cgroups_hierarchy="/sys/fs/cgroup" --cgroups_limit_swap="false"
--cgroups_root="mesos" --container_disk_watch_interval="15secs" --containerizers="mesos" --credential="/tmp/Endpoint_SlaveEndpointTest_UnauthorizedRequest_0_RjFtzL/credential"
--default_role="*" --disk_watch_interval="1mins" --docker="docker" --docker_kill_orphans="true"
--docker_registry="https://registry-1.docker.io" --docker_remove_delay="6hrs" --docker_socket="/var/run/docker.sock"
--docker_stop_timeout="0ns" --docker_store_dir="/tmp/Endpoint_SlaveEndpointTest_UnauthorizedRequest_0_RjFtzL/store/docker"
--docker_volume_checkpoint_dir="/var/run/mesos/isolators/docker/volume" --enforce_container_disk_quota="false"
--executor_registration_timeout="1mins" --executor_reregistration_timeout="2secs" --executor_shutdown_grace_period="5secs"
--fetcher_cache_dir="/tmp/Endpoint_SlaveEndpointTest_UnauthorizedRequest_0_RjFtzL/fetch" --fetcher_cache_size="2GB"
--frameworks_home="" --gc_delay="1weeks" --gc_disk_headroom="0.1" --hadoop_home="" --help="false"
--hostname_lookup="true" --http_command_executor="false" --http_credentials="/tmp/Endpoint_SlaveEndpointTest_UnauthorizedRequest_0_RjFtzL/http_credentials"
--http_heartbeat_interval="30secs" --initialize_driver_logging="true" --isolation="posix/cpu,posix/mem"
--launcher="posix" --launcher_dir="/mesos/mesos-1.4.0/_build/src" --logbufsecs="0" --logging_level="INFO"
--max_completed_executors_per_framework="150" --oversubscribed_resources_interval="15secs"
--perf_duration="10secs" --perf_interval="1mins" --port="5051" --qos_correction_interval_min="0ns"
--quiet="false" --recover="reconnect" --recovery_timeout="15mins" --registration_backoff_factor="10ms"
--resources="cpus:2;gpus:0;mem:1024;disk:1024;ports:[31000-32000]" --revocable_cpu_low_priority="true"
--runtime_dir="/tmp/Endpoint_SlaveEndpointTest_UnauthorizedRequest_0_RjFtzL" --sandbox_directory="/mnt/mesos/sandbox"
--strict="true" --switch_user="true" --systemd_enable_support="true" --systemd_runtime_directory="/run/systemd/system"
--version="false" --work_dir="/tmp/Endpoint_SlaveEndpointTest_UnauthorizedRequest_0_8tS6kx"
I0717 12:10:53.638639  5006 credentials.hpp:86] Loading credential for authentication from
'/tmp/Endpoint_SlaveEndpointTest_UnauthorizedRequest_0_RjFtzL/credential'
I0717 12:10:53.638900  5006 slave.cpp:283] Agent using credential for: test-principal
I0717 12:10:53.638923  5006 credentials.hpp:37] Loading credentials for authentication from
'/tmp/Endpoint_SlaveEndpointTest_UnauthorizedRequest_0_RjFtzL/http_credentials'
I0717 12:10:53.639278  5006 http.cpp:993] Creating default 'basic' HTTP authenticator for
realm 'mesos-agent-readonly'
I0717 12:10:53.639504  5006 http.cpp:993] Creating default 'basic' HTTP authenticator for
realm 'mesos-agent-readwrite'
I0717 12:10:53.641618  5006 slave.cpp:565] Agent resources: [{"name":"cpus","scalar":{"value":2.0},"type":"SCALAR"},{"name":"mem","scalar":{"value":1024.0},"type":"SCALAR"},{"name":"disk","scalar":{"value":1024.0},"type":"SCALAR"},{"name":"ports","ranges":{"range":[{"begin":31000,"end":32000}]},"type":"RANGES"}]
I0717 12:10:53.642050  5006 slave.cpp:573] Agent attributes: [  ]
I0717 12:10:53.642071  5006 slave.cpp:582] Agent hostname: 23118b6a738b
I0717 12:10:53.642457  5008 status_update_manager.cpp:177] Pausing sending status updates
I0717 12:10:53.644273  5007 state.cpp:64] Recovering state from '/tmp/Endpoint_SlaveEndpointTest_UnauthorizedRequest_0_8tS6kx/meta'
I0717 12:10:53.645066  5003 status_update_manager.cpp:203] Recovering status update manager
I0717 12:10:53.645474  5002 containerizer.cpp:582] Recovering containerizer
I0717 12:10:53.647805  5005 provisioner.cpp:416] Provisioner recovery complete
I0717 12:10:53.648914  5005 slave.cpp:6229] Finished recovery
I0717 12:10:53.649756  5005 slave.cpp:6411] Querying resource estimator for oversubscribable
resources
I0717 12:10:53.650846  5005 slave.cpp:6425] Received oversubscribable resources {} from the
resource estimator
I0717 12:10:53.655338  5002 process.cpp:3820] Handling HTTP event for process 'slave(790)'
with path: '/slave(790)/monitor/statistics'
I0717 12:10:53.657362  5006 http.cpp:1133] HTTP GET for /slave(790)/monitor/statistics from
172.17.0.2:50700
I0717 12:10:53.657493  5006 http.cpp:957] Authorizing principal 'test-principal' to GET the
'/monitor/statistics' endpoint
I0717 12:10:53.661785  5007 slave.cpp:843] Agent terminating
[       OK ] Endpoint/SlaveEndpointTest.UnauthorizedRequest/0 (46 ms)
[ RUN      ] Endpoint/SlaveEndpointTest.UnauthorizedRequest/1
I0717 12:10:53.678154  4983 containerizer.cpp:230] Using isolation: posix/cpu,posix/mem,filesystem/posix,network/cni,environment_secret
W0717 12:10:53.678959  4983 backend.cpp:76] Failed to create 'overlay' backend: OverlayBackend
requires root privileges
W0717 12:10:53.679139  4983 backend.cpp:76] Failed to create 'bind' backend: BindBackend requires
root privileges
I0717 12:10:53.679183  4983 provisioner.cpp:255] Using default backend 'copy'
I0717 12:10:53.684334  5009 slave.cpp:250] Mesos agent started on (791)@172.17.0.2:32957
I0717 12:10:53.684413  5009 slave.cpp:251] Flags at startup: --acls="" --appc_simple_discovery_uri_prefix="http://"
--appc_store_dir="/tmp/Endpoint_SlaveEndpointTest_UnauthorizedRequest_1_fkwFUG/store/appc"
--authenticate_http_readonly="true" --authenticate_http_readwrite="true" --authenticatee="crammd5"
--authentication_backoff_factor="1secs" --authorizer="local" --cgroups_cpu_enable_pids_and_tids_count="false"
--cgroups_enable_cfs="false" --cgroups_hierarchy="/sys/fs/cgroup" --cgroups_limit_swap="false"
--cgroups_root="mesos" --container_disk_watch_interval="15secs" --containerizers="mesos" --credential="/tmp/Endpoint_SlaveEndpointTest_UnauthorizedRequest_1_fkwFUG/credential"
--default_role="*" --disk_watch_interval="1mins" --docker="docker" --docker_kill_orphans="true"
--docker_registry="https://registry-1.docker.io" --docker_remove_delay="6hrs" --docker_socket="/var/run/docker.sock"
--docker_stop_timeout="0ns" --docker_store_dir="/tmp/Endpoint_SlaveEndpointTest_UnauthorizedRequest_1_fkwFUG/store/docker"
--docker_volume_checkpoint_dir="/var/run/mesos/isolators/docker/volume" --enforce_container_disk_quota="false"
--executor_registration_timeout="1mins" --executor_reregistration_timeout="2secs" --executor_shutdown_grace_period="5secs"
--fetcher_cache_dir="/tmp/Endpoint_SlaveEndpointTest_UnauthorizedRequest_1_fkwFUG/fetch" --fetcher_cache_size="2GB"
--frameworks_home="" --gc_delay="1weeks" --gc_disk_headroom="0.1" --hadoop_home="" --help="false"
--hostname_lookup="true" --http_command_executor="false" --http_credentials="/tmp/Endpoint_SlaveEndpointTest_UnauthorizedRequest_1_fkwFUG/http_credentials"
--http_heartbeat_interval="30secs" --initialize_driver_logging="true" --isolation="posix/cpu,posix/mem"
--launcher="posix" --launcher_dir="/mesos/mesos-1.4.0/_build/src" --logbufsecs="0" --logging_level="INFO"
--max_completed_executors_per_framework="150" --oversubscribed_resources_interval="15secs"
--perf_duration="10secs" --perf_interval="1mins" --port="5051" --qos_correction_interval_min="0ns"
--quiet="false" --recover="reconnect" --recovery_timeout="15mins" --registration_backoff_factor="10ms"
--resources="cpus:2;gpus:0;mem:1024;disk:1024;ports:[31000-32000]" --revocable_cpu_low_priority="true"
--runtime_dir="/tmp/Endpoint_SlaveEndpointTest_UnauthorizedRequest_1_fkwFUG" --sandbox_directory="/mnt/mesos/sandbox"
--strict="true" --switch_user="true" --systemd_enable_support="true" --systemd_runtime_directory="/run/systemd/system"
--version="false" --work_dir="/tmp/Endpoint_SlaveEndpointTest_UnauthorizedRequest_1_ajvLys"
I0717 12:10:53.685178  5009 credentials.hpp:86] Loading credential for authentication from
'/tmp/Endpoint_SlaveEndpointTest_UnauthorizedRequest_1_fkwFUG/credential'
I0717 12:10:53.685446  5009 slave.cpp:283] Agent using credential for: test-principal
I0717 12:10:53.685497  5009 credentials.hpp:37] Loading credentials for authentication from
'/tmp/Endpoint_SlaveEndpointTest_UnauthorizedRequest_1_fkwFUG/http_credentials'
I0717 12:10:53.685865  5009 http.cpp:993] Creating default 'basic' HTTP authenticator for
realm 'mesos-agent-readonly'
I0717 12:10:53.686131  5009 http.cpp:993] Creating default 'basic' HTTP authenticator for
realm 'mesos-agent-readwrite'
I0717 12:10:53.688305  5009 slave.cpp:565] Agent resources: [{"name":"cpus","scalar":{"value":2.0},"type":"SCALAR"},{"name":"mem","scalar":{"value":1024.0},"type":"SCALAR"},{"name":"disk","scalar":{"value":1024.0},"type":"SCALAR"},{"name":"ports","ranges":{"range":[{"begin":31000,"end":32000}]},"type":"RANGES"}]
I0717 12:10:53.688801  5009 slave.cpp:573] Agent attributes: [  ]
I0717 12:10:53.688843  5009 slave.cpp:582] Agent hostname: 23118b6a738b
I0717 12:10:53.689142  5002 status_update_manager.cpp:177] Pausing sending status updates
I0717 12:10:53.690985  5008 state.cpp:64] Recovering state from '/tmp/Endpoint_SlaveEndpointTest_UnauthorizedRequest_1_ajvLys/meta'
I0717 12:10:53.691395  5004 status_update_manager.cpp:203] Recovering status update manager
I0717 12:10:53.691721  5005 containerizer.cpp:582] Recovering containerizer
I0717 12:10:53.694078  5002 provisioner.cpp:416] Provisioner recovery complete
I0717 12:10:53.694780  5003 slave.cpp:6229] Finished recovery
I0717 12:10:53.695710  5003 slave.cpp:6411] Querying resource estimator for oversubscribable
resources
I0717 12:10:53.696177  5007 slave.cpp:6425] Received oversubscribable resources {} from the
resource estimator
I0717 12:10:53.700217  5009 process.cpp:3820] Handling HTTP event for process 'slave(791)'
with path: '/slave(791)/monitor/statistics.json'
I0717 12:10:53.702495  5003 http.cpp:1133] HTTP GET for /slave(791)/monitor/statistics.json
from 172.17.0.2:50702
I0717 12:10:53.702623  5003 http.cpp:957] Authorizing principal 'test-principal' to GET the
'/monitor/statistics.json' endpoint
I0717 12:10:53.706815  4983 slave.cpp:843] Agent terminating
[       OK ] Endpoint/SlaveEndpointTest.UnauthorizedRequest/1 (44 ms)
[ RUN      ] Endpoint/SlaveEndpointTest.UnauthorizedRequest/2
I0717 12:10:53.722715  4983 containerizer.cpp:230] Using isolation: posix/cpu,posix/mem,filesystem/posix,network/cni,environment_secret
W0717 12:10:53.723508  4983 backend.cpp:76] Failed to create 'overlay' backend: OverlayBackend
requires root privileges
W0717 12:10:53.723690  4983 backend.cpp:76] Failed to create 'bind' backend: BindBackend requires
root privileges
I0717 12:10:53.723737  4983 provisioner.cpp:255] Using default backend 'copy'
I0717 12:10:53.730083  5005 slave.cpp:250] Mesos agent started on (792)@172.17.0.2:32957
I0717 12:10:53.730126  5005 slave.cpp:251] Flags at startup: --acls="" --appc_simple_discovery_uri_prefix="http://"
--appc_store_dir="/tmp/Endpoint_SlaveEndpointTest_UnauthorizedRequest_2_P6wYIC/store/appc"
--authenticate_http_readonly="true" --authenticate_http_readwrite="true" --authenticatee="crammd5"
--authentication_backoff_factor="1secs" --authorizer="local" --cgroups_cpu_enable_pids_and_tids_count="false"
--cgroups_enable_cfs="false" --cgroups_hierarchy="/sys/fs/cgroup" --cgroups_limit_swap="false"
--cgroups_root="mesos" --container_disk_watch_interval="15secs" --containerizers="mesos" --credential="/tmp/Endpoint_SlaveEndpointTest_UnauthorizedRequest_2_P6wYIC/credential"
--default_role="*" --disk_watch_interval="1mins" --docker="docker" --docker_kill_orphans="true"
--docker_registry="https://registry-1.docker.io" --docker_remove_delay="6hrs" --docker_socket="/var/run/docker.sock"
--docker_stop_timeout="0ns" --docker_store_dir="/tmp/Endpoint_SlaveEndpointTest_UnauthorizedRequest_2_P6wYIC/store/docker"
--docker_volume_checkpoint_dir="/var/run/mesos/isolators/docker/volume" --enforce_container_disk_quota="false"
--executor_registration_timeout="1mins" --executor_reregistration_timeout="2secs" --executor_shutdown_grace_period="5secs"
--fetcher_cache_dir="/tmp/Endpoint_SlaveEndpointTest_UnauthorizedRequest_2_P6wYIC/fetch" --fetcher_cache_size="2GB"
--frameworks_home="" --gc_delay="1weeks" --gc_disk_headroom="0.1" --hadoop_home="" --help="false"
--hostname_lookup="true" --http_command_executor="false" --http_credentials="/tmp/Endpoint_SlaveEndpointTest_UnauthorizedRequest_2_P6wYIC/http_credentials"
--http_heartbeat_interval="30secs" --initialize_driver_logging="true" --isolation="posix/cpu,posix/mem"
--launcher="posix" --launcher_dir="/mesos/mesos-1.4.0/_build/src" --logbufsecs="0" --logging_level="INFO"
--max_completed_executors_per_framework="150" --oversubscribed_resources_interval="15secs"
--perf_duration="10secs" --perf_interval="1mins" --port="5051" --qos_correction_interval_min="0ns"
--quiet="false" --recover="reconnect" --recovery_timeout="15mins" --registration_backoff_factor="10ms"
--resources="cpus:2;gpus:0;mem:1024;disk:1024;ports:[31000-32000]" --revocable_cpu_low_priority="true"
--runtime_dir="/tmp/Endpoint_SlaveEndpointTest_UnauthorizedRequest_2_P6wYIC" --sandbox_directory="/mnt/mesos/sandbox"
--strict="true" --switch_user="true" --systemd_enable_support="true" --systemd_runtime_directory="/run/systemd/system"
--version="false" --work_dir="/tmp/Endpoint_SlaveEndpointTest_UnauthorizedRequest_2_mxuQfo"
I0717 12:10:53.731202  5005 credentials.hpp:86] Loading credential for authentication from
'/tmp/Endpoint_SlaveEndpointTest_UnauthorizedRequest_2_P6wYIC/credential'
I0717 12:10:53.731658  5005 slave.cpp:283] Agent using credential for: test-principal
I0717 12:10:53.731694  5005 credentials.hpp:37] Loading credentials for authentication from
'/tmp/Endpoint_SlaveEndpointTest_UnauthorizedRequest_2_P6wYIC/http_credentials'
I0717 12:10:53.732231  5005 http.cpp:993] Creating default 'basic' HTTP authenticator for
realm 'mesos-agent-readonly'
I0717 12:10:53.732628  5005 http.cpp:993] Creating default 'basic' HTTP authenticator for
realm 'mesos-agent-readwrite'
I0717 12:10:53.735056  5005 slave.cpp:565] Agent resources: [{"name":"cpus","scalar":{"value":2.0},"type":"SCALAR"},{"name":"mem","scalar":{"value":1024.0},"type":"SCALAR"},{"name":"disk","scalar":{"value":1024.0},"type":"SCALAR"},{"name":"ports","ranges":{"range":[{"begin":31000,"end":32000}]},"type":"RANGES"}]
I0717 12:10:53.735494  5005 slave.cpp:573] Agent attributes: [  ]
I0717 12:10:53.735517  5005 slave.cpp:582] Agent hostname: 23118b6a738b
I0717 12:10:53.736040  5008 status_update_manager.cpp:177] Pausing sending status updates
I0717 12:10:53.738291  5007 state.cpp:64] Recovering state from '/tmp/Endpoint_SlaveEndpointTest_UnauthorizedRequest_2_mxuQfo/meta'
I0717 12:10:53.738914  5007 status_update_manager.cpp:203] Recovering status update manager
I0717 12:10:53.739259  5005 containerizer.cpp:582] Recovering containerizer
I0717 12:10:53.741639  5006 provisioner.cpp:416] Provisioner recovery complete
I0717 12:10:53.742547  5005 slave.cpp:6229] Finished recovery
I0717 12:10:53.743494  5005 slave.cpp:6411] Querying resource estimator for oversubscribable
resources
I0717 12:10:53.744041  5005 slave.cpp:6425] Received oversubscribable resources {} from the
resource estimator
I0717 12:10:53.749867  5004 process.cpp:3820] Handling HTTP event for process 'slave(792)'
with path: '/slave(792)/containers'
I0717 12:10:53.752310  5004 http.cpp:1133] HTTP GET for /slave(792)/containers from 172.17.0.2:50704
I0717 12:10:53.752681  5004 http.cpp:957] Authorizing principal 'test-principal' to GET the
'/containers' endpoint
I0717 12:10:53.756855  5008 slave.cpp:843] Agent terminating
[       OK ] Endpoint/SlaveEndpointTest.UnauthorizedRequest/2 (50 ms)
[ RUN      ] Endpoint/SlaveEndpointTest.NoAuthorizer/0
I0717 12:10:53.773830  4983 containerizer.cpp:230] Using isolation: posix/cpu,posix/mem,filesystem/posix,network/cni,environment_secret
W0717 12:10:53.774646  4983 backend.cpp:76] Failed to create 'overlay' backend: OverlayBackend
requires root privileges
W0717 12:10:53.774829  4983 backend.cpp:76] Failed to create 'bind' backend: BindBackend requires
root privileges
I0717 12:10:53.774878  4983 provisioner.cpp:255] Using default backend 'copy'
I0717 12:10:53.777382  4983 cluster.cpp:448] Creating default 'local' authorizer
I0717 12:10:53.780156  5006 slave.cpp:250] Mesos agent started on (793)@172.17.0.2:32957
I0717 12:10:53.780197  5006 slave.cpp:251] Flags at startup: --acls="" --appc_simple_discovery_uri_prefix="http://"
--appc_store_dir="/tmp/Endpoint_SlaveEndpointTest_NoAuthorizer_0_9iFy3y/store/appc" --authenticate_http_readonly="true"
--authenticate_http_readwrite="true" --authenticatee="crammd5" --authentication_backoff_factor="1secs"
--authorizer="local" --cgroups_cpu_enable_pids_and_tids_count="false" --cgroups_enable_cfs="false"
--cgroups_hierarchy="/sys/fs/cgroup" --cgroups_limit_swap="false" --cgroups_root="mesos" --container_disk_watch_interval="15secs"
--containerizers="mesos" --credential="/tmp/Endpoint_SlaveEndpointTest_NoAuthorizer_0_9iFy3y/credential"
--default_role="*" --disk_watch_interval="1mins" --docker="docker" --docker_kill_orphans="true"
--docker_registry="https://registry-1.docker.io" --docker_remove_delay="6hrs" --docker_socket="/var/run/docker.sock"
--docker_stop_timeout="0ns" --docker_store_dir="/tmp/Endpoint_SlaveEndpointTest_NoAuthorizer_0_9iFy3y/store/docker"
--docker_volume_checkpoint_dir="/var/run/mesos/isolators/docker/volume" --enforce_container_disk_quota="false"
--executor_registration_timeout="1mins" --executor_reregistration_timeout="2secs" --executor_shutdown_grace_period="5secs"
--fetcher_cache_dir="/tmp/Endpoint_SlaveEndpointTest_NoAuthorizer_0_9iFy3y/fetch" --fetcher_cache_size="2GB"
--frameworks_home="" --gc_delay="1weeks" --gc_disk_headroom="0.1" --hadoop_home="" --help="false"
--hostname_lookup="true" --http_command_executor="false" --http_credentials="/tmp/Endpoint_SlaveEndpointTest_NoAuthorizer_0_9iFy3y/http_credentials"
--http_heartbeat_interval="30secs" --initialize_driver_logging="true" --isolation="posix/cpu,posix/mem"
--launcher="posix" --launcher_dir="/mesos/mesos-1.4.0/_build/src" --logbufsecs="0" --logging_level="INFO"
--max_completed_executors_per_framework="150" --oversubscribed_resources_interval="15secs"
--perf_duration="10secs" --perf_interval="1mins" --port="5051" --qos_correction_interval_min="0ns"
--quiet="false" --recover="reconnect" --recovery_timeout="15mins" --registration_backoff_factor="10ms"
--resources="cpus:2;gpus:0;mem:1024;disk:1024;ports:[31000-32000]" --revocable_cpu_low_priority="true"
--runtime_dir="/tmp/Endpoint_SlaveEndpointTest_NoAuthorizer_0_9iFy3y" --sandbox_directory="/mnt/mesos/sandbox"
--strict="true" --switch_user="true" --systemd_enable_support="true" --systemd_runtime_directory="/run/systemd/system"
--version="false" --work_dir="/tmp/Endpoint_SlaveEndpointTest_NoAuthorizer_0_ejGfsk"
I0717 12:10:53.781028  5006 credentials.hpp:86] Loading credential for authentication from
'/tmp/Endpoint_SlaveEndpointTest_NoAuthorizer_0_9iFy3y/credential'
I0717 12:10:53.781288  5006 slave.cpp:283] Agent using credential for: test-principal
I0717 12:10:53.781312  5006 credentials.hpp:37] Loading credentials for authentication from
'/tmp/Endpoint_SlaveEndpointTest_NoAuthorizer_0_9iFy3y/http_credentials'
I0717 12:10:53.781658  5006 http.cpp:993] Creating default 'basic' HTTP authenticator for
realm 'mesos-agent-readonly'
I0717 12:10:53.781883  5006 http.cpp:993] Creating default 'basic' HTTP authenticator for
realm 'mesos-agent-readwrite'
I0717 12:10:53.784059  5006 slave.cpp:565] Agent resources: [{"name":"cpus","scalar":{"value":2.0},"type":"SCALAR"},{"name":"mem","scalar":{"value":1024.0},"type":"SCALAR"},{"name":"disk","scalar":{"value":1024.0},"type":"SCALAR"},{"name":"ports","ranges":{"range":[{"begin":31000,"end":32000}]},"type":"RANGES"}]
I0717 12:10:53.784494  5006 slave.cpp:573] Agent attributes: [  ]
I0717 12:10:53.784517  5006 slave.cpp:582] Agent hostname: 23118b6a738b
I0717 12:10:53.784760  5007 status_update_manager.cpp:177] Pausing sending status updates
I0717 12:10:53.786715  5008 state.cpp:64] Recovering state from '/tmp/Endpoint_SlaveEndpointTest_NoAuthorizer_0_ejGfsk/meta'
I0717 12:10:53.787163  5002 status_update_manager.cpp:203] Recovering status update manager
I0717 12:10:53.787803  5002 containerizer.cpp:582] Recovering containerizer
I0717 12:10:53.790226  5006 provisioner.cpp:416] Provisioner recovery complete
I0717 12:10:53.790799  5007 slave.cpp:6229] Finished recovery
I0717 12:10:53.791503  5007 slave.cpp:6411] Querying resource estimator for oversubscribable
resources
I0717 12:10:53.792042  5003 slave.cpp:6425] Received oversubscribable resources {} from the
resource estimator
I0717 12:10:53.796881  5008 process.cpp:3820] Handling HTTP event for process 'slave(793)'
with path: '/slave(793)/monitor/statistics'
I0717 12:10:53.799075  5007 http.cpp:1133] HTTP GET for /slave(793)/monitor/statistics from
172.17.0.2:50706
I0717 12:10:53.799258  5007 http.cpp:957] Authorizing principal 'test-principal' to GET the
'/monitor/statistics' endpoint
I0717 12:10:53.804925  5004 slave.cpp:843] Agent terminating
[       OK ] Endpoint/SlaveEndpointTest.NoAuthorizer/0 (48 ms)
[ RUN      ] Endpoint/SlaveEndpointTest.NoAuthorizer/1
I0717 12:10:53.821912  4983 containerizer.cpp:230] Using isolation: posix/cpu,posix/mem,filesystem/posix,network/cni,environment_secret
W0717 12:10:53.822698  4983 backend.cpp:76] Failed to create 'overlay' backend: OverlayBackend
requires root privileges
W0717 12:10:53.822880  4983 backend.cpp:76] Failed to create 'bind' backend: BindBackend requires
root privileges
I0717 12:10:53.822927  4983 provisioner.cpp:255] Using default backend 'copy'
I0717 12:10:53.825482  4983 cluster.cpp:448] Creating default 'local' authorizer
I0717 12:10:53.828328  5009 slave.cpp:250] Mesos agent started on (794)@172.17.0.2:32957
I0717 12:10:53.828372  5009 slave.cpp:251] Flags at startup: --acls="" --appc_simple_discovery_uri_prefix="http://"
--appc_store_dir="/tmp/Endpoint_SlaveEndpointTest_NoAuthorizer_1_xfyqTv/store/appc" --authenticate_http_readonly="true"
--authenticate_http_readwrite="true" --authenticatee="crammd5" --authentication_backoff_factor="1secs"
--authorizer="local" --cgroups_cpu_enable_pids_and_tids_count="false" --cgroups_enable_cfs="false"
--cgroups_hierarchy="/sys/fs/cgroup" --cgroups_limit_swap="false" --cgroups_root="mesos" --container_disk_watch_interval="15secs"
--containerizers="mesos" --credential="/tmp/Endpoint_SlaveEndpointTest_NoAuthorizer_1_xfyqTv/credential"
--default_role="*" --disk_watch_interval="1mins" --docker="docker" --docker_kill_orphans="true"
--docker_registry="https://registry-1.docker.io" --docker_remove_delay="6hrs" --docker_socket="/var/run/docker.sock"
--docker_stop_timeout="0ns" --docker_store_dir="/tmp/Endpoint_SlaveEndpointTest_NoAuthorizer_1_xfyqTv/store/docker"
--docker_volume_checkpoint_dir="/var/run/mesos/isolators/docker/volume" --enforce_container_disk_quota="false"
--executor_registration_timeout="1mins" --executor_reregistration_timeout="2secs" --executor_shutdown_grace_period="5secs"
--fetcher_cache_dir="/tmp/Endpoint_SlaveEndpointTest_NoAuthorizer_1_xfyqTv/fetch" --fetcher_cache_size="2GB"
--frameworks_home="" --gc_delay="1weeks" --gc_disk_headroom="0.1" --hadoop_home="" --help="false"
--hostname_lookup="true" --http_command_executor="false" --http_credentials="/tmp/Endpoint_SlaveEndpointTest_NoAuthorizer_1_xfyqTv/http_credentials"
--http_heartbeat_interval="30secs" --initialize_driver_logging="true" --isolation="posix/cpu,posix/mem"
--launcher="posix" --launcher_dir="/mesos/mesos-1.4.0/_build/src" --logbufsecs="0" --logging_level="INFO"
--max_completed_executors_per_framework="150" --oversubscribed_resources_interval="15secs"
--perf_duration="10secs" --perf_interval="1mins" --port="5051" --qos_correction_interval_min="0ns"
--quiet="false" --recover="reconnect" --recovery_timeout="15mins" --registration_backoff_factor="10ms"
--resources="cpus:2;gpus:0;mem:1024;disk:1024;ports:[31000-32000]" --revocable_cpu_low_priority="true"
--runtime_dir="/tmp/Endpoint_SlaveEndpointTest_NoAuthorizer_1_xfyqTv" --sandbox_directory="/mnt/mesos/sandbox"
--strict="true" --switch_user="true" --systemd_enable_support="true" --systemd_runtime_directory="/run/systemd/system"
--version="false" --work_dir="/tmp/Endpoint_SlaveEndpointTest_NoAuthorizer_1_WLaiah"
I0717 12:10:53.829171  5009 credentials.hpp:86] Loading credential for authentication from
'/tmp/Endpoint_SlaveEndpointTest_NoAuthorizer_1_xfyqTv/credential'
I0717 12:10:53.829444  5009 slave.cpp:283] Agent using credential for: test-principal
I0717 12:10:53.829500  5009 credentials.hpp:37] Loading credentials for authentication from
'/tmp/Endpoint_SlaveEndpointTest_NoAuthorizer_1_xfyqTv/http_credentials'
I0717 12:10:53.829875  5009 http.cpp:993] Creating default 'basic' HTTP authenticator for
realm 'mesos-agent-readonly'
I0717 12:10:53.830212  5009 http.cpp:993] Creating default 'basic' HTTP authenticator for
realm 'mesos-agent-readwrite'
I0717 12:10:53.832650  5009 slave.cpp:565] Agent resources: [{"name":"cpus","scalar":{"value":2.0},"type":"SCALAR"},{"name":"mem","scalar":{"value":1024.0},"type":"SCALAR"},{"name":"disk","scalar":{"value":1024.0},"type":"SCALAR"},{"name":"ports","ranges":{"range":[{"begin":31000,"end":32000}]},"type":"RANGES"}]
I0717 12:10:53.833168  5009 slave.cpp:573] Agent attributes: [  ]
I0717 12:10:53.833214  5009 slave.cpp:582] Agent hostname: 23118b6a738b
I0717 12:10:53.833612  5008 status_update_manager.cpp:177] Pausing sending status updates
I0717 12:10:53.835387  5008 state.cpp:64] Recovering state from '/tmp/Endpoint_SlaveEndpointTest_NoAuthorizer_1_WLaiah/meta'
I0717 12:10:53.836107  5008 status_update_manager.cpp:203] Recovering status update manager
I0717 12:10:53.836402  5007 containerizer.cpp:582] Recovering containerizer
I0717 12:10:53.838873  5004 provisioner.cpp:416] Provisioner recovery complete
I0717 12:10:53.839690  5002 slave.cpp:6229] Finished recovery
I0717 12:10:53.840482  5002 slave.cpp:6411] Querying resource estimator for oversubscribable
resources
I0717 12:10:53.840961  5008 slave.cpp:6425] Received oversubscribable resources {} from the
resource estimator
I0717 12:10:53.845662  5007 process.cpp:3820] Handling HTTP event for process 'slave(794)'
with path: '/slave(794)/monitor/statistics.json'
I0717 12:10:53.847638  5006 http.cpp:1133] HTTP GET for /slave(794)/monitor/statistics.json
from 172.17.0.2:50708
I0717 12:10:53.847769  5006 http.cpp:957] Authorizing principal 'test-principal' to GET the
'/monitor/statistics.json' endpoint
I0717 12:10:53.852818  5005 slave.cpp:843] Agent terminating
[       OK ] Endpoint/SlaveEndpointTest.NoAuthorizer/1 (47 ms)
[ RUN      ] Endpoint/SlaveEndpointTest.NoAuthorizer/2
I0717 12:10:53.869302  4983 containerizer.cpp:230] Using isolation: posix/cpu,posix/mem,filesystem/posix,network/cni,environment_secret
W0717 12:10:53.870139  4983 backend.cpp:76] Failed to create 'overlay' backend: OverlayBackend
requires root privileges
W0717 12:10:53.870326  4983 backend.cpp:76] Failed to create 'bind' backend: BindBackend requires
root privileges
I0717 12:10:53.870373  4983 provisioner.cpp:255] Using default backend 'copy'
I0717 12:10:53.872874  4983 cluster.cpp:448] Creating default 'local' authorizer
I0717 12:10:53.875690  5007 slave.cpp:250] Mesos agent started on (795)@172.17.0.2:32957
I0717 12:10:53.875785  5007 slave.cpp:251] Flags at startup: --acls="" --appc_simple_discovery_uri_prefix="http://"
--appc_store_dir="/tmp/Endpoint_SlaveEndpointTest_NoAuthorizer_2_Pacget/store/appc" --authenticate_http_readonly="true"
--authenticate_http_readwrite="true" --authenticatee="crammd5" --authentication_backoff_factor="1secs"
--authorizer="local" --cgroups_cpu_enable_pids_and_tids_count="false" --cgroups_enable_cfs="false"
--cgroups_hierarchy="/sys/fs/cgroup" --cgroups_limit_swap="false" --cgroups_root="mesos" --container_disk_watch_interval="15secs"
--containerizers="mesos" --credential="/tmp/Endpoint_SlaveEndpointTest_NoAuthorizer_2_Pacget/credential"
--default_role="*" --disk_watch_interval="1mins" --docker="docker" --docker_kill_orphans="true"
--docker_registry="https://registry-1.docker.io" --docker_remove_delay="6hrs" --docker_socket="/var/run/docker.sock"
--docker_stop_timeout="0ns" --docker_store_dir="/tmp/Endpoint_SlaveEndpointTest_NoAuthorizer_2_Pacget/store/docker"
--docker_volume_checkpoint_dir="/var/run/mesos/isolators/docker/volume" --enforce_container_disk_quota="false"
--executor_registration_timeout="1mins" --executor_reregistration_timeout="2secs" --executor_shutdown_grace_period="5secs"
--fetcher_cache_dir="/tmp/Endpoint_SlaveEndpointTest_NoAuthorizer_2_Pacget/fetch" --fetcher_cache_size="2GB"
--frameworks_home="" --gc_delay="1weeks" --gc_disk_headroom="0.1" --hadoop_home="" --help="false"
--hostname_lookup="true" --http_command_executor="false" --http_credentials="/tmp/Endpoint_SlaveEndpointTest_NoAuthorizer_2_Pacget/http_credentials"
--http_heartbeat_interval="30secs" --initialize_driver_logging="true" --isolation="posix/cpu,posix/mem"
--launcher="posix" --launcher_dir="/mesos/mesos-1.4.0/_build/src" --logbufsecs="0" --logging_level="INFO"
--max_completed_executors_per_framework="150" --oversubscribed_resources_interval="15secs"
--perf_duration="10secs" --perf_interval="1mins" --port="5051" --qos_correction_interval_min="0ns"
--quiet="false" --recover="reconnect" --recovery_timeout="15mins" --registration_backoff_factor="10ms"
--resources="cpus:2;gpus:0;mem:1024;disk:1024;ports:[31000-32000]" --revocable_cpu_low_priority="true"
--runtime_dir="/tmp/Endpoint_SlaveEndpointTest_NoAuthorizer_2_Pacget" --sandbox_directory="/mnt/mesos/sandbox"
--strict="true" --switch_user="true" --systemd_enable_support="true" --systemd_runtime_directory="/run/systemd/system"
--version="false" --work_dir="/tmp/Endpoint_SlaveEndpointTest_NoAuthorizer_2_8ZPrne"
I0717 12:10:53.876557  5007 credentials.hpp:86] Loading credential for authentication from
'/tmp/Endpoint_SlaveEndpointTest_NoAuthorizer_2_Pacget/credential'
I0717 12:10:53.876864  5007 slave.cpp:283] Agent using credential for: test-principal
I0717 12:10:53.876938  5007 credentials.hpp:37] Loading credentials for authentication from
'/tmp/Endpoint_SlaveEndpointTest_NoAuthorizer_2_Pacget/http_credentials'
I0717 12:10:53.877321  5007 http.cpp:993] Creating default 'basic' HTTP authenticator for
realm 'mesos-agent-readonly'
I0717 12:10:53.877594  5007 http.cpp:993] Creating default 'basic' HTTP authenticator for
realm 'mesos-agent-readwrite'
I0717 12:10:53.879829  5007 slave.cpp:565] Agent resources: [{"name":"cpus","scalar":{"value":2.0},"type":"SCALAR"},{"name":"mem","scalar":{"value":1024.0},"type":"SCALAR"},{"name":"disk","scalar":{"value":1024.0},"type":"SCALAR"},{"name":"ports","ranges":{"range":[{"begin":31000,"end":32000}]},"type":"RANGES"}]
I0717 12:10:53.880344  5007 slave.cpp:573] Agent attributes: [  ]
I0717 12:10:53.880389  5007 slave.cpp:582] Agent hostname: 23118b6a738b
I0717 12:10:53.880667  5002 status_update_manager.cpp:177] Pausing sending status updates
I0717 12:10:53.882781  5004 state.cpp:64] Recovering state from '/tmp/Endpoint_SlaveEndpointTest_NoAuthorizer_2_8ZPrne/meta'
I0717 12:10:53.883268  5003 status_update_manager.cpp:203] Recovering status update manager
I0717 12:10:53.883761  5005 containerizer.cpp:582] Recovering containerizer
I0717 12:10:53.886381  5009 provisioner.cpp:416] Provisioner recovery complete
I0717 12:10:53.887105  5008 slave.cpp:6229] Finished recovery
I0717 12:10:53.887974  5008 slave.cpp:6411] Querying resource estimator for oversubscribable
resources
I0717 12:10:53.888691  5008 slave.cpp:6425] Received oversubscribable resources {} from the
resource estimator
I0717 12:10:53.893666  5002 process.cpp:3820] Handling HTTP event for process 'slave(795)'
with path: '/slave(795)/containers'
I0717 12:10:53.895668  5003 http.cpp:1133] HTTP GET for /slave(795)/containers from 172.17.0.2:50710
I0717 12:10:53.895799  5003 http.cpp:957] Authorizing principal 'test-principal' to GET the
'/containers' endpoint
I0717 12:10:53.902453  5009 slave.cpp:843] Agent terminating
[       OK ] Endpoint/SlaveEndpointTest.NoAuthorizer/2 (48 ms)
[----------] 9 tests from Endpoint/SlaveEndpointTest (433 ms total)

[----------] Global test environment tear-down
[==========] 1636 tests from 179 test cases ran. (735868 ms total)
[  PASSED  ] 1632 tests.
[  FAILED  ] 4 tests, listed below:
[  FAILED  ] DefaultExecutorCheckTest.CommandCheckDeliveredAndReconciled
[  FAILED  ] DefaultExecutorCheckTest.CommandCheckStatusChange
[  FAILED  ] DefaultExecutorCheckTest.CommandCheckSeesParentsEnv
[  FAILED  ] DefaultExecutorCheckTest.CommandCheckSharesWorkDirWithTask

 4 FAILED TESTS
  YOU HAVE 20 DISABLED TESTS

I0717 12:10:54.046691  5010 process.cpp:993] Failed to accept socket: future discarded
make[4]: *** [check-local] Error 1
make[4]: Leaving directory `/mesos/mesos-1.4.0/_build/src'
make[3]: *** [check-am] Error 2
make[3]: Leaving directory `/mesos/mesos-1.4.0/_build/src'
make[2]: *** [check] Error 2
make[2]: Leaving directory `/mesos/mesos-1.4.0/_build/src'
make[1]: *** [check-recursive] Error 1
make[1]: Leaving directory `/mesos/mesos-1.4.0/_build'
make: *** [distcheck] Error 1
+ docker rmi mesos-1500287070-11627
Untagged: mesos-1500287070-11627:latest
Deleted: sha256:f65963a3789753e7e69320f460aa5dba3f7b6a3ac207c34b5b6aff9226038392
Deleted: sha256:f037984d66719aa48f23f4a23dcbcb2c30c51670378a0857ac36af5bc9894552
Deleted: sha256:401d9de679f31061e5b377fa2b614720bc54ff89c853c5c28c378257e7fd284a
Deleted: sha256:a731d812a722aa92c30fb1987c523f09ea84230635a3af2069ec3075b10782b0
Deleted: sha256:21573db0898a06883a9d48db7f163e5bfdce4bf9cbb5434f489ecb584407868a
Deleted: sha256:1791c5f89ab1e3f3a3c94c012063f4fdb563cbe64acd78e637ee555104766923
Deleted: sha256:756f13c0ead7fd0be77321e1815644cf27870c9cb069b9cb3374b0c58dee643d
Deleted: sha256:85b35caac4ab1b83a25fae8f53a37110062374f799c65c0996d83e2bf6929ab0
Deleted: sha256:426dda8b4fd52f731d1df161063170262133caaee3e0513894663893640e9ca1
Deleted: sha256:c3424186cf2225e9b3f28a05d99caa173115676b81c0fecae456a13c0c2dfaaa
Deleted: sha256:8e6de4a6c9519fc9524c11354ed4c5b93668b75e549d3ac82e460d65c944b0fc
Deleted: sha256:f259790103eba85d82adb3493c0e81eb147ee633287bca824b8838ef9d937a09
Deleted: sha256:ee9d4bb27d94a661ae8f21e716a1bc45a527337312ae3f31f4d615081e9e1802
Deleted: sha256:89856ea481d1b9470999c7d4508a78acf20b88266724dd2c548016e2add84952
Deleted: sha256:742370c3321ffc5cf3c387de6b4354d27e7c7a5ce0091b4c9908727999e1b643
Deleted: sha256:6a624d42b6007f1ed6d91fcf9c0f3bc431ab49c79af1557ad0eb9b95587caaba
Deleted: sha256:c1a0d63a707a88b8c4dfbd9a706b30b40517b2d3d4dbba064c322eaa2685f176
Deleted: sha256:4aa006dda1222e2832826f2c93ffcdb773eec0aebe989c3b4d569911f2c2b540
Deleted: sha256:da99eb4c949aeac0d1f8c4e11964e9a43aac178645f14863d9134c69f5a09661
Deleted: sha256:ad5717a95a36d791d767dbe6310cb5ef302df93e75d476769b61f38730b82e59
Deleted: sha256:ba63218b513877cf677ae809b4638dfa6bc5f4ab1fa29d6f76a562ab4e541492
Deleted: sha256:af72d4b0bd8a94b150c432098573d9ddf071118243107f27a211e56b0845e0e3
Deleted: sha256:b53abca236be0b9b09da4e34f05dd4a0e091d0ec7b8a994fcf631d40597b8082
Deleted: sha256:04fffa7dd1d61cf984b467437640fbcdd55bb3209b1d25a87d5a263bd479c29f
Build step 'Execute shell' marked build as failure

Mime
View raw message