mesos-builds mailing list archives

Site index · List index
Message view « Date » · « Thread »
Top « Date » · « Thread »
From Apache Jenkins Server <jenk...@builds.apache.org>
Subject Build failed in Jenkins: Mesos-Buildbot » cmake,clang,--verbose --enable-libevent --enable-ssl,GLOG_v=1 MESOS_VERBOSE=1,ubuntu:14.04,(ubuntu)&&(!ubuntu-us1)&&(!ubuntu-eu2) #3924
Date Tue, 18 Jul 2017 06:31:40 GMT
See <https://builds.apache.org/job/Mesos-Buildbot/BUILDTOOL=cmake,COMPILER=clang,CONFIGURATION=--verbose%20--enable-libevent%20--enable-ssl,ENVIRONMENT=GLOG_v=1%20MESOS_VERBOSE=1,OS=ubuntu%3A14.04,label_exp=(ubuntu)&&(!ubuntu-us1)&&(!ubuntu-eu2)/3924/display/redirect?page=changes>

Changes:

[bmahler] Added a method in the agent exposing an executor's allocated resources.

[bmahler] Removed Executor::resources usage in the agent.

[bmahler] Exposed allocated resources per each role in /state endpoint on agent.

[bmahler] Tested the per-role allocated resources in the agent endpoint.

[bmahler] Removed a misleading comment in the reservation endpoint tests.

[bmahler] Updated agent webui page to display a reservation table.

------------------------------------------
[...truncated 1.90 MB...]
NOTE: Set LIBPROCESS_SSL_REQUIRE_CERT=1 to require peer certificate verification
I0718 06:31:29.269016 30782 libevent_ssl_socket.cpp:1171] Socket error: error:140760FC:SSL
routines:SSL23_GET_CLIENT_HELLO:unknown protocol
I0718 06:31:29.330370 30757 ssl_tests.cpp:638] Testing server protocol 'LIBPROCESS_SSL_ENABLE_TLS_V1_0'
I0718 06:31:29.331050 30757 openssl.cpp:419] CA file path is unspecified! NOTE: Set CA file
path with LIBPROCESS_SSL_CA_FILE=<filepath>
I0718 06:31:29.331061 30757 openssl.cpp:424] CA directory path unspecified! NOTE: Set CA directory
path with LIBPROCESS_SSL_CA_DIR=<dirpath>
I0718 06:31:29.331065 30757 openssl.cpp:429] Will not verify peer certificate!
NOTE: Set LIBPROCESS_SSL_VERIFY_CERT=1 to enable peer certificate verification
I0718 06:31:29.331068 30757 openssl.cpp:435] Will only verify peer certificate if presented!
NOTE: Set LIBPROCESS_SSL_REQUIRE_CERT=1 to require peer certificate verification
I0718 06:31:29.363821 30782 libevent_ssl_socket.cpp:1171] Socket error: error:140760FC:SSL
routines:SSL23_GET_CLIENT_HELLO:unknown protocol
I0718 06:31:29.431282 30757 ssl_tests.cpp:638] Testing server protocol 'LIBPROCESS_SSL_ENABLE_TLS_V1_1'
I0718 06:31:29.432015 30757 openssl.cpp:419] CA file path is unspecified! NOTE: Set CA file
path with LIBPROCESS_SSL_CA_FILE=<filepath>
I0718 06:31:29.432027 30757 openssl.cpp:424] CA directory path unspecified! NOTE: Set CA directory
path with LIBPROCESS_SSL_CA_DIR=<dirpath>
I0718 06:31:29.432031 30757 openssl.cpp:429] Will not verify peer certificate!
NOTE: Set LIBPROCESS_SSL_VERIFY_CERT=1 to enable peer certificate verification
I0718 06:31:29.432036 30757 openssl.cpp:435] Will only verify peer certificate if presented!
NOTE: Set LIBPROCESS_SSL_REQUIRE_CERT=1 to require peer certificate verification
I0718 06:31:29.460422 30782 libevent_ssl_socket.cpp:1171] Socket error: error:140760FC:SSL
routines:SSL23_GET_CLIENT_HELLO:unknown protocol
I0718 06:31:29.533915 30757 ssl_tests.cpp:638] Testing server protocol 'LIBPROCESS_SSL_ENABLE_TLS_V1_2'
I0718 06:31:29.534694 30757 openssl.cpp:419] CA file path is unspecified! NOTE: Set CA file
path with LIBPROCESS_SSL_CA_FILE=<filepath>
I0718 06:31:29.534716 30757 openssl.cpp:424] CA directory path unspecified! NOTE: Set CA directory
path with LIBPROCESS_SSL_CA_DIR=<dirpath>
I0718 06:31:29.534721 30757 openssl.cpp:429] Will not verify peer certificate!
NOTE: Set LIBPROCESS_SSL_VERIFY_CERT=1 to enable peer certificate verification
I0718 06:31:29.534726 30757 openssl.cpp:435] Will only verify peer certificate if presented!
NOTE: Set LIBPROCESS_SSL_REQUIRE_CERT=1 to require peer certificate verification
I0718 06:31:29.559042 30782 libevent_ssl_socket.cpp:1171] Socket error: error:140760FC:SSL
routines:SSL23_GET_CLIENT_HELLO:unknown protocol
[       OK ] SSLTest.NoValidDowngradeEachProtocol (913 ms)
[ RUN      ] SSLTest.PeerAddress
I0718 06:31:29.826645 30757 openssl.cpp:419] CA file path is unspecified! NOTE: Set CA file
path with LIBPROCESS_SSL_CA_FILE=<filepath>
I0718 06:31:29.826670 30757 openssl.cpp:424] CA directory path unspecified! NOTE: Set CA directory
path with LIBPROCESS_SSL_CA_DIR=<dirpath>
I0718 06:31:29.826676 30757 openssl.cpp:429] Will not verify peer certificate!
NOTE: Set LIBPROCESS_SSL_VERIFY_CERT=1 to enable peer certificate verification
I0718 06:31:29.826681 30757 openssl.cpp:435] Will only verify peer certificate if presented!
NOTE: Set LIBPROCESS_SSL_REQUIRE_CERT=1 to require peer certificate verification
[       OK ] SSLTest.PeerAddress (206 ms)
[ RUN      ] SSLTest.HTTPSGet
I0718 06:31:30.041491 30757 openssl.cpp:419] CA file path is unspecified! NOTE: Set CA file
path with LIBPROCESS_SSL_CA_FILE=<filepath>
I0718 06:31:30.041523 30757 openssl.cpp:424] CA directory path unspecified! NOTE: Set CA directory
path with LIBPROCESS_SSL_CA_DIR=<dirpath>
I0718 06:31:30.041527 30757 openssl.cpp:429] Will not verify peer certificate!
NOTE: Set LIBPROCESS_SSL_VERIFY_CERT=1 to enable peer certificate verification
I0718 06:31:30.041529 30757 openssl.cpp:435] Will only verify peer certificate if presented!
NOTE: Set LIBPROCESS_SSL_REQUIRE_CERT=1 to require peer certificate verification
[       OK ] SSLTest.HTTPSGet (206 ms)
[ RUN      ] SSLTest.HTTPSPost
I0718 06:31:30.273967 30757 openssl.cpp:419] CA file path is unspecified! NOTE: Set CA file
path with LIBPROCESS_SSL_CA_FILE=<filepath>
I0718 06:31:30.273994 30757 openssl.cpp:424] CA directory path unspecified! NOTE: Set CA directory
path with LIBPROCESS_SSL_CA_DIR=<dirpath>
I0718 06:31:30.274000 30757 openssl.cpp:429] Will not verify peer certificate!
NOTE: Set LIBPROCESS_SSL_VERIFY_CERT=1 to enable peer certificate verification
I0718 06:31:30.274005 30757 openssl.cpp:435] Will only verify peer certificate if presented!
NOTE: Set LIBPROCESS_SSL_REQUIRE_CERT=1 to require peer certificate verification
[       OK ] SSLTest.HTTPSPost (234 ms)
[ RUN      ] SSLTest.SilentSocket
I0718 06:31:30.622104 30757 openssl.cpp:419] CA file path is unspecified! NOTE: Set CA file
path with LIBPROCESS_SSL_CA_FILE=<filepath>
I0718 06:31:30.622128 30757 openssl.cpp:424] CA directory path unspecified! NOTE: Set CA directory
path with LIBPROCESS_SSL_CA_DIR=<dirpath>
I0718 06:31:30.622133 30757 openssl.cpp:429] Will not verify peer certificate!
NOTE: Set LIBPROCESS_SSL_VERIFY_CERT=1 to enable peer certificate verification
I0718 06:31:30.622135 30757 openssl.cpp:435] Will only verify peer certificate if presented!
NOTE: Set LIBPROCESS_SSL_REQUIRE_CERT=1 to require peer certificate verification
I0718 06:31:30.630663 30782 libevent_ssl_socket.cpp:1171] Socket error: error:00000000:lib(0):func(0):reason(0)
[       OK ] SSLTest.SilentSocket (347 ms)
[----------] 15 tests from SSLTest (8407 ms total)

[----------] 42 tests from Scheme/HTTPTest
[ RUN      ] Scheme/HTTPTest.Endpoints/0
I0718 06:31:30.748917 30757 openssl.cpp:419] CA file path is unspecified! NOTE: Set CA file
path with LIBPROCESS_SSL_CA_FILE=<filepath>
I0718 06:31:30.748950 30757 openssl.cpp:424] CA directory path unspecified! NOTE: Set CA directory
path with LIBPROCESS_SSL_CA_DIR=<dirpath>
I0718 06:31:30.748956 30757 openssl.cpp:429] Will not verify peer certificate!
NOTE: Set LIBPROCESS_SSL_VERIFY_CERT=1 to enable peer certificate verification
I0718 06:31:30.748961 30757 openssl.cpp:435] Will only verify peer certificate if presented!
NOTE: Set LIBPROCESS_SSL_REQUIRE_CERT=1 to require peer certificate verification
I0718 06:31:30.749780 30782 process.cpp:993] Failed to accept socket: future discarded
I0718 06:31:30.765666 30757 process.cpp:1314] libprocess is initialized on 172.17.0.4:42508
with 24 worker threads
I0718 06:31:30.773655 31849 process.cpp:3820] Handling HTTP event for process '(74)' with
path: '/(74)/body'
I0718 06:31:30.782447 31855 process.cpp:3820] Handling HTTP event for process '(74)' with
path: '/(74)/pipe'
I0718 06:31:30.792646 31845 process.cpp:3820] Handling HTTP event for process '(74)' with
path: '/(74)/body'
I0718 06:31:30.793696 31851 process.cpp:3877] Failed to process request for '/(74)/body':
failure
I0718 06:31:30.793807 31836 process.cpp:1530] Returning '500 Internal Server Error' for '/(74)/body'
(failure)
[       OK ] Scheme/HTTPTest.Endpoints/0 (176 ms)
[ RUN      ] Scheme/HTTPTest.Endpoints/1
I0718 06:31:30.813148 30757 process.cpp:1314] libprocess is initialized on 172.17.0.4:35628
with 24 worker threads
I0718 06:31:30.814929 31867 process.cpp:3820] Handling HTTP event for process '(75)' with
path: '/(75)/body'
I0718 06:31:30.817355 31864 process.cpp:3820] Handling HTTP event for process '(75)' with
path: '/(75)/pipe'
I0718 06:31:30.820943 31873 process.cpp:3820] Handling HTTP event for process '(75)' with
path: '/(75)/body'
I0718 06:31:30.821755 31882 process.cpp:3877] Failed to process request for '/(75)/body':
failure
I0718 06:31:30.821789 31863 process.cpp:1530] Returning '500 Internal Server Error' for '/(75)/body'
(failure)
I0718 06:31:30.822738 31883 process.cpp:880] Decode failure: Connection reset by peer
E0718 06:31:30.822789 31883 process.cpp:2504] Failed to shutdown socket with fd 9, address
172.17.0.4:35628: Transport endpoint is not connected
[       OK ] Scheme/HTTPTest.Endpoints/1 (16 ms)
[ RUN      ] Scheme/HTTPTest.EndpointsHelp/0
I0718 06:31:31.122622 30757 openssl.cpp:419] CA file path is unspecified! NOTE: Set CA file
path with LIBPROCESS_SSL_CA_FILE=<filepath>
I0718 06:31:31.122692 30757 openssl.cpp:424] CA directory path unspecified! NOTE: Set CA directory
path with LIBPROCESS_SSL_CA_DIR=<dirpath>
I0718 06:31:31.122709 30757 openssl.cpp:429] Will not verify peer certificate!
NOTE: Set LIBPROCESS_SSL_VERIFY_CERT=1 to enable peer certificate verification
I0718 06:31:31.122721 30757 openssl.cpp:435] Will only verify peer certificate if presented!
NOTE: Set LIBPROCESS_SSL_REQUIRE_CERT=1 to require peer certificate verification
I0718 06:31:31.123884 31883 process.cpp:993] Failed to accept socket: future discarded
I0718 06:31:31.127017 30757 process.cpp:1314] libprocess is initialized on 172.17.0.4:33633
with 24 worker threads
I0718 06:31:31.134138 31894 process.cpp:3820] Handling HTTP event for process 'help' with
path: '/help'
I0718 06:31:31.140763 31906 process.cpp:3820] Handling HTTP event for process 'help' with
path: '/help'
I0718 06:31:31.149560 31884 process.cpp:3820] Handling HTTP event for process 'help' with
path: '/help/(76)/body'
I0718 06:31:31.162464 31898 process.cpp:3820] Handling HTTP event for process 'help' with
path: '/help/(76)/a/b/c'
[       OK ] Scheme/HTTPTest.EndpointsHelp/0 (342 ms)
[ RUN      ] Scheme/HTTPTest.EndpointsHelp/1
I0718 06:31:31.172657 30757 process.cpp:1314] libprocess is initialized on 172.17.0.4:41532
with 24 worker threads
I0718 06:31:31.174975 31922 process.cpp:3820] Handling HTTP event for process 'help' with
path: '/help'
I0718 06:31:31.178088 31922 process.cpp:3820] Handling HTTP event for process 'help' with
path: '/help'
I0718 06:31:31.181844 31923 process.cpp:3820] Handling HTTP event for process 'help' with
path: '/help/(77)/body'
I0718 06:31:31.184551 31917 process.cpp:3820] Handling HTTP event for process 'help' with
path: '/help/(77)/a/b/c'
[       OK ] Scheme/HTTPTest.EndpointsHelp/1 (21 ms)
[ RUN      ] Scheme/HTTPTest.EndpointsHelpRemoval/0
I0718 06:31:31.698803 30757 openssl.cpp:419] CA file path is unspecified! NOTE: Set CA file
path with LIBPROCESS_SSL_CA_FILE=<filepath>
I0718 06:31:31.698834 30757 openssl.cpp:424] CA directory path unspecified! NOTE: Set CA directory
path with LIBPROCESS_SSL_CA_DIR=<dirpath>
I0718 06:31:31.698840 30757 openssl.cpp:429] Will not verify peer certificate!
NOTE: Set LIBPROCESS_SSL_VERIFY_CERT=1 to enable peer certificate verification
I0718 06:31:31.698846 30757 openssl.cpp:435] Will only verify peer certificate if presented!
NOTE: Set LIBPROCESS_SSL_REQUIRE_CERT=1 to require peer certificate verification
I0718 06:31:31.699648 31933 process.cpp:993] Failed to accept socket: future discarded
I0718 06:31:31.703475 30757 process.cpp:1314] libprocess is initialized on 172.17.0.4:36957
with 24 worker threads
I0718 06:31:31.714591 31951 process.cpp:3820] Handling HTTP event for process 'help' with
path: '/help/(78)/body'
I0718 06:31:31.727692 31948 process.cpp:3820] Handling HTTP event for process 'help' with
path: '/help/(78)/bogus'
[       OK ] Scheme/HTTPTest.EndpointsHelpRemoval/0 (544 ms)
[ RUN      ] Scheme/HTTPTest.EndpointsHelpRemoval/1
I0718 06:31:31.734954 30757 process.cpp:1314] libprocess is initialized on 172.17.0.4:39117
with 24 worker threads
I0718 06:31:31.741601 31975 process.cpp:3820] Handling HTTP event for process 'help' with
path: '/help/(79)/body'
I0718 06:31:31.747074 31966 process.cpp:3820] Handling HTTP event for process 'help' with
path: '/help/(79)/bogus'
[       OK ] Scheme/HTTPTest.EndpointsHelpRemoval/1 (19 ms)
[ RUN      ] Scheme/HTTPTest.PipeEOF/0
I0718 06:31:31.963248 30757 openssl.cpp:419] CA file path is unspecified! NOTE: Set CA file
path with LIBPROCESS_SSL_CA_FILE=<filepath>
I0718 06:31:31.963277 30757 openssl.cpp:424] CA directory path unspecified! NOTE: Set CA directory
path with LIBPROCESS_SSL_CA_DIR=<dirpath>
I0718 06:31:31.963284 30757 openssl.cpp:429] Will not verify peer certificate!
NOTE: Set LIBPROCESS_SSL_VERIFY_CERT=1 to enable peer certificate verification
I0718 06:31:31.963286 30757 openssl.cpp:435] Will only verify peer certificate if presented!
NOTE: Set LIBPROCESS_SSL_REQUIRE_CERT=1 to require peer certificate verification
I0718 06:31:31.964046 31983 process.cpp:993] Failed to accept socket: future discarded
[       OK ] Scheme/HTTPTest.PipeEOF/0 (221 ms)
[ RUN      ] Scheme/HTTPTest.PipeEOF/1
I0718 06:31:31.969388 30757 process.cpp:1314] libprocess is initialized on 172.17.0.4:45838
with 24 worker threads
I0718 06:31:31.974230 30757 process.cpp:1314] libprocess is initialized on 172.17.0.4:37383
with 24 worker threads
[       OK ] Scheme/HTTPTest.PipeEOF/1 (5 ms)
[ RUN      ] Scheme/HTTPTest.PipeFailure/0
I0718 06:31:32.324627 30757 openssl.cpp:419] CA file path is unspecified! NOTE: Set CA file
path with LIBPROCESS_SSL_CA_FILE=<filepath>
I0718 06:31:32.324656 30757 openssl.cpp:424] CA directory path unspecified! NOTE: Set CA directory
path with LIBPROCESS_SSL_CA_DIR=<dirpath>
I0718 06:31:32.324661 30757 openssl.cpp:429] Will not verify peer certificate!
NOTE: Set LIBPROCESS_SSL_VERIFY_CERT=1 to enable peer certificate verification
I0718 06:31:32.324667 30757 openssl.cpp:435] Will only verify peer certificate if presented!
NOTE: Set LIBPROCESS_SSL_REQUIRE_CERT=1 to require peer certificate verification
I0718 06:31:32.325738 32033 process.cpp:993] Failed to accept socket: future discarded
I0718 06:31:32.330596 30757 process.cpp:1314] libprocess is initialized on 172.17.0.4:41289
with 24 worker threads
[       OK ] Scheme/HTTPTest.PipeFailure/0 (356 ms)
[ RUN      ] Scheme/HTTPTest.PipeFailure/1
I0718 06:31:32.335428 30757 process.cpp:1314] libprocess is initialized on 172.17.0.4:39373
with 24 worker threads
[       OK ] Scheme/HTTPTest.PipeFailure/1 (4 ms)
[ RUN      ] Scheme/HTTPTest.PipeReaderCloses/0
I0718 06:31:32.747109 30757 openssl.cpp:419] CA file path is unspecified! NOTE: Set CA file
path with LIBPROCESS_SSL_CA_FILE=<filepath>
I0718 06:31:32.747145 30757 openssl.cpp:424] CA directory path unspecified! NOTE: Set CA directory
path with LIBPROCESS_SSL_CA_DIR=<dirpath>
I0718 06:31:32.747150 30757 openssl.cpp:429] Will not verify peer certificate!
NOTE: Set LIBPROCESS_SSL_VERIFY_CERT=1 to enable peer certificate verification
I0718 06:31:32.747156 30757 openssl.cpp:435] Will only verify peer certificate if presented!
NOTE: Set LIBPROCESS_SSL_REQUIRE_CERT=1 to require peer certificate verification
I0718 06:31:32.749210 32083 process.cpp:993] Failed to accept socket: future discarded
I0718 06:31:32.751456 30757 process.cpp:1314] libprocess is initialized on 172.17.0.4:37256
with 24 worker threads
[       OK ] Scheme/HTTPTest.PipeReaderCloses/0 (417 ms)
[ RUN      ] Scheme/HTTPTest.PipeReaderCloses/1
I0718 06:31:32.757282 30757 process.cpp:1314] libprocess is initialized on 172.17.0.4:39839
with 24 worker threads
[       OK ] Scheme/HTTPTest.PipeReaderCloses/1 (10 ms)
[ RUN      ] Scheme/HTTPTest.Encode/0
I0718 06:31:33.040410 30757 openssl.cpp:419] CA file path is unspecified! NOTE: Set CA file
path with LIBPROCESS_SSL_CA_FILE=<filepath>
I0718 06:31:33.040434 30757 openssl.cpp:424] CA directory path unspecified! NOTE: Set CA directory
path with LIBPROCESS_SSL_CA_DIR=<dirpath>
I0718 06:31:33.040437 30757 openssl.cpp:429] Will not verify peer certificate!
NOTE: Set LIBPROCESS_SSL_VERIFY_CERT=1 to enable peer certificate verification
I0718 06:31:33.040444 30757 openssl.cpp:435] Will only verify peer certificate if presented!
NOTE: Set LIBPROCESS_SSL_REQUIRE_CERT=1 to require peer certificate verification
I0718 06:31:33.041352 32133 process.cpp:993] Failed to accept socket: future discarded
I0718 06:31:33.044097 30757 process.cpp:1314] libprocess is initialized on 172.17.0.4:33885
with 24 worker threads
[       OK ] Scheme/HTTPTest.Encode/0 (282 ms)
[ RUN      ] Scheme/HTTPTest.Encode/1
I0718 06:31:33.048120 30757 process.cpp:1314] libprocess is initialized on 172.17.0.4:33167
with 24 worker threads
[       OK ] Scheme/HTTPTest.Encode/1 (4 ms)
[ RUN      ] Scheme/HTTPTest.PathParse/0
I0718 06:31:33.320199 30757 openssl.cpp:419] CA file path is unspecified! NOTE: Set CA file
path with LIBPROCESS_SSL_CA_FILE=<filepath>
I0718 06:31:33.320221 30757 openssl.cpp:424] CA directory path unspecified! NOTE: Set CA directory
path with LIBPROCESS_SSL_CA_DIR=<dirpath>
I0718 06:31:33.320225 30757 openssl.cpp:429] Will not verify peer certificate!
NOTE: Set LIBPROCESS_SSL_VERIFY_CERT=1 to enable peer certificate verification
I0718 06:31:33.320230 30757 openssl.cpp:435] Will only verify peer certificate if presented!
NOTE: Set LIBPROCESS_SSL_REQUIRE_CERT=1 to require peer certificate verification
I0718 06:31:33.321130 32183 process.cpp:993] Failed to accept socket: future discarded
I0718 06:31:33.327617 30757 process.cpp:1314] libprocess is initialized on 172.17.0.4:36880
with 24 worker threads
[       OK ] Scheme/HTTPTest.PathParse/0 (280 ms)
[ RUN      ] Scheme/HTTPTest.PathParse/1
*** Aborted at 1500359493 (unix time) try "date -d @1500359493" if you are using GNU date
***
PC: @     0x2afcaa61aa5e (unknown)
*** SIGSEGV (@0x23db5e8) received by PID 30757 (TID 0x2afcb04a1700) from PID 37598696; stack
trace: ***
    @     0x2afca9b52330 (unknown)
    @     0x2afcaa61aa5e (unknown)
    @     0x2afca9e1ae30 (unknown)
I0718 06:31:33.340713 30757 process.cpp:1314] libprocess is initialized on 172.17.0.4:43857
with 24 worker threads
    @     0x2afca9e1b48c (unknown)
[       OK ] Scheme/HTTPTest.PathParse/1 (13 ms)
[ RUN      ] Scheme/HTTPTest.Get/0
    @           0x8de76d process::UPID::UPID()
    @     0x2afca74ec29e process::DispatchEvent::DispatchEvent()
    @     0x2afca74d4133 process::internal::dispatch()
    @     0x2afca74ebd4e process::dispatch<>()
    @     0x2afca74d3304 process::ProcessBase::route()
    @     0x2afca730d2cb process::ProcessBase::route<>()
    @     0x2afca730aeb3 process::Help::initialize()
    @     0x2afca730af52 process::Help::initialize()
    @     0x2afca74ce3ac process::ProcessManager::resume()
    @     0x2afca74dc89c process::ProcessManager::init_threads()::$_2::operator()()
    @     0x2afca74dc7a5 _ZNSt12_Bind_simpleIFZN7process14ProcessManager12init_threadsEvE3$_2vEE9_M_invokeIJEEEvSt12_Index_tupleIJXspT_EEE
    @     0x2afca74dc775 std::_Bind_simple<>::operator()()
    @     0x2afca74dc74c std::thread::_Impl<>::_M_run()
    @     0x2afca9e11a60 (unknown)
    @     0x2afca9b4a184 start_thread
    @     0x2afcaa67dffd (unknown)
make[3]: Leaving directory `/mesos/build'
make[3]: *** [CMakeFiles/check] Segmentation fault (core dumped)
make[2]: *** [CMakeFiles/check.dir/all] Error 2
make[1]: *** [CMakeFiles/check.dir/rule] Error 2
make: *** [check] Error 2
make[2]: Leaving directory `/mesos/build'
make[1]: Leaving directory `/mesos/build'
+ docker rmi mesos-1500357591-8666
Untagged: mesos-1500357591-8666:latest
Deleted: sha256:4bdc0036fb7e7bb9660a7f26268175ad81d383bc341d96fde9e263f6cd8eefae
Deleted: sha256:6db711e2d7b3242a4f4610e76eff84b9052b94840a0905bc644be83ec52a079b
Deleted: sha256:cc9ee3a83bb798ba7e89f6c8a135eb6f93b2a65c6728b4dd527583a96dbfd25f
Deleted: sha256:556dae2b551326c214f17d23753a87e4db99e0233fe9e28f1f4fa1fdd05c71ce
Deleted: sha256:c8bac98de78ac51618495b5a75c306ed83e4748804ea86bd6f64deb8bd31cf8d
Deleted: sha256:2b1bcfc6951f8956378306c0a9addc63f2151464b450990f702c6df5600ee23b
Deleted: sha256:93e6a8015f587f8873c0faefaa89cf19965d16fac1900a6edd5884504800eae4
Deleted: sha256:9f4d14f656947e042c705cbbf813add3c561b396da95541835f72d91150577d2
Deleted: sha256:966891e039c5717f88faba25ac99e3ed6b738a7396082df203ba42fba816479a
Deleted: sha256:aa614ca3035f77fa5bdf0a2c7a428655130fcf56eb67748bdda594d4741e7367
Deleted: sha256:5a5155c0fde1d8f050dddc5809724ec4ffbbe468ba0e2bbb0456e217142683b1
Deleted: sha256:4d6d7f67650258682d3af03fe9229f102f52b1e937e8a3b07a84f2875f239dde
Deleted: sha256:445cf4def60d11240bd475a391b756165c83228576a80a4844d17726953b9671
Deleted: sha256:fac4542edc51001a8d74d5a0abf3f085c7905029b8c9b5b9a8ebfe69bd5c1a31
Deleted: sha256:810a9dabd1f0eb00e90c258c8fa69094157bd635ec3bf9e132f0e42e2d34636c
Deleted: sha256:5b2d0e5db1b6387b5233eeede671b9465b721155cbfa35217bf70ffd36ee83ee
Deleted: sha256:785eb0f4c1df36a2be296d6ff05464f77eafb0344bf7e301d5d250190acc755b
Deleted: sha256:dbb9a511685eea33ac76a459c7df1b6ac5d828973b181ec1387bcd1daaa27787
Deleted: sha256:9ee64ba2bf35dd20538719f0262e395bf2282a1f50feeff6a9a9f711533a909d
Deleted: sha256:f144df47585632059f6de157a3034ab8f2a6de018a69c9239c41efc747dcdf2b
Deleted: sha256:d920c314579b96abafb5509436e0d7cef166bdfea899e4790bebb817c3c470e7
Deleted: sha256:152271d238d6224beea1f3105c536f565fa015459d2bfeb3675dca466a442003
Deleted: sha256:8d0c741d8ded712de94288ef4d3a40d7e3e03fc28205b6e45132717181007e44
Deleted: sha256:4bbfa6dc92231161b5604b656db3256878fe16ea74d05cfe1058fc3221c8cfe0
Build step 'Execute shell' marked build as failure

Mime
View raw message