mesos-builds mailing list archives

Site index · List index
Message view « Date » · « Thread »
Top « Date » · « Thread »
From Apache Jenkins Server <jenk...@builds.apache.org>
Subject Build failed in Jenkins: Mesos-Buildbot » autotools,gcc,--verbose --enable-libevent --enable-ssl,GLOG_v=1 MESOS_VERBOSE=1,ubuntu:14.04,(ubuntu)&&(!ubuntu-us1)&&(!ubuntu-eu2) #3979
Date Sat, 29 Jul 2017 02:33:14 GMT
See <https://builds.apache.org/job/Mesos-Buildbot/BUILDTOOL=autotools,COMPILER=gcc,CONFIGURATION=--verbose%20--enable-libevent%20--enable-ssl,ENVIRONMENT=GLOG_v=1%20MESOS_VERBOSE=1,OS=ubuntu%3A14.04,label_exp=(ubuntu)&&(!ubuntu-us1)&&(!ubuntu-eu2)/3979/display/redirect?page=changes>

Changes:

[mpark] Added MESOS-7728 to 1.3.1 CHANGELOG.

------------------------------------------
[...truncated 28.00 MB...]
I0729 02:33:03.612676 32092 slave.cpp:796] Agent terminating
[       OK ] Endpoint/SlaveEndpointTest.AuthorizedRequest/2 (46 ms)
[ RUN      ] Endpoint/SlaveEndpointTest.UnauthorizedRequest/0
I0729 02:33:03.627051 32092 containerizer.cpp:221] Using isolation: posix/cpu,posix/mem,filesystem/posix,network/cni
W0729 02:33:03.627861 32092 backend.cpp:76] Failed to create 'overlay' backend: OverlayBackend
requires root privileges
W0729 02:33:03.628039 32092 backend.cpp:76] Failed to create 'bind' backend: BindBackend requires
root privileges
I0729 02:33:03.628087 32092 provisioner.cpp:249] Using default backend 'copy'
I0729 02:33:03.632628 14869 slave.cpp:231] Mesos agent started on (747)@172.17.0.4:42647
I0729 02:33:03.632671 14869 slave.cpp:232] Flags at startup: --acls="" --appc_simple_discovery_uri_prefix="http://"
--appc_store_dir="/tmp/mesos/store/appc" --authenticate_http_executors="true" --authenticate_http_readonly="true"
--authenticate_http_readwrite="true" --authenticatee="crammd5" --authentication_backoff_factor="1secs"
--authorizer="local" --cgroups_cpu_enable_pids_and_tids_count="false" --cgroups_enable_cfs="false"
--cgroups_hierarchy="/sys/fs/cgroup" --cgroups_limit_swap="false" --cgroups_root="mesos" --container_disk_watch_interval="15secs"
--containerizers="mesos" --credential="/tmp/Endpoint_SlaveEndpointTest_UnauthorizedRequest_0_Clg8db/credential"
--default_role="*" --disk_watch_interval="1mins" --docker="docker" --docker_kill_orphans="true"
--docker_registry="https://registry-1.docker.io" --docker_remove_delay="6hrs" --docker_socket="/var/run/docker.sock"
--docker_stop_timeout="0ns" --docker_store_dir="/tmp/mesos/store/docker" --docker_volume_checkpoint_dir="/var/run/mesos/isolators/docker/volume"
--enforce_container_disk_quota="false" --executor_registration_timeout="1mins" --executor_reregistration_timeout="2secs"
--executor_secret_key="/tmp/Endpoint_SlaveEndpointTest_UnauthorizedRequest_0_Clg8db/executor_secret_key"
--executor_shutdown_grace_period="5secs" --fetcher_cache_dir="/tmp/Endpoint_SlaveEndpointTest_UnauthorizedRequest_0_Clg8db/fetch"
--fetcher_cache_size="2GB" --frameworks_home="" --gc_delay="1weeks" --gc_disk_headroom="0.1"
--hadoop_home="" --help="false" --hostname_lookup="true" --http_command_executor="false" --http_credentials="/tmp/Endpoint_SlaveEndpointTest_UnauthorizedRequest_0_Clg8db/http_credentials"
--http_heartbeat_interval="30secs" --initialize_driver_logging="true" --isolation="posix/cpu,posix/mem"
--launcher="posix" --launcher_dir="/mesos/mesos-1.3.1/_build/src" --logbufsecs="0" --logging_level="INFO"
--max_completed_executors_per_framework="150" --oversubscribed_resources_interval="15secs"
--perf_duration="10secs" --perf_interval="1mins" --port="5051" --qos_correction_interval_min="0ns"
--quiet="false" --recover="reconnect" --recovery_timeout="15mins" --registration_backoff_factor="10ms"
--resources="cpus:2;gpus:0;mem:1024;disk:1024;ports:[31000-32000]" --revocable_cpu_low_priority="true"
--runtime_dir="/tmp/Endpoint_SlaveEndpointTest_UnauthorizedRequest_0_Clg8db" --sandbox_directory="/mnt/mesos/sandbox"
--strict="true" --switch_user="true" --systemd_enable_support="true" --systemd_runtime_directory="/run/systemd/system"
--version="false" --work_dir="/tmp/Endpoint_SlaveEndpointTest_UnauthorizedRequest_0_qtMPmk"
I0729 02:33:03.633388 14869 credentials.hpp:86] Loading credential for authentication from
'/tmp/Endpoint_SlaveEndpointTest_UnauthorizedRequest_0_Clg8db/credential'
I0729 02:33:03.633635 14869 slave.cpp:264] Agent using credential for: test-principal
I0729 02:33:03.633662 14869 credentials.hpp:37] Loading credentials for authentication from
'/tmp/Endpoint_SlaveEndpointTest_UnauthorizedRequest_0_Clg8db/http_credentials'
I0729 02:33:03.634116 14869 http.cpp:975] Creating default 'basic' HTTP authenticator for
realm 'mesos-agent-executor'
I0729 02:33:03.634311 14869 http.cpp:996] Creating default 'jwt' HTTP authenticator for realm
'mesos-agent-executor'
I0729 02:33:03.634543 14869 http.cpp:975] Creating default 'basic' HTTP authenticator for
realm 'mesos-agent-readonly'
I0729 02:33:03.634655 14869 http.cpp:996] Creating default 'jwt' HTTP authenticator for realm
'mesos-agent-readonly'
I0729 02:33:03.634845 14869 http.cpp:975] Creating default 'basic' HTTP authenticator for
realm 'mesos-agent-readwrite'
I0729 02:33:03.634956 14869 http.cpp:996] Creating default 'jwt' HTTP authenticator for realm
'mesos-agent-readwrite'
I0729 02:33:03.637104 14869 slave.cpp:531] Agent resources: cpus(*):2; mem(*):1024; disk(*):1024;
ports(*):[31000-32000]
I0729 02:33:03.637255 14869 slave.cpp:539] Agent attributes: [  ]
I0729 02:33:03.637275 14869 slave.cpp:544] Agent hostname: a495dfcb5ddf
I0729 02:33:03.637498 14870 status_update_manager.cpp:177] Pausing sending status updates
I0729 02:33:03.639405 14870 state.cpp:62] Recovering state from '/tmp/Endpoint_SlaveEndpointTest_UnauthorizedRequest_0_qtMPmk/meta'
I0729 02:33:03.640107 14870 status_update_manager.cpp:203] Recovering status update manager
I0729 02:33:03.640421 14874 containerizer.cpp:608] Recovering containerizer
I0729 02:33:03.642684 14870 provisioner.cpp:410] Provisioner recovery complete
I0729 02:33:03.643362 14871 slave.cpp:6075] Finished recovery
I0729 02:33:03.644069 14871 slave.cpp:6257] Querying resource estimator for oversubscribable
resources
I0729 02:33:03.644500 14870 slave.cpp:6271] Received oversubscribable resources {} from the
resource estimator
I0729 02:33:03.648090 14873 process.cpp:3741] Handling HTTP event for process 'slave(747)'
with path: '/slave(747)/monitor/statistics'
I0729 02:33:03.650854 14874 http.cpp:1115] HTTP GET for /slave(747)/monitor/statistics from
172.17.0.4:37370
I0729 02:33:03.650971 14874 http.cpp:936] Authorizing principal 'test-principal' to GET the
'/monitor/statistics' endpoint
I0729 02:33:03.655592 14874 slave.cpp:796] Agent terminating
[       OK ] Endpoint/SlaveEndpointTest.UnauthorizedRequest/0 (42 ms)
[ RUN      ] Endpoint/SlaveEndpointTest.UnauthorizedRequest/1
I0729 02:33:03.669395 32092 containerizer.cpp:221] Using isolation: posix/cpu,posix/mem,filesystem/posix,network/cni
W0729 02:33:03.670205 32092 backend.cpp:76] Failed to create 'overlay' backend: OverlayBackend
requires root privileges
W0729 02:33:03.670392 32092 backend.cpp:76] Failed to create 'bind' backend: BindBackend requires
root privileges
I0729 02:33:03.670444 32092 provisioner.cpp:249] Using default backend 'copy'
I0729 02:33:03.675036 14873 slave.cpp:231] Mesos agent started on (748)@172.17.0.4:42647
I0729 02:33:03.675079 14873 slave.cpp:232] Flags at startup: --acls="" --appc_simple_discovery_uri_prefix="http://"
--appc_store_dir="/tmp/mesos/store/appc" --authenticate_http_executors="true" --authenticate_http_readonly="true"
--authenticate_http_readwrite="true" --authenticatee="crammd5" --authentication_backoff_factor="1secs"
--authorizer="local" --cgroups_cpu_enable_pids_and_tids_count="false" --cgroups_enable_cfs="false"
--cgroups_hierarchy="/sys/fs/cgroup" --cgroups_limit_swap="false" --cgroups_root="mesos" --container_disk_watch_interval="15secs"
--containerizers="mesos" --credential="/tmp/Endpoint_SlaveEndpointTest_UnauthorizedRequest_1_Yw4L2A/credential"
--default_role="*" --disk_watch_interval="1mins" --docker="docker" --docker_kill_orphans="true"
--docker_registry="https://registry-1.docker.io" --docker_remove_delay="6hrs" --docker_socket="/var/run/docker.sock"
--docker_stop_timeout="0ns" --docker_store_dir="/tmp/mesos/store/docker" --docker_volume_checkpoint_dir="/var/run/mesos/isolators/docker/volume"
--enforce_container_disk_quota="false" --executor_registration_timeout="1mins" --executor_reregistration_timeout="2secs"
--executor_secret_key="/tmp/Endpoint_SlaveEndpointTest_UnauthorizedRequest_1_Yw4L2A/executor_secret_key"
--executor_shutdown_grace_period="5secs" --fetcher_cache_dir="/tmp/Endpoint_SlaveEndpointTest_UnauthorizedRequest_1_Yw4L2A/fetch"
--fetcher_cache_size="2GB" --frameworks_home="" --gc_delay="1weeks" --gc_disk_headroom="0.1"
--hadoop_home="" --help="false" --hostname_lookup="true" --http_command_executor="false" --http_credentials="/tmp/Endpoint_SlaveEndpointTest_UnauthorizedRequest_1_Yw4L2A/http_credentials"
--http_heartbeat_interval="30secs" --initialize_driver_logging="true" --isolation="posix/cpu,posix/mem"
--launcher="posix" --launcher_dir="/mesos/mesos-1.3.1/_build/src" --logbufsecs="0" --logging_level="INFO"
--max_completed_executors_per_framework="150" --oversubscribed_resources_interval="15secs"
--perf_duration="10secs" --perf_interval="1mins" --port="5051" --qos_correction_interval_min="0ns"
--quiet="false" --recover="reconnect" --recovery_timeout="15mins" --registration_backoff_factor="10ms"
--resources="cpus:2;gpus:0;mem:1024;disk:1024;ports:[31000-32000]" --revocable_cpu_low_priority="true"
--runtime_dir="/tmp/Endpoint_SlaveEndpointTest_UnauthorizedRequest_1_Yw4L2A" --sandbox_directory="/mnt/mesos/sandbox"
--strict="true" --switch_user="true" --systemd_enable_support="true" --systemd_runtime_directory="/run/systemd/system"
--version="false" --work_dir="/tmp/Endpoint_SlaveEndpointTest_UnauthorizedRequest_1_e9iB4J"
I0729 02:33:03.675799 14873 credentials.hpp:86] Loading credential for authentication from
'/tmp/Endpoint_SlaveEndpointTest_UnauthorizedRequest_1_Yw4L2A/credential'
I0729 02:33:03.676046 14873 slave.cpp:264] Agent using credential for: test-principal
I0729 02:33:03.676074 14873 credentials.hpp:37] Loading credentials for authentication from
'/tmp/Endpoint_SlaveEndpointTest_UnauthorizedRequest_1_Yw4L2A/http_credentials'
I0729 02:33:03.676498 14873 http.cpp:975] Creating default 'basic' HTTP authenticator for
realm 'mesos-agent-executor'
I0729 02:33:03.676692 14873 http.cpp:996] Creating default 'jwt' HTTP authenticator for realm
'mesos-agent-executor'
I0729 02:33:03.676919 14873 http.cpp:975] Creating default 'basic' HTTP authenticator for
realm 'mesos-agent-readonly'
I0729 02:33:03.677028 14873 http.cpp:996] Creating default 'jwt' HTTP authenticator for realm
'mesos-agent-readonly'
I0729 02:33:03.677206 14873 http.cpp:975] Creating default 'basic' HTTP authenticator for
realm 'mesos-agent-readwrite'
I0729 02:33:03.677305 14873 http.cpp:996] Creating default 'jwt' HTTP authenticator for realm
'mesos-agent-readwrite'
I0729 02:33:03.679491 14873 slave.cpp:531] Agent resources: cpus(*):2; mem(*):1024; disk(*):1024;
ports(*):[31000-32000]
I0729 02:33:03.679642 14873 slave.cpp:539] Agent attributes: [  ]
I0729 02:33:03.679664 14873 slave.cpp:544] Agent hostname: a495dfcb5ddf
I0729 02:33:03.679911 14867 status_update_manager.cpp:177] Pausing sending status updates
I0729 02:33:03.681866 14867 state.cpp:62] Recovering state from '/tmp/Endpoint_SlaveEndpointTest_UnauthorizedRequest_1_e9iB4J/meta'
I0729 02:33:03.682481 14867 status_update_manager.cpp:203] Recovering status update manager
I0729 02:33:03.682760 14874 containerizer.cpp:608] Recovering containerizer
I0729 02:33:03.685016 14874 provisioner.cpp:410] Provisioner recovery complete
I0729 02:33:03.685673 14874 slave.cpp:6075] Finished recovery
I0729 02:33:03.686347 14874 slave.cpp:6257] Querying resource estimator for oversubscribable
resources
I0729 02:33:03.686750 14874 slave.cpp:6271] Received oversubscribable resources {} from the
resource estimator
I0729 02:33:03.692075 14868 process.cpp:3741] Handling HTTP event for process 'slave(748)'
with path: '/slave(748)/monitor/statistics.json'
I0729 02:33:03.695644 14868 http.cpp:1115] HTTP GET for /slave(748)/monitor/statistics.json
from 172.17.0.4:37372
I0729 02:33:03.695770 14868 http.cpp:936] Authorizing principal 'test-principal' to GET the
'/monitor/statistics.json' endpoint
I0729 02:33:03.710991 32092 slave.cpp:796] Agent terminating
[       OK ] Endpoint/SlaveEndpointTest.UnauthorizedRequest/1 (55 ms)
[ RUN      ] Endpoint/SlaveEndpointTest.UnauthorizedRequest/2
I0729 02:33:03.724856 32092 containerizer.cpp:221] Using isolation: posix/cpu,posix/mem,filesystem/posix,network/cni
W0729 02:33:03.725668 32092 backend.cpp:76] Failed to create 'overlay' backend: OverlayBackend
requires root privileges
W0729 02:33:03.725857 32092 backend.cpp:76] Failed to create 'bind' backend: BindBackend requires
root privileges
I0729 02:33:03.725909 32092 provisioner.cpp:249] Using default backend 'copy'
I0729 02:33:03.730444 14874 slave.cpp:231] Mesos agent started on (749)@172.17.0.4:42647
I0729 02:33:03.730484 14874 slave.cpp:232] Flags at startup: --acls="" --appc_simple_discovery_uri_prefix="http://"
--appc_store_dir="/tmp/mesos/store/appc" --authenticate_http_executors="true" --authenticate_http_readonly="true"
--authenticate_http_readwrite="true" --authenticatee="crammd5" --authentication_backoff_factor="1secs"
--authorizer="local" --cgroups_cpu_enable_pids_and_tids_count="false" --cgroups_enable_cfs="false"
--cgroups_hierarchy="/sys/fs/cgroup" --cgroups_limit_swap="false" --cgroups_root="mesos" --container_disk_watch_interval="15secs"
--containerizers="mesos" --credential="/tmp/Endpoint_SlaveEndpointTest_UnauthorizedRequest_2_6SLdp1/credential"
--default_role="*" --disk_watch_interval="1mins" --docker="docker" --docker_kill_orphans="true"
--docker_registry="https://registry-1.docker.io" --docker_remove_delay="6hrs" --docker_socket="/var/run/docker.sock"
--docker_stop_timeout="0ns" --docker_store_dir="/tmp/mesos/store/docker" --docker_volume_checkpoint_dir="/var/run/mesos/isolators/docker/volume"
--enforce_container_disk_quota="false" --executor_registration_timeout="1mins" --executor_reregistration_timeout="2secs"
--executor_secret_key="/tmp/Endpoint_SlaveEndpointTest_UnauthorizedRequest_2_6SLdp1/executor_secret_key"
--executor_shutdown_grace_period="5secs" --fetcher_cache_dir="/tmp/Endpoint_SlaveEndpointTest_UnauthorizedRequest_2_6SLdp1/fetch"
--fetcher_cache_size="2GB" --frameworks_home="" --gc_delay="1weeks" --gc_disk_headroom="0.1"
--hadoop_home="" --help="false" --hostname_lookup="true" --http_command_executor="false" --http_credentials="/tmp/Endpoint_SlaveEndpointTest_UnauthorizedRequest_2_6SLdp1/http_credentials"
--http_heartbeat_interval="30secs" --initialize_driver_logging="true" --isolation="posix/cpu,posix/mem"
--launcher="posix" --launcher_dir="/mesos/mesos-1.3.1/_build/src" --logbufsecs="0" --logging_level="INFO"
--max_completed_executors_per_framework="150" --oversubscribed_resources_interval="15secs"
--perf_duration="10secs" --perf_interval="1mins" --port="5051" --qos_correction_interval_min="0ns"
--quiet="false" --recover="reconnect" --recovery_timeout="15mins" --registration_backoff_factor="10ms"
--resources="cpus:2;gpus:0;mem:1024;disk:1024;ports:[31000-32000]" --revocable_cpu_low_priority="true"
--runtime_dir="/tmp/Endpoint_SlaveEndpointTest_UnauthorizedRequest_2_6SLdp1" --sandbox_directory="/mnt/mesos/sandbox"
--strict="true" --switch_user="true" --systemd_enable_support="true" --systemd_runtime_directory="/run/systemd/system"
--version="false" --work_dir="/tmp/Endpoint_SlaveEndpointTest_UnauthorizedRequest_2_iRm4ha"
I0729 02:33:03.731192 14874 credentials.hpp:86] Loading credential for authentication from
'/tmp/Endpoint_SlaveEndpointTest_UnauthorizedRequest_2_6SLdp1/credential'
I0729 02:33:03.731446 14874 slave.cpp:264] Agent using credential for: test-principal
I0729 02:33:03.731472 14874 credentials.hpp:37] Loading credentials for authentication from
'/tmp/Endpoint_SlaveEndpointTest_UnauthorizedRequest_2_6SLdp1/http_credentials'
I0729 02:33:03.731914 14874 http.cpp:975] Creating default 'basic' HTTP authenticator for
realm 'mesos-agent-executor'
I0729 02:33:03.732107 14874 http.cpp:996] Creating default 'jwt' HTTP authenticator for realm
'mesos-agent-executor'
I0729 02:33:03.732338 14874 http.cpp:975] Creating default 'basic' HTTP authenticator for
realm 'mesos-agent-readonly'
I0729 02:33:03.732457 14874 http.cpp:996] Creating default 'jwt' HTTP authenticator for realm
'mesos-agent-readonly'
I0729 02:33:03.732655 14874 http.cpp:975] Creating default 'basic' HTTP authenticator for
realm 'mesos-agent-readwrite'
I0729 02:33:03.732770 14874 http.cpp:996] Creating default 'jwt' HTTP authenticator for realm
'mesos-agent-readwrite'
I0729 02:33:03.735054 14874 slave.cpp:531] Agent resources: cpus(*):2; mem(*):1024; disk(*):1024;
ports(*):[31000-32000]
I0729 02:33:03.735209 14874 slave.cpp:539] Agent attributes: [  ]
I0729 02:33:03.735229 14874 slave.cpp:544] Agent hostname: a495dfcb5ddf
I0729 02:33:03.735460 14870 status_update_manager.cpp:177] Pausing sending status updates
I0729 02:33:03.737397 14870 state.cpp:62] Recovering state from '/tmp/Endpoint_SlaveEndpointTest_UnauthorizedRequest_2_iRm4ha/meta'
I0729 02:33:03.737857 14869 status_update_manager.cpp:203] Recovering status update manager
I0729 02:33:03.738128 14869 containerizer.cpp:608] Recovering containerizer
I0729 02:33:03.740270 14869 provisioner.cpp:410] Provisioner recovery complete
I0729 02:33:03.740944 14874 slave.cpp:6075] Finished recovery
I0729 02:33:03.741613 14874 slave.cpp:6257] Querying resource estimator for oversubscribable
resources
I0729 02:33:03.742019 14874 slave.cpp:6271] Received oversubscribable resources {} from the
resource estimator
I0729 02:33:03.746549 14869 process.cpp:3741] Handling HTTP event for process 'slave(749)'
with path: '/slave(749)/containers'
I0729 02:33:03.749303 14867 http.cpp:1115] HTTP GET for /slave(749)/containers from 172.17.0.4:37374
I0729 02:33:03.749435 14867 http.cpp:936] Authorizing principal 'test-principal' to GET the
'/containers' endpoint
I0729 02:33:03.753829 32092 slave.cpp:796] Agent terminating
[       OK ] Endpoint/SlaveEndpointTest.UnauthorizedRequest/2 (43 ms)
[ RUN      ] Endpoint/SlaveEndpointTest.NoAuthorizer/0
I0729 02:33:03.768288 32092 containerizer.cpp:221] Using isolation: posix/cpu,posix/mem,filesystem/posix,network/cni
W0729 02:33:03.769093 32092 backend.cpp:76] Failed to create 'overlay' backend: OverlayBackend
requires root privileges
W0729 02:33:03.769276 32092 backend.cpp:76] Failed to create 'bind' backend: BindBackend requires
root privileges
I0729 02:33:03.769327 32092 provisioner.cpp:249] Using default backend 'copy'
I0729 02:33:03.771433 32092 cluster.cpp:448] Creating default 'local' authorizer
I0729 02:33:03.774116 14868 slave.cpp:231] Mesos agent started on (750)@172.17.0.4:42647
I0729 02:33:03.774163 14868 slave.cpp:232] Flags at startup: --acls="" --appc_simple_discovery_uri_prefix="http://"
--appc_store_dir="/tmp/mesos/store/appc" --authenticate_http_executors="true" --authenticate_http_readonly="true"
--authenticate_http_readwrite="true" --authenticatee="crammd5" --authentication_backoff_factor="1secs"
--authorizer="local" --cgroups_cpu_enable_pids_and_tids_count="false" --cgroups_enable_cfs="false"
--cgroups_hierarchy="/sys/fs/cgroup" --cgroups_limit_swap="false" --cgroups_root="mesos" --container_disk_watch_interval="15secs"
--containerizers="mesos" --credential="/tmp/Endpoint_SlaveEndpointTest_NoAuthorizer_0_Uagufs/credential"
--default_role="*" --disk_watch_interval="1mins" --docker="docker" --docker_kill_orphans="true"
--docker_registry="https://registry-1.docker.io" --docker_remove_delay="6hrs" --docker_socket="/var/run/docker.sock"
--docker_stop_timeout="0ns" --docker_store_dir="/tmp/mesos/store/docker" --docker_volume_checkpoint_dir="/var/run/mesos/isolators/docker/volume"
--enforce_container_disk_quota="false" --executor_registration_timeout="1mins" --executor_reregistration_timeout="2secs"
--executor_secret_key="/tmp/Endpoint_SlaveEndpointTest_NoAuthorizer_0_Uagufs/executor_secret_key"
--executor_shutdown_grace_period="5secs" --fetcher_cache_dir="/tmp/Endpoint_SlaveEndpointTest_NoAuthorizer_0_Uagufs/fetch"
--fetcher_cache_size="2GB" --frameworks_home="" --gc_delay="1weeks" --gc_disk_headroom="0.1"
--hadoop_home="" --help="false" --hostname_lookup="true" --http_command_executor="false" --http_credentials="/tmp/Endpoint_SlaveEndpointTest_NoAuthorizer_0_Uagufs/http_credentials"
--http_heartbeat_interval="30secs" --initialize_driver_logging="true" --isolation="posix/cpu,posix/mem"
--launcher="posix" --launcher_dir="/mesos/mesos-1.3.1/_build/src" --logbufsecs="0" --logging_level="INFO"
--max_completed_executors_per_framework="150" --oversubscribed_resources_interval="15secs"
--perf_duration="10secs" --perf_interval="1mins" --port="5051" --qos_correction_interval_min="0ns"
--quiet="false" --recover="reconnect" --recovery_timeout="15mins" --registration_backoff_factor="10ms"
--resources="cpus:2;gpus:0;mem:1024;disk:1024;ports:[31000-32000]" --revocable_cpu_low_priority="true"
--runtime_dir="/tmp/Endpoint_SlaveEndpointTest_NoAuthorizer_0_Uagufs" --sandbox_directory="/mnt/mesos/sandbox"
--strict="true" --switch_user="true" --systemd_enable_support="true" --systemd_runtime_directory="/run/systemd/system"
--version="false" --work_dir="/tmp/Endpoint_SlaveEndpointTest_NoAuthorizer_0_8NLn1A"
I0729 02:33:03.774891 14868 credentials.hpp:86] Loading credential for authentication from
'/tmp/Endpoint_SlaveEndpointTest_NoAuthorizer_0_Uagufs/credential'
I0729 02:33:03.775144 14868 slave.cpp:264] Agent using credential for: test-principal
I0729 02:33:03.775171 14868 credentials.hpp:37] Loading credentials for authentication from
'/tmp/Endpoint_SlaveEndpointTest_NoAuthorizer_0_Uagufs/http_credentials'
I0729 02:33:03.775580 14868 http.cpp:975] Creating default 'basic' HTTP authenticator for
realm 'mesos-agent-executor'
I0729 02:33:03.775787 14868 http.cpp:996] Creating default 'jwt' HTTP authenticator for realm
'mesos-agent-executor'
I0729 02:33:03.776011 14868 http.cpp:975] Creating default 'basic' HTTP authenticator for
realm 'mesos-agent-readonly'
I0729 02:33:03.776121 14868 http.cpp:996] Creating default 'jwt' HTTP authenticator for realm
'mesos-agent-readonly'
I0729 02:33:03.776298 14868 http.cpp:975] Creating default 'basic' HTTP authenticator for
realm 'mesos-agent-readwrite'
I0729 02:33:03.776393 14868 http.cpp:996] Creating default 'jwt' HTTP authenticator for realm
'mesos-agent-readwrite'
I0729 02:33:03.778615 14868 slave.cpp:531] Agent resources: cpus(*):2; mem(*):1024; disk(*):1024;
ports(*):[31000-32000]
I0729 02:33:03.778779 14868 slave.cpp:539] Agent attributes: [  ]
I0729 02:33:03.778800 14868 slave.cpp:544] Agent hostname: a495dfcb5ddf
I0729 02:33:03.779016 14871 status_update_manager.cpp:177] Pausing sending status updates
I0729 02:33:03.781316 14868 state.cpp:62] Recovering state from '/tmp/Endpoint_SlaveEndpointTest_NoAuthorizer_0_8NLn1A/meta'
I0729 02:33:03.782096 14868 status_update_manager.cpp:203] Recovering status update manager
I0729 02:33:03.782330 14868 containerizer.cpp:608] Recovering containerizer
I0729 02:33:03.785214 14868 provisioner.cpp:410] Provisioner recovery complete
I0729 02:33:03.786046 14868 slave.cpp:6075] Finished recovery
I0729 02:33:03.787264 14868 slave.cpp:6257] Querying resource estimator for oversubscribable
resources
I0729 02:33:03.787761 14871 slave.cpp:6271] Received oversubscribable resources {} from the
resource estimator
I0729 02:33:03.792966 14867 process.cpp:3741] Handling HTTP event for process 'slave(750)'
with path: '/slave(750)/monitor/statistics'
I0729 02:33:03.796428 14867 http.cpp:1115] HTTP GET for /slave(750)/monitor/statistics from
172.17.0.4:37376
I0729 02:33:03.796557 14867 http.cpp:936] Authorizing principal 'test-principal' to GET the
'/monitor/statistics' endpoint
I0729 02:33:03.803516 14869 slave.cpp:796] Agent terminating
[       OK ] Endpoint/SlaveEndpointTest.NoAuthorizer/0 (49 ms)
[ RUN      ] Endpoint/SlaveEndpointTest.NoAuthorizer/1
I0729 02:33:03.817591 32092 containerizer.cpp:221] Using isolation: posix/cpu,posix/mem,filesystem/posix,network/cni
W0729 02:33:03.818418 32092 backend.cpp:76] Failed to create 'overlay' backend: OverlayBackend
requires root privileges
W0729 02:33:03.818598 32092 backend.cpp:76] Failed to create 'bind' backend: BindBackend requires
root privileges
I0729 02:33:03.818645 32092 provisioner.cpp:249] Using default backend 'copy'
I0729 02:33:03.820762 32092 cluster.cpp:448] Creating default 'local' authorizer
I0729 02:33:03.824616 14869 slave.cpp:231] Mesos agent started on (751)@172.17.0.4:42647
I0729 02:33:03.824659 14869 slave.cpp:232] Flags at startup: --acls="" --appc_simple_discovery_uri_prefix="http://"
--appc_store_dir="/tmp/mesos/store/appc" --authenticate_http_executors="true" --authenticate_http_readonly="true"
--authenticate_http_readwrite="true" --authenticatee="crammd5" --authentication_backoff_factor="1secs"
--authorizer="local" --cgroups_cpu_enable_pids_and_tids_count="false" --cgroups_enable_cfs="false"
--cgroups_hierarchy="/sys/fs/cgroup" --cgroups_limit_swap="false" --cgroups_root="mesos" --container_disk_watch_interval="15secs"
--containerizers="mesos" --credential="/tmp/Endpoint_SlaveEndpointTest_NoAuthorizer_1_sYo3AT/credential"
--default_role="*" --disk_watch_interval="1mins" --docker="docker" --docker_kill_orphans="true"
--docker_registry="https://registry-1.docker.io" --docker_remove_delay="6hrs" --docker_socket="/var/run/docker.sock"
--docker_stop_timeout="0ns" --docker_store_dir="/tmp/mesos/store/docker" --docker_volume_checkpoint_dir="/var/run/mesos/isolators/docker/volume"
--enforce_container_disk_quota="false" --executor_registration_timeout="1mins" --executor_reregistration_timeout="2secs"
--executor_secret_key="/tmp/Endpoint_SlaveEndpointTest_NoAuthorizer_1_sYo3AT/executor_secret_key"
--executor_shutdown_grace_period="5secs" --fetcher_cache_dir="/tmp/Endpoint_SlaveEndpointTest_NoAuthorizer_1_sYo3AT/fetch"
--fetcher_cache_size="2GB" --frameworks_home="" --gc_delay="1weeks" --gc_disk_headroom="0.1"
--hadoop_home="" --help="false" --hostname_lookup="true" --http_command_executor="false" --http_credentials="/tmp/Endpoint_SlaveEndpointTest_NoAuthorizer_1_sYo3AT/http_credentials"
--http_heartbeat_interval="30secs" --initialize_driver_logging="true" --isolation="posix/cpu,posix/mem"
--launcher="posix" --launcher_dir="/mesos/mesos-1.3.1/_build/src" --logbufsecs="0" --logging_level="INFO"
--max_completed_executors_per_framework="150" --oversubscribed_resources_interval="15secs"
--perf_duration="10secs" --perf_interval="1mins" --port="5051" --qos_correction_interval_min="0ns"
--quiet="false" --recover="reconnect" --recovery_timeout="15mins" --registration_backoff_factor="10ms"
--resources="cpus:2;gpus:0;mem:1024;disk:1024;ports:[31000-32000]" --revocable_cpu_low_priority="true"
--runtime_dir="/tmp/Endpoint_SlaveEndpointTest_NoAuthorizer_1_sYo3AT" --sandbox_directory="/mnt/mesos/sandbox"
--strict="true" --switch_user="true" --systemd_enable_support="true" --systemd_runtime_directory="/run/systemd/system"
--version="false" --work_dir="/tmp/Endpoint_SlaveEndpointTest_NoAuthorizer_1_09gXe2"
I0729 02:33:03.825342 14869 credentials.hpp:86] Loading credential for authentication from
'/tmp/Endpoint_SlaveEndpointTest_NoAuthorizer_1_sYo3AT/credential'
I0729 02:33:03.825593 14869 slave.cpp:264] Agent using credential for: test-principal
I0729 02:33:03.825623 14869 credentials.hpp:37] Loading credentials for authentication from
'/tmp/Endpoint_SlaveEndpointTest_NoAuthorizer_1_sYo3AT/http_credentials'
I0729 02:33:03.826035 14869 http.cpp:975] Creating default 'basic' HTTP authenticator for
realm 'mesos-agent-executor'
I0729 02:33:03.826216 14869 http.cpp:996] Creating default 'jwt' HTTP authenticator for realm
'mesos-agent-executor'
I0729 02:33:03.826426 14869 http.cpp:975] Creating default 'basic' HTTP authenticator for
realm 'mesos-agent-readonly'
I0729 02:33:03.826529 14869 http.cpp:996] Creating default 'jwt' HTTP authenticator for realm
'mesos-agent-readonly'
I0729 02:33:03.826694 14869 http.cpp:975] Creating default 'basic' HTTP authenticator for
realm 'mesos-agent-readwrite'
I0729 02:33:03.826781 14869 http.cpp:996] Creating default 'jwt' HTTP authenticator for realm
'mesos-agent-readwrite'
I0729 02:33:03.829401 14869 slave.cpp:531] Agent resources: cpus(*):2; mem(*):1024; disk(*):1024;
ports(*):[31000-32000]
I0729 02:33:03.829555 14869 slave.cpp:539] Agent attributes: [  ]
I0729 02:33:03.829576 14869 slave.cpp:544] Agent hostname: a495dfcb5ddf
I0729 02:33:03.829926 14870 status_update_manager.cpp:177] Pausing sending status updates
I0729 02:33:03.831944 14872 state.cpp:62] Recovering state from '/tmp/Endpoint_SlaveEndpointTest_NoAuthorizer_1_09gXe2/meta'
I0729 02:33:03.832605 14868 status_update_manager.cpp:203] Recovering status update manager
I0729 02:33:03.832864 14870 containerizer.cpp:608] Recovering containerizer
I0729 02:33:03.835304 14871 provisioner.cpp:410] Provisioner recovery complete
I0729 02:33:03.836158 14871 slave.cpp:6075] Finished recovery
I0729 02:33:03.836763 14871 slave.cpp:6257] Querying resource estimator for oversubscribable
resources
I0729 02:33:03.837777 14871 slave.cpp:6271] Received oversubscribable resources {} from the
resource estimator
I0729 02:33:03.841492 14871 process.cpp:3741] Handling HTTP event for process 'slave(751)'
with path: '/slave(751)/monitor/statistics.json'
I0729 02:33:03.844607 14874 http.cpp:1115] HTTP GET for /slave(751)/monitor/statistics.json
from 172.17.0.4:37378
I0729 02:33:03.844732 14874 http.cpp:936] Authorizing principal 'test-principal' to GET the
'/monitor/statistics.json' endpoint
I0729 02:33:03.861460 14874 slave.cpp:796] Agent terminating
[       OK ] Endpoint/SlaveEndpointTest.NoAuthorizer/1 (58 ms)
[ RUN      ] Endpoint/SlaveEndpointTest.NoAuthorizer/2
I0729 02:33:03.876163 32092 containerizer.cpp:221] Using isolation: posix/cpu,posix/mem,filesystem/posix,network/cni
W0729 02:33:03.876969 32092 backend.cpp:76] Failed to create 'overlay' backend: OverlayBackend
requires root privileges
W0729 02:33:03.877152 32092 backend.cpp:76] Failed to create 'bind' backend: BindBackend requires
root privileges
I0729 02:33:03.877200 32092 provisioner.cpp:249] Using default backend 'copy'
I0729 02:33:03.879314 32092 cluster.cpp:448] Creating default 'local' authorizer
I0729 02:33:03.881975 14871 slave.cpp:231] Mesos agent started on (752)@172.17.0.4:42647
I0729 02:33:03.882016 14871 slave.cpp:232] Flags at startup: --acls="" --appc_simple_discovery_uri_prefix="http://"
--appc_store_dir="/tmp/mesos/store/appc" --authenticate_http_executors="true" --authenticate_http_readonly="true"
--authenticate_http_readwrite="true" --authenticatee="crammd5" --authentication_backoff_factor="1secs"
--authorizer="local" --cgroups_cpu_enable_pids_and_tids_count="false" --cgroups_enable_cfs="false"
--cgroups_hierarchy="/sys/fs/cgroup" --cgroups_limit_swap="false" --cgroups_root="mesos" --container_disk_watch_interval="15secs"
--containerizers="mesos" --credential="/tmp/Endpoint_SlaveEndpointTest_NoAuthorizer_2_YgAdxl/credential"
--default_role="*" --disk_watch_interval="1mins" --docker="docker" --docker_kill_orphans="true"
--docker_registry="https://registry-1.docker.io" --docker_remove_delay="6hrs" --docker_socket="/var/run/docker.sock"
--docker_stop_timeout="0ns" --docker_store_dir="/tmp/mesos/store/docker" --docker_volume_checkpoint_dir="/var/run/mesos/isolators/docker/volume"
--enforce_container_disk_quota="false" --executor_registration_timeout="1mins" --executor_reregistration_timeout="2secs"
--executor_secret_key="/tmp/Endpoint_SlaveEndpointTest_NoAuthorizer_2_YgAdxl/executor_secret_key"
--executor_shutdown_grace_period="5secs" --fetcher_cache_dir="/tmp/Endpoint_SlaveEndpointTest_NoAuthorizer_2_YgAdxl/fetch"
--fetcher_cache_size="2GB" --frameworks_home="" --gc_delay="1weeks" --gc_disk_headroom="0.1"
--hadoop_home="" --help="false" --hostname_lookup="true" --http_command_executor="false" --http_credentials="/tmp/Endpoint_SlaveEndpointTest_NoAuthorizer_2_YgAdxl/http_credentials"
--http_heartbeat_interval="30secs" --initialize_driver_logging="true" --isolation="posix/cpu,posix/mem"
--launcher="posix" --launcher_dir="/mesos/mesos-1.3.1/_build/src" --logbufsecs="0" --logging_level="INFO"
--max_completed_executors_per_framework="150" --oversubscribed_resources_interval="15secs"
--perf_duration="10secs" --perf_interval="1mins" --port="5051" --qos_correction_interval_min="0ns"
--quiet="false" --recover="reconnect" --recovery_timeout="15mins" --registration_backoff_factor="10ms"
--resources="cpus:2;gpus:0;mem:1024;disk:1024;ports:[31000-32000]" --revocable_cpu_low_priority="true"
--runtime_dir="/tmp/Endpoint_SlaveEndpointTest_NoAuthorizer_2_YgAdxl" --sandbox_directory="/mnt/mesos/sandbox"
--strict="true" --switch_user="true" --systemd_enable_support="true" --systemd_runtime_directory="/run/systemd/system"
--version="false" --work_dir="/tmp/Endpoint_SlaveEndpointTest_NoAuthorizer_2_4zJC1t"
I0729 02:33:03.882730 14871 credentials.hpp:86] Loading credential for authentication from
'/tmp/Endpoint_SlaveEndpointTest_NoAuthorizer_2_YgAdxl/credential'
I0729 02:33:03.882982 14871 slave.cpp:264] Agent using credential for: test-principal
I0729 02:33:03.883010 14871 credentials.hpp:37] Loading credentials for authentication from
'/tmp/Endpoint_SlaveEndpointTest_NoAuthorizer_2_YgAdxl/http_credentials'
I0729 02:33:03.883457 14871 http.cpp:975] Creating default 'basic' HTTP authenticator for
realm 'mesos-agent-executor'
I0729 02:33:03.883664 14871 http.cpp:996] Creating default 'jwt' HTTP authenticator for realm
'mesos-agent-executor'
I0729 02:33:03.883970 14871 http.cpp:975] Creating default 'basic' HTTP authenticator for
realm 'mesos-agent-readonly'
I0729 02:33:03.884096 14871 http.cpp:996] Creating default 'jwt' HTTP authenticator for realm
'mesos-agent-readonly'
I0729 02:33:03.884340 14871 http.cpp:975] Creating default 'basic' HTTP authenticator for
realm 'mesos-agent-readwrite'
I0729 02:33:03.884450 14871 http.cpp:996] Creating default 'jwt' HTTP authenticator for realm
'mesos-agent-readwrite'
I0729 02:33:03.886720 14871 slave.cpp:531] Agent resources: cpus(*):2; mem(*):1024; disk(*):1024;
ports(*):[31000-32000]
I0729 02:33:03.886873 14871 slave.cpp:539] Agent attributes: [  ]
I0729 02:33:03.886894 14871 slave.cpp:544] Agent hostname: a495dfcb5ddf
I0729 02:33:03.887151 14867 status_update_manager.cpp:177] Pausing sending status updates
I0729 02:33:03.889122 14867 state.cpp:62] Recovering state from '/tmp/Endpoint_SlaveEndpointTest_NoAuthorizer_2_4zJC1t/meta'
I0729 02:33:03.889721 14871 status_update_manager.cpp:203] Recovering status update manager
I0729 02:33:03.890015 14867 containerizer.cpp:608] Recovering containerizer
I0729 02:33:03.892073 14873 provisioner.cpp:410] Provisioner recovery complete
I0729 02:33:03.892647 14867 slave.cpp:6075] Finished recovery
I0729 02:33:03.893564 14867 slave.cpp:6257] Querying resource estimator for oversubscribable
resources
I0729 02:33:03.893972 14873 slave.cpp:6271] Received oversubscribable resources {} from the
resource estimator
I0729 02:33:03.897858 14874 process.cpp:3741] Handling HTTP event for process 'slave(752)'
with path: '/slave(752)/containers'
I0729 02:33:03.900791 14874 http.cpp:1115] HTTP GET for /slave(752)/containers from 172.17.0.4:37380
I0729 02:33:03.900910 14874 http.cpp:936] Authorizing principal 'test-principal' to GET the
'/containers' endpoint
I0729 02:33:03.907217 14872 slave.cpp:796] Agent terminating
[       OK ] Endpoint/SlaveEndpointTest.NoAuthorizer/2 (45 ms)
[----------] 9 tests from Endpoint/SlaveEndpointTest (448 ms total)

[----------] Global test environment tear-down
[==========] 1578 tests from 177 test cases ran. (729556 ms total)
[  PASSED  ] 1574 tests.
[  FAILED  ] 4 tests, listed below:
[  FAILED  ] CommandExecutorCheckTest.CommandCheckDeliveredAndReconciled
[  FAILED  ] DefaultExecutorCheckTest.CommandCheckDeliveredAndReconciled
[  FAILED  ] DefaultExecutorCheckTest.CommandCheckStatusChange
[  FAILED  ] DefaultExecutorCheckTest.CommandCheckTimeout

 4 FAILED TESTS
  YOU HAVE 22 DISABLED TESTS

E0729 02:33:04.045599 14875 process.cpp:956] Failed to accept socket: future discarded
make[4]: *** [check-local] Error 1
make[4]: Leaving directory `/mesos/mesos-1.3.1/_build/src'
make[3]: *** [check-am] Error 2
make[3]: Leaving directory `/mesos/mesos-1.3.1/_build/src'
make[2]: *** [check] Error 2
make[2]: Leaving directory `/mesos/mesos-1.3.1/_build/src'
make[1]: *** [check-recursive] Error 1
make[1]: Leaving directory `/mesos/mesos-1.3.1/_build'
make: *** [distcheck] Error 1
+ docker rmi mesos-1501289309-23413
Untagged: mesos-1501289309-23413:latest
Deleted: sha256:677f535c46d99f45c6591bf0323f556c5e8f1597e0aa530d4e99aa675269c3f5
Deleted: sha256:a76abcd684a5030a5d64804f27b530c6ee056a417f0f9c7301502f04c0118942
Deleted: sha256:4e96a2d1a18645967ccb072b7f605bd9f9450702973ee4d52ca84d991f4ce467
Deleted: sha256:6482121ab9f6b0bdb6f2709c040ccf3103f398dba51ab5b47f603c330c1809b1
Deleted: sha256:b62d157000eb9985c5f3898aaf22e258c1db989807d004f1f5bc67df049a8697
Deleted: sha256:ce16ad956acc50c9aa13f80a3e6a3136b6a42dc92a301463bdf2767d75834b64
Deleted: sha256:e2c436c5e29e6706191215f8c67c8803f2f0dbf7c4f383146c9ba77a860cf310
Deleted: sha256:caa605b75ad288d22752919c5bb5cdd11d6d949c8dc1bddc126c078d860ac76c
Deleted: sha256:8b54b6cd4d485c25f6dc8a819659c780960aa4882e65d62645c873e859ee30d2
Deleted: sha256:fe6d877b1824f8b811df4bd8bfd046bdc226711eb4db9f8c1eb79c7561985b4e
Deleted: sha256:078a70673338da6a840c65cd181cc20e143329d8edef61a1f9d01e4a9add0722
Deleted: sha256:a34fac0be74802a509047c1048930207747ce7ad1f3aa97ff3e42103fe587ad5
Deleted: sha256:ac3990a7581ecdf62a1618d255ccc86646406771d2dbb5531a57b68f4d33fc01
Deleted: sha256:0e28038e20489e79d97ff023297fded07609c163e6113b3cb4114ffd918598ee
Deleted: sha256:f1d77cdecfeba78760c3faffab2aa19286d54535a5ab5ca1fdc21cc8e5bb4d04
Deleted: sha256:193abcc2635c080c1c205ff5eba9f4376c336996464cbc9b9644b7813eb622df
Deleted: sha256:dfe879e826528e8421793178cb4d1197c1a7f7968040363b3728e7b8c62bb06f
Deleted: sha256:b5693c837507f61f01e49b76620eb85d57ac4116a2a327a6796a570624abdae3
Deleted: sha256:306a56f1fc6bfac6bc5a4422233e39ba7c29bde1e45596e81ecaae3b03ad1982
Deleted: sha256:ec68c5fd43df39b2597f40dd908d8997ae9a117b9ef6b1be93386389b5968900
Deleted: sha256:7399e89d4f56ff26f1e34c091b41a6db0498910a946f56fadd8e8212750b6a81
Deleted: sha256:b90e60060ca76b5f522d0323b1cb42e9807f75d858f5ae1ac9bdad6c5fc1f64c
Deleted: sha256:71434fbc0a121709c66fb0067e9e897d1c4a14ab888177b0009e604ee389cd2d
Deleted: sha256:67bf66177e75388eb1c102589136d4bc5e4b38fe6098635a83c49a85405253c7
Build step 'Execute shell' marked build as failure
Not sending mail to unregistered user songzihao1990@gmail.com

Mime
View raw message