mesos-builds mailing list archives

Site index · List index
Message view « Date » · « Thread »
Top « Date » · « Thread »
From Apache Jenkins Server <jenk...@builds.apache.org>
Subject Build failed in Jenkins: Mesos-Buildbot » cmake,gcc,--verbose,GLOG_v=1 MESOS_VERBOSE=1,centos:7,(ubuntu)&&(!ubuntu-us1)&&(!ubuntu-eu2) #3897
Date Tue, 11 Jul 2017 10:34:08 GMT
See <https://builds.apache.org/job/Mesos-Buildbot/BUILDTOOL=cmake,COMPILER=gcc,CONFIGURATION=--verbose,ENVIRONMENT=GLOG_v=1%20MESOS_VERBOSE=1,OS=centos%3A7,label_exp=(ubuntu)&&(!ubuntu-us1)&&(!ubuntu-eu2)/3897/display/redirect>

------------------------------------------
[...truncated 27.43 MB...]
I0711 10:34:03.725853 31519 http.cpp:937] Authorizing principal 'test-principal' to GET the
'/monitor/statistics.json' endpoint
I0711 10:34:03.729053 31522 slave.cpp:839] Agent terminating
[       OK ] Endpoint/SlaveEndpointTest.AuthorizedRequest/1 (29 ms)
[ RUN      ] Endpoint/SlaveEndpointTest.AuthorizedRequest/2
I0711 10:34:03.740773 31507 containerizer.cpp:230] Using isolation: posix/cpu,posix/mem,filesystem/posix,network/cni,environment_secret
W0711 10:34:03.741297 31507 backend.cpp:76] Failed to create 'aufs' backend: AufsBackend requires
root privileges
W0711 10:34:03.741389 31507 backend.cpp:76] Failed to create 'bind' backend: BindBackend requires
root privileges
I0711 10:34:03.741430 31507 provisioner.cpp:255] Using default backend 'copy'
I0711 10:34:03.744773 31529 slave.cpp:250] Mesos agent started on (772)@172.17.0.4:45651
I0711 10:34:03.744798 31529 slave.cpp:251] Flags at startup: --acls="" --appc_simple_discovery_uri_prefix="http://"
--appc_store_dir="/tmp/Endpoint_SlaveEndpointTest_AuthorizedRequest_2_rIrXye/store/appc" --authenticate_http_readonly="true"
--authenticate_http_readwrite="true" --authenticatee="crammd5" --authentication_backoff_factor="1secs"
--authorizer="local" --cgroups_cpu_enable_pids_and_tids_count="false" --cgroups_enable_cfs="false"
--cgroups_hierarchy="/sys/fs/cgroup" --cgroups_limit_swap="false" --cgroups_root="mesos" --container_disk_watch_interval="15secs"
--containerizers="mesos" --credential="/tmp/Endpoint_SlaveEndpointTest_AuthorizedRequest_2_rIrXye/credential"
--default_role="*" --disk_watch_interval="1mins" --docker="docker" --docker_kill_orphans="true"
--docker_registry="https://registry-1.docker.io" --docker_remove_delay="6hrs" --docker_socket="/var/run/docker.sock"
--docker_stop_timeout="0ns" --docker_store_dir="/tmp/Endpoint_SlaveEndpointTest_AuthorizedRequest_2_rIrXye/store/docker"
--docker_volume_checkpoint_dir="/var/run/mesos/isolators/docker/volume" --enforce_container_disk_quota="false"
--executor_registration_timeout="1mins" --executor_reregistration_timeout="2secs" --executor_shutdown_grace_period="5secs"
--fetcher_cache_dir="/tmp/Endpoint_SlaveEndpointTest_AuthorizedRequest_2_rIrXye/fetch" --fetcher_cache_size="2GB"
--frameworks_home="" --gc_delay="1weeks" --gc_disk_headroom="0.1" --hadoop_home="" --help="false"
--hostname_lookup="true" --http_command_executor="false" --http_credentials="/tmp/Endpoint_SlaveEndpointTest_AuthorizedRequest_2_rIrXye/http_credentials"
--http_heartbeat_interval="30secs" --initialize_driver_logging="true" --isolation="posix/cpu,posix/mem"
--launcher="posix" --launcher_dir="/mesos/build/src" --logbufsecs="0" --logging_level="INFO"
--max_completed_executors_per_framework="150" --oversubscribed_resources_interval="15secs"
--perf_duration="10secs" --perf_interval="1mins" --port="5051" --qos_correction_interval_min="0ns"
--quiet="false" --recover="reconnect" --recovery_timeout="15mins" --registration_backoff_factor="10ms"
--resources="cpus:2;gpus:0;mem:1024;disk:1024;ports:[31000-32000]" --revocable_cpu_low_priority="true"
--runtime_dir="/tmp/Endpoint_SlaveEndpointTest_AuthorizedRequest_2_rIrXye" --sandbox_directory="/mnt/mesos/sandbox"
--strict="true" --switch_user="true" --systemd_enable_support="true" --systemd_runtime_directory="/run/systemd/system"
--version="false" --work_dir="/tmp/Endpoint_SlaveEndpointTest_AuthorizedRequest_2_uNbAmO"
I0711 10:34:03.745223 31529 credentials.hpp:86] Loading credential for authentication from
'/tmp/Endpoint_SlaveEndpointTest_AuthorizedRequest_2_rIrXye/credential'
I0711 10:34:03.745365 31529 slave.cpp:283] Agent using credential for: test-principal
I0711 10:34:03.745380 31529 credentials.hpp:37] Loading credentials for authentication from
'/tmp/Endpoint_SlaveEndpointTest_AuthorizedRequest_2_rIrXye/http_credentials'
I0711 10:34:03.745580 31529 http.cpp:976] Creating default 'basic' HTTP authenticator for
realm 'mesos-agent-readonly'
I0711 10:34:03.745710 31529 http.cpp:976] Creating default 'basic' HTTP authenticator for
realm 'mesos-agent-readwrite'
I0711 10:34:03.747215 31529 slave.cpp:565] Agent resources: [{"name":"cpus","scalar":{"value":2.0},"type":"SCALAR"},{"name":"mem","scalar":{"value":1024.0},"type":"SCALAR"},{"name":"disk","scalar":{"value":1024.0},"type":"SCALAR"},{"name":"ports","ranges":{"range":[{"begin":31000,"end":32000}]},"type":"RANGES"}]
I0711 10:34:03.747398 31529 slave.cpp:573] Agent attributes: [  ]
I0711 10:34:03.747408 31529 slave.cpp:578] Agent hostname: 735425c1d315
I0711 10:34:03.747530 31519 status_update_manager.cpp:177] Pausing sending status updates
I0711 10:34:03.748785 31518 state.cpp:64] Recovering state from '/tmp/Endpoint_SlaveEndpointTest_AuthorizedRequest_2_uNbAmO/meta'
I0711 10:34:03.749008 31530 status_update_manager.cpp:203] Recovering status update manager
I0711 10:34:03.749361 31522 containerizer.cpp:582] Recovering containerizer
I0711 10:34:03.751140 31516 provisioner.cpp:416] Provisioner recovery complete
I0711 10:34:03.751711 31530 slave.cpp:6203] Finished recovery
I0711 10:34:03.752187 31530 slave.cpp:6385] Querying resource estimator for oversubscribable
resources
I0711 10:34:03.752470 31531 slave.cpp:6399] Received oversubscribable resources {} from the
resource estimator
I0711 10:34:03.754509 31516 process.cpp:3820] Handling HTTP event for process 'slave(772)'
with path: '/slave(772)/containers'
I0711 10:34:03.755596 31517 http.cpp:1116] HTTP GET for /slave(772)/containers from 172.17.0.4:32986
I0711 10:34:03.755681 31517 http.cpp:937] Authorizing principal 'test-principal' to GET the
'/containers' endpoint
I0711 10:34:03.759272 31519 slave.cpp:839] Agent terminating
[       OK ] Endpoint/SlaveEndpointTest.AuthorizedRequest/2 (29 ms)
[ RUN      ] Endpoint/SlaveEndpointTest.UnauthorizedRequest/0
I0711 10:34:03.769958 31507 containerizer.cpp:230] Using isolation: posix/cpu,posix/mem,filesystem/posix,network/cni,environment_secret
W0711 10:34:03.770450 31507 backend.cpp:76] Failed to create 'aufs' backend: AufsBackend requires
root privileges
W0711 10:34:03.770539 31507 backend.cpp:76] Failed to create 'bind' backend: BindBackend requires
root privileges
I0711 10:34:03.770562 31507 provisioner.cpp:255] Using default backend 'copy'
I0711 10:34:03.773768 31526 slave.cpp:250] Mesos agent started on (773)@172.17.0.4:45651
I0711 10:34:03.773783 31526 slave.cpp:251] Flags at startup: --acls="" --appc_simple_discovery_uri_prefix="http://"
--appc_store_dir="/tmp/Endpoint_SlaveEndpointTest_UnauthorizedRequest_0_DDHpBV/store/appc"
--authenticate_http_readonly="true" --authenticate_http_readwrite="true" --authenticatee="crammd5"
--authentication_backoff_factor="1secs" --authorizer="local" --cgroups_cpu_enable_pids_and_tids_count="false"
--cgroups_enable_cfs="false" --cgroups_hierarchy="/sys/fs/cgroup" --cgroups_limit_swap="false"
--cgroups_root="mesos" --container_disk_watch_interval="15secs" --containerizers="mesos" --credential="/tmp/Endpoint_SlaveEndpointTest_UnauthorizedRequest_0_DDHpBV/credential"
--default_role="*" --disk_watch_interval="1mins" --docker="docker" --docker_kill_orphans="true"
--docker_registry="https://registry-1.docker.io" --docker_remove_delay="6hrs" --docker_socket="/var/run/docker.sock"
--docker_stop_timeout="0ns" --docker_store_dir="/tmp/Endpoint_SlaveEndpointTest_UnauthorizedRequest_0_DDHpBV/store/docker"
--docker_volume_checkpoint_dir="/var/run/mesos/isolators/docker/volume" --enforce_container_disk_quota="false"
--executor_registration_timeout="1mins" --executor_reregistration_timeout="2secs" --executor_shutdown_grace_period="5secs"
--fetcher_cache_dir="/tmp/Endpoint_SlaveEndpointTest_UnauthorizedRequest_0_DDHpBV/fetch" --fetcher_cache_size="2GB"
--frameworks_home="" --gc_delay="1weeks" --gc_disk_headroom="0.1" --hadoop_home="" --help="false"
--hostname_lookup="true" --http_command_executor="false" --http_credentials="/tmp/Endpoint_SlaveEndpointTest_UnauthorizedRequest_0_DDHpBV/http_credentials"
--http_heartbeat_interval="30secs" --initialize_driver_logging="true" --isolation="posix/cpu,posix/mem"
--launcher="posix" --launcher_dir="/mesos/build/src" --logbufsecs="0" --logging_level="INFO"
--max_completed_executors_per_framework="150" --oversubscribed_resources_interval="15secs"
--perf_duration="10secs" --perf_interval="1mins" --port="5051" --qos_correction_interval_min="0ns"
--quiet="false" --recover="reconnect" --recovery_timeout="15mins" --registration_backoff_factor="10ms"
--resources="cpus:2;gpus:0;mem:1024;disk:1024;ports:[31000-32000]" --revocable_cpu_low_priority="true"
--runtime_dir="/tmp/Endpoint_SlaveEndpointTest_UnauthorizedRequest_0_DDHpBV" --sandbox_directory="/mnt/mesos/sandbox"
--strict="true" --switch_user="true" --systemd_enable_support="true" --systemd_runtime_directory="/run/systemd/system"
--version="false" --work_dir="/tmp/Endpoint_SlaveEndpointTest_UnauthorizedRequest_0_C3REkv"
I0711 10:34:03.774197 31526 credentials.hpp:86] Loading credential for authentication from
'/tmp/Endpoint_SlaveEndpointTest_UnauthorizedRequest_0_DDHpBV/credential'
I0711 10:34:03.774320 31526 slave.cpp:283] Agent using credential for: test-principal
I0711 10:34:03.774336 31526 credentials.hpp:37] Loading credentials for authentication from
'/tmp/Endpoint_SlaveEndpointTest_UnauthorizedRequest_0_DDHpBV/http_credentials'
I0711 10:34:03.774523 31526 http.cpp:976] Creating default 'basic' HTTP authenticator for
realm 'mesos-agent-readonly'
I0711 10:34:03.774708 31526 http.cpp:976] Creating default 'basic' HTTP authenticator for
realm 'mesos-agent-readwrite'
I0711 10:34:03.775972 31526 slave.cpp:565] Agent resources: [{"name":"cpus","scalar":{"value":2.0},"type":"SCALAR"},{"name":"mem","scalar":{"value":1024.0},"type":"SCALAR"},{"name":"disk","scalar":{"value":1024.0},"type":"SCALAR"},{"name":"ports","ranges":{"range":[{"begin":31000,"end":32000}]},"type":"RANGES"}]
I0711 10:34:03.776154 31526 slave.cpp:573] Agent attributes: [  ]
I0711 10:34:03.776162 31526 slave.cpp:578] Agent hostname: 735425c1d315
I0711 10:34:03.776268 31516 status_update_manager.cpp:177] Pausing sending status updates
I0711 10:34:03.777467 31519 state.cpp:64] Recovering state from '/tmp/Endpoint_SlaveEndpointTest_UnauthorizedRequest_0_C3REkv/meta'
I0711 10:34:03.777788 31521 status_update_manager.cpp:203] Recovering status update manager
I0711 10:34:03.777977 31530 containerizer.cpp:582] Recovering containerizer
I0711 10:34:03.779402 31510 provisioner.cpp:416] Provisioner recovery complete
I0711 10:34:03.779803 31509 slave.cpp:6203] Finished recovery
I0711 10:34:03.780236 31509 slave.cpp:6385] Querying resource estimator for oversubscribable
resources
I0711 10:34:03.780498 31530 slave.cpp:6399] Received oversubscribable resources {} from the
resource estimator
I0711 10:34:03.782564 31529 process.cpp:3820] Handling HTTP event for process 'slave(773)'
with path: '/slave(773)/monitor/statistics'
I0711 10:34:03.783684 31514 http.cpp:1116] HTTP GET for /slave(773)/monitor/statistics from
172.17.0.4:32988
I0711 10:34:03.783756 31514 http.cpp:937] Authorizing principal 'test-principal' to GET the
'/monitor/statistics' endpoint
I0711 10:34:03.786437 31520 slave.cpp:839] Agent terminating
[       OK ] Endpoint/SlaveEndpointTest.UnauthorizedRequest/0 (27 ms)
[ RUN      ] Endpoint/SlaveEndpointTest.UnauthorizedRequest/1
I0711 10:34:03.799588 31507 containerizer.cpp:230] Using isolation: posix/cpu,posix/mem,filesystem/posix,network/cni,environment_secret
W0711 10:34:03.800143 31507 backend.cpp:76] Failed to create 'aufs' backend: AufsBackend requires
root privileges
W0711 10:34:03.800254 31507 backend.cpp:76] Failed to create 'bind' backend: BindBackend requires
root privileges
I0711 10:34:03.800282 31507 provisioner.cpp:255] Using default backend 'copy'
I0711 10:34:03.804133 31521 slave.cpp:250] Mesos agent started on (774)@172.17.0.4:45651
I0711 10:34:03.804149 31521 slave.cpp:251] Flags at startup: --acls="" --appc_simple_discovery_uri_prefix="http://"
--appc_store_dir="/tmp/Endpoint_SlaveEndpointTest_UnauthorizedRequest_1_5MnyUC/store/appc"
--authenticate_http_readonly="true" --authenticate_http_readwrite="true" --authenticatee="crammd5"
--authentication_backoff_factor="1secs" --authorizer="local" --cgroups_cpu_enable_pids_and_tids_count="false"
--cgroups_enable_cfs="false" --cgroups_hierarchy="/sys/fs/cgroup" --cgroups_limit_swap="false"
--cgroups_root="mesos" --container_disk_watch_interval="15secs" --containerizers="mesos" --credential="/tmp/Endpoint_SlaveEndpointTest_UnauthorizedRequest_1_5MnyUC/credential"
--default_role="*" --disk_watch_interval="1mins" --docker="docker" --docker_kill_orphans="true"
--docker_registry="https://registry-1.docker.io" --docker_remove_delay="6hrs" --docker_socket="/var/run/docker.sock"
--docker_stop_timeout="0ns" --docker_store_dir="/tmp/Endpoint_SlaveEndpointTest_UnauthorizedRequest_1_5MnyUC/store/docker"
--docker_volume_checkpoint_dir="/var/run/mesos/isolators/docker/volume" --enforce_container_disk_quota="false"
--executor_registration_timeout="1mins" --executor_reregistration_timeout="2secs" --executor_shutdown_grace_period="5secs"
--fetcher_cache_dir="/tmp/Endpoint_SlaveEndpointTest_UnauthorizedRequest_1_5MnyUC/fetch" --fetcher_cache_size="2GB"
--frameworks_home="" --gc_delay="1weeks" --gc_disk_headroom="0.1" --hadoop_home="" --help="false"
--hostname_lookup="true" --http_command_executor="false" --http_credentials="/tmp/Endpoint_SlaveEndpointTest_UnauthorizedRequest_1_5MnyUC/http_credentials"
--http_heartbeat_interval="30secs" --initialize_driver_logging="true" --isolation="posix/cpu,posix/mem"
--launcher="posix" --launcher_dir="/mesos/build/src" --logbufsecs="0" --logging_level="INFO"
--max_completed_executors_per_framework="150" --oversubscribed_resources_interval="15secs"
--perf_duration="10secs" --perf_interval="1mins" --port="5051" --qos_correction_interval_min="0ns"
--quiet="false" --recover="reconnect" --recovery_timeout="15mins" --registration_backoff_factor="10ms"
--resources="cpus:2;gpus:0;mem:1024;disk:1024;ports:[31000-32000]" --revocable_cpu_low_priority="true"
--runtime_dir="/tmp/Endpoint_SlaveEndpointTest_UnauthorizedRequest_1_5MnyUC" --sandbox_directory="/mnt/mesos/sandbox"
--strict="true" --switch_user="true" --systemd_enable_support="true" --systemd_runtime_directory="/run/systemd/system"
--version="false" --work_dir="/tmp/Endpoint_SlaveEndpointTest_UnauthorizedRequest_1_0KNAzc"
I0711 10:34:03.804574 31521 credentials.hpp:86] Loading credential for authentication from
'/tmp/Endpoint_SlaveEndpointTest_UnauthorizedRequest_1_5MnyUC/credential'
I0711 10:34:03.804718 31521 slave.cpp:283] Agent using credential for: test-principal
I0711 10:34:03.804733 31521 credentials.hpp:37] Loading credentials for authentication from
'/tmp/Endpoint_SlaveEndpointTest_UnauthorizedRequest_1_5MnyUC/http_credentials'
I0711 10:34:03.804939 31521 http.cpp:976] Creating default 'basic' HTTP authenticator for
realm 'mesos-agent-readonly'
I0711 10:34:03.805083 31521 http.cpp:976] Creating default 'basic' HTTP authenticator for
realm 'mesos-agent-readwrite'
I0711 10:34:03.806354 31521 slave.cpp:565] Agent resources: [{"name":"cpus","scalar":{"value":2.0},"type":"SCALAR"},{"name":"mem","scalar":{"value":1024.0},"type":"SCALAR"},{"name":"disk","scalar":{"value":1024.0},"type":"SCALAR"},{"name":"ports","ranges":{"range":[{"begin":31000,"end":32000}]},"type":"RANGES"}]
I0711 10:34:03.806533 31521 slave.cpp:573] Agent attributes: [  ]
I0711 10:34:03.806542 31521 slave.cpp:578] Agent hostname: 735425c1d315
I0711 10:34:03.806702 31511 status_update_manager.cpp:177] Pausing sending status updates
I0711 10:34:03.808027 31523 state.cpp:64] Recovering state from '/tmp/Endpoint_SlaveEndpointTest_UnauthorizedRequest_1_0KNAzc/meta'
I0711 10:34:03.808406 31530 status_update_manager.cpp:203] Recovering status update manager
I0711 10:34:03.808657 31524 containerizer.cpp:582] Recovering containerizer
I0711 10:34:03.810026 31530 provisioner.cpp:416] Provisioner recovery complete
I0711 10:34:03.810431 31517 slave.cpp:6203] Finished recovery
I0711 10:34:03.810919 31517 slave.cpp:6385] Querying resource estimator for oversubscribable
resources
I0711 10:34:03.811137 31530 slave.cpp:6399] Received oversubscribable resources {} from the
resource estimator
I0711 10:34:03.813231 31518 process.cpp:3820] Handling HTTP event for process 'slave(774)'
with path: '/slave(774)/monitor/statistics.json'
I0711 10:34:03.814402 31512 http.cpp:1116] HTTP GET for /slave(774)/monitor/statistics.json
from 172.17.0.4:32991
I0711 10:34:03.814465 31512 http.cpp:937] Authorizing principal 'test-principal' to GET the
'/monitor/statistics.json' endpoint
I0711 10:34:03.816802 31516 slave.cpp:839] Agent terminating
[       OK ] Endpoint/SlaveEndpointTest.UnauthorizedRequest/1 (30 ms)
[ RUN      ] Endpoint/SlaveEndpointTest.UnauthorizedRequest/2
I0711 10:34:03.828089 31507 containerizer.cpp:230] Using isolation: posix/cpu,posix/mem,filesystem/posix,network/cni,environment_secret
W0711 10:34:03.828572 31507 backend.cpp:76] Failed to create 'aufs' backend: AufsBackend requires
root privileges
W0711 10:34:03.828662 31507 backend.cpp:76] Failed to create 'bind' backend: BindBackend requires
root privileges
I0711 10:34:03.828687 31507 provisioner.cpp:255] Using default backend 'copy'
I0711 10:34:03.833531 31509 slave.cpp:250] Mesos agent started on (775)@172.17.0.4:45651
I0711 10:34:03.833546 31509 slave.cpp:251] Flags at startup: --acls="" --appc_simple_discovery_uri_prefix="http://"
--appc_store_dir="/tmp/Endpoint_SlaveEndpointTest_UnauthorizedRequest_2_5C5Ivk/store/appc"
--authenticate_http_readonly="true" --authenticate_http_readwrite="true" --authenticatee="crammd5"
--authentication_backoff_factor="1secs" --authorizer="local" --cgroups_cpu_enable_pids_and_tids_count="false"
--cgroups_enable_cfs="false" --cgroups_hierarchy="/sys/fs/cgroup" --cgroups_limit_swap="false"
--cgroups_root="mesos" --container_disk_watch_interval="15secs" --containerizers="mesos" --credential="/tmp/Endpoint_SlaveEndpointTest_UnauthorizedRequest_2_5C5Ivk/credential"
--default_role="*" --disk_watch_interval="1mins" --docker="docker" --docker_kill_orphans="true"
--docker_registry="https://registry-1.docker.io" --docker_remove_delay="6hrs" --docker_socket="/var/run/docker.sock"
--docker_stop_timeout="0ns" --docker_store_dir="/tmp/Endpoint_SlaveEndpointTest_UnauthorizedRequest_2_5C5Ivk/store/docker"
--docker_volume_checkpoint_dir="/var/run/mesos/isolators/docker/volume" --enforce_container_disk_quota="false"
--executor_registration_timeout="1mins" --executor_reregistration_timeout="2secs" --executor_shutdown_grace_period="5secs"
--fetcher_cache_dir="/tmp/Endpoint_SlaveEndpointTest_UnauthorizedRequest_2_5C5Ivk/fetch" --fetcher_cache_size="2GB"
--frameworks_home="" --gc_delay="1weeks" --gc_disk_headroom="0.1" --hadoop_home="" --help="false"
--hostname_lookup="true" --http_command_executor="false" --http_credentials="/tmp/Endpoint_SlaveEndpointTest_UnauthorizedRequest_2_5C5Ivk/http_credentials"
--http_heartbeat_interval="30secs" --initialize_driver_logging="true" --isolation="posix/cpu,posix/mem"
--launcher="posix" --launcher_dir="/mesos/build/src" --logbufsecs="0" --logging_level="INFO"
--max_completed_executors_per_framework="150" --oversubscribed_resources_interval="15secs"
--perf_duration="10secs" --perf_interval="1mins" --port="5051" --qos_correction_interval_min="0ns"
--quiet="false" --recover="reconnect" --recovery_timeout="15mins" --registration_backoff_factor="10ms"
--resources="cpus:2;gpus:0;mem:1024;disk:1024;ports:[31000-32000]" --revocable_cpu_low_priority="true"
--runtime_dir="/tmp/Endpoint_SlaveEndpointTest_UnauthorizedRequest_2_5C5Ivk" --sandbox_directory="/mnt/mesos/sandbox"
--strict="true" --switch_user="true" --systemd_enable_support="true" --systemd_runtime_directory="/run/systemd/system"
--version="false" --work_dir="/tmp/Endpoint_SlaveEndpointTest_UnauthorizedRequest_2_4Bwj6T"
I0711 10:34:03.833894 31509 credentials.hpp:86] Loading credential for authentication from
'/tmp/Endpoint_SlaveEndpointTest_UnauthorizedRequest_2_5C5Ivk/credential'
I0711 10:34:03.834053 31509 slave.cpp:283] Agent using credential for: test-principal
I0711 10:34:03.834072 31509 credentials.hpp:37] Loading credentials for authentication from
'/tmp/Endpoint_SlaveEndpointTest_UnauthorizedRequest_2_5C5Ivk/http_credentials'
I0711 10:34:03.834302 31509 http.cpp:976] Creating default 'basic' HTTP authenticator for
realm 'mesos-agent-readonly'
I0711 10:34:03.834430 31509 http.cpp:976] Creating default 'basic' HTTP authenticator for
realm 'mesos-agent-readwrite'
I0711 10:34:03.836318 31509 slave.cpp:565] Agent resources: [{"name":"cpus","scalar":{"value":2.0},"type":"SCALAR"},{"name":"mem","scalar":{"value":1024.0},"type":"SCALAR"},{"name":"disk","scalar":{"value":1024.0},"type":"SCALAR"},{"name":"ports","ranges":{"range":[{"begin":31000,"end":32000}]},"type":"RANGES"}]
I0711 10:34:03.836506 31509 slave.cpp:573] Agent attributes: [  ]
I0711 10:34:03.836516 31509 slave.cpp:578] Agent hostname: 735425c1d315
I0711 10:34:03.836673 31530 status_update_manager.cpp:177] Pausing sending status updates
I0711 10:34:03.838050 31510 state.cpp:64] Recovering state from '/tmp/Endpoint_SlaveEndpointTest_UnauthorizedRequest_2_4Bwj6T/meta'
I0711 10:34:03.838388 31515 status_update_manager.cpp:203] Recovering status update manager
I0711 10:34:03.838668 31512 containerizer.cpp:582] Recovering containerizer
I0711 10:34:03.840184 31514 provisioner.cpp:416] Provisioner recovery complete
I0711 10:34:03.840801 31523 slave.cpp:6203] Finished recovery
I0711 10:34:03.841253 31523 slave.cpp:6385] Querying resource estimator for oversubscribable
resources
I0711 10:34:03.841475 31513 slave.cpp:6399] Received oversubscribable resources {} from the
resource estimator
I0711 10:34:03.844010 31510 process.cpp:3820] Handling HTTP event for process 'slave(775)'
with path: '/slave(775)/containers'
I0711 10:34:03.845229 31516 http.cpp:1116] HTTP GET for /slave(775)/containers from 172.17.0.4:32992
I0711 10:34:03.845300 31516 http.cpp:937] Authorizing principal 'test-principal' to GET the
'/containers' endpoint
I0711 10:34:03.848111 31528 slave.cpp:839] Agent terminating
[       OK ] Endpoint/SlaveEndpointTest.UnauthorizedRequest/2 (31 ms)
[ RUN      ] Endpoint/SlaveEndpointTest.NoAuthorizer/0
I0711 10:34:03.859979 31507 containerizer.cpp:230] Using isolation: posix/cpu,posix/mem,filesystem/posix,network/cni,environment_secret
W0711 10:34:03.860479 31507 backend.cpp:76] Failed to create 'aufs' backend: AufsBackend requires
root privileges
W0711 10:34:03.860574 31507 backend.cpp:76] Failed to create 'bind' backend: BindBackend requires
root privileges
I0711 10:34:03.860599 31507 provisioner.cpp:255] Using default backend 'copy'
I0711 10:34:03.862431 31507 cluster.cpp:448] Creating default 'local' authorizer
I0711 10:34:03.864339 31509 slave.cpp:250] Mesos agent started on (776)@172.17.0.4:45651
I0711 10:34:03.864357 31509 slave.cpp:251] Flags at startup: --acls="" --appc_simple_discovery_uri_prefix="http://"
--appc_store_dir="/tmp/Endpoint_SlaveEndpointTest_NoAuthorizer_0_rnUup2/store/appc" --authenticate_http_readonly="true"
--authenticate_http_readwrite="true" --authenticatee="crammd5" --authentication_backoff_factor="1secs"
--authorizer="local" --cgroups_cpu_enable_pids_and_tids_count="false" --cgroups_enable_cfs="false"
--cgroups_hierarchy="/sys/fs/cgroup" --cgroups_limit_swap="false" --cgroups_root="mesos" --container_disk_watch_interval="15secs"
--containerizers="mesos" --credential="/tmp/Endpoint_SlaveEndpointTest_NoAuthorizer_0_rnUup2/credential"
--default_role="*" --disk_watch_interval="1mins" --docker="docker" --docker_kill_orphans="true"
--docker_registry="https://registry-1.docker.io" --docker_remove_delay="6hrs" --docker_socket="/var/run/docker.sock"
--docker_stop_timeout="0ns" --docker_store_dir="/tmp/Endpoint_SlaveEndpointTest_NoAuthorizer_0_rnUup2/store/docker"
--docker_volume_checkpoint_dir="/var/run/mesos/isolators/docker/volume" --enforce_container_disk_quota="false"
--executor_registration_timeout="1mins" --executor_reregistration_timeout="2secs" --executor_shutdown_grace_period="5secs"
--fetcher_cache_dir="/tmp/Endpoint_SlaveEndpointTest_NoAuthorizer_0_rnUup2/fetch" --fetcher_cache_size="2GB"
--frameworks_home="" --gc_delay="1weeks" --gc_disk_headroom="0.1" --hadoop_home="" --help="false"
--hostname_lookup="true" --http_command_executor="false" --http_credentials="/tmp/Endpoint_SlaveEndpointTest_NoAuthorizer_0_rnUup2/http_credentials"
--http_heartbeat_interval="30secs" --initialize_driver_logging="true" --isolation="posix/cpu,posix/mem"
--launcher="posix" --launcher_dir="/mesos/build/src" --logbufsecs="0" --logging_level="INFO"
--max_completed_executors_per_framework="150" --oversubscribed_resources_interval="15secs"
--perf_duration="10secs" --perf_interval="1mins" --port="5051" --qos_correction_interval_min="0ns"
--quiet="false" --recover="reconnect" --recovery_timeout="15mins" --registration_backoff_factor="10ms"
--resources="cpus:2;gpus:0;mem:1024;disk:1024;ports:[31000-32000]" --revocable_cpu_low_priority="true"
--runtime_dir="/tmp/Endpoint_SlaveEndpointTest_NoAuthorizer_0_rnUup2" --sandbox_directory="/mnt/mesos/sandbox"
--strict="true" --switch_user="true" --systemd_enable_support="true" --systemd_runtime_directory="/run/systemd/system"
--version="false" --work_dir="/tmp/Endpoint_SlaveEndpointTest_NoAuthorizer_0_KagoVB"
I0711 10:34:03.864683 31509 credentials.hpp:86] Loading credential for authentication from
'/tmp/Endpoint_SlaveEndpointTest_NoAuthorizer_0_rnUup2/credential'
I0711 10:34:03.864841 31509 slave.cpp:283] Agent using credential for: test-principal
I0711 10:34:03.864857 31509 credentials.hpp:37] Loading credentials for authentication from
'/tmp/Endpoint_SlaveEndpointTest_NoAuthorizer_0_rnUup2/http_credentials'
I0711 10:34:03.865069 31509 http.cpp:976] Creating default 'basic' HTTP authenticator for
realm 'mesos-agent-readonly'
I0711 10:34:03.865198 31509 http.cpp:976] Creating default 'basic' HTTP authenticator for
realm 'mesos-agent-readwrite'
I0711 10:34:03.866710 31509 slave.cpp:565] Agent resources: [{"name":"cpus","scalar":{"value":2.0},"type":"SCALAR"},{"name":"mem","scalar":{"value":1024.0},"type":"SCALAR"},{"name":"disk","scalar":{"value":1024.0},"type":"SCALAR"},{"name":"ports","ranges":{"range":[{"begin":31000,"end":32000}]},"type":"RANGES"}]
I0711 10:34:03.866894 31509 slave.cpp:573] Agent attributes: [  ]
I0711 10:34:03.866904 31509 slave.cpp:578] Agent hostname: 735425c1d315
I0711 10:34:03.867014 31530 status_update_manager.cpp:177] Pausing sending status updates
I0711 10:34:03.868278 31522 state.cpp:64] Recovering state from '/tmp/Endpoint_SlaveEndpointTest_NoAuthorizer_0_KagoVB/meta'
I0711 10:34:03.868657 31530 status_update_manager.cpp:203] Recovering status update manager
I0711 10:34:03.868955 31531 containerizer.cpp:582] Recovering containerizer
I0711 10:34:03.870869 31515 provisioner.cpp:416] Provisioner recovery complete
I0711 10:34:03.871325 31525 slave.cpp:6203] Finished recovery
I0711 10:34:03.871799 31525 slave.cpp:6385] Querying resource estimator for oversubscribable
resources
I0711 10:34:03.872059 31524 slave.cpp:6399] Received oversubscribable resources {} from the
resource estimator
I0711 10:34:03.873850 31522 process.cpp:3820] Handling HTTP event for process 'slave(776)'
with path: '/slave(776)/monitor/statistics'
I0711 10:34:03.875010 31522 http.cpp:1116] HTTP GET for /slave(776)/monitor/statistics from
172.17.0.4:32994
I0711 10:34:03.875069 31522 http.cpp:937] Authorizing principal 'test-principal' to GET the
'/monitor/statistics' endpoint
I0711 10:34:03.878909 31510 slave.cpp:839] Agent terminating
[       OK ] Endpoint/SlaveEndpointTest.NoAuthorizer/0 (31 ms)
[ RUN      ] Endpoint/SlaveEndpointTest.NoAuthorizer/1
I0711 10:34:03.891234 31507 containerizer.cpp:230] Using isolation: posix/cpu,posix/mem,filesystem/posix,network/cni,environment_secret
W0711 10:34:03.891715 31507 backend.cpp:76] Failed to create 'aufs' backend: AufsBackend requires
root privileges
W0711 10:34:03.891811 31507 backend.cpp:76] Failed to create 'bind' backend: BindBackend requires
root privileges
I0711 10:34:03.891846 31507 provisioner.cpp:255] Using default backend 'copy'
I0711 10:34:03.894019 31507 cluster.cpp:448] Creating default 'local' authorizer
I0711 10:34:03.895686 31515 slave.cpp:250] Mesos agent started on (777)@172.17.0.4:45651
I0711 10:34:03.895700 31515 slave.cpp:251] Flags at startup: --acls="" --appc_simple_discovery_uri_prefix="http://"
--appc_store_dir="/tmp/Endpoint_SlaveEndpointTest_NoAuthorizer_1_nA5OBK/store/appc" --authenticate_http_readonly="true"
--authenticate_http_readwrite="true" --authenticatee="crammd5" --authentication_backoff_factor="1secs"
--authorizer="local" --cgroups_cpu_enable_pids_and_tids_count="false" --cgroups_enable_cfs="false"
--cgroups_hierarchy="/sys/fs/cgroup" --cgroups_limit_swap="false" --cgroups_root="mesos" --container_disk_watch_interval="15secs"
--containerizers="mesos" --credential="/tmp/Endpoint_SlaveEndpointTest_NoAuthorizer_1_nA5OBK/credential"
--default_role="*" --disk_watch_interval="1mins" --docker="docker" --docker_kill_orphans="true"
--docker_registry="https://registry-1.docker.io" --docker_remove_delay="6hrs" --docker_socket="/var/run/docker.sock"
--docker_stop_timeout="0ns" --docker_store_dir="/tmp/Endpoint_SlaveEndpointTest_NoAuthorizer_1_nA5OBK/store/docker"
--docker_volume_checkpoint_dir="/var/run/mesos/isolators/docker/volume" --enforce_container_disk_quota="false"
--executor_registration_timeout="1mins" --executor_reregistration_timeout="2secs" --executor_shutdown_grace_period="5secs"
--fetcher_cache_dir="/tmp/Endpoint_SlaveEndpointTest_NoAuthorizer_1_nA5OBK/fetch" --fetcher_cache_size="2GB"
--frameworks_home="" --gc_delay="1weeks" --gc_disk_headroom="0.1" --hadoop_home="" --help="false"
--hostname_lookup="true" --http_command_executor="false" --http_credentials="/tmp/Endpoint_SlaveEndpointTest_NoAuthorizer_1_nA5OBK/http_credentials"
--http_heartbeat_interval="30secs" --initialize_driver_logging="true" --isolation="posix/cpu,posix/mem"
--launcher="posix" --launcher_dir="/mesos/build/src" --logbufsecs="0" --logging_level="INFO"
--max_completed_executors_per_framework="150" --oversubscribed_resources_interval="15secs"
--perf_duration="10secs" --perf_interval="1mins" --port="5051" --qos_correction_interval_min="0ns"
--quiet="false" --recover="reconnect" --recovery_timeout="15mins" --registration_backoff_factor="10ms"
--resources="cpus:2;gpus:0;mem:1024;disk:1024;ports:[31000-32000]" --revocable_cpu_low_priority="true"
--runtime_dir="/tmp/Endpoint_SlaveEndpointTest_NoAuthorizer_1_nA5OBK" --sandbox_directory="/mnt/mesos/sandbox"
--strict="true" --switch_user="true" --systemd_enable_support="true" --systemd_runtime_directory="/run/systemd/system"
--version="false" --work_dir="/tmp/Endpoint_SlaveEndpointTest_NoAuthorizer_1_64i32j"
I0711 10:34:03.896105 31515 credentials.hpp:86] Loading credential for authentication from
'/tmp/Endpoint_SlaveEndpointTest_NoAuthorizer_1_nA5OBK/credential'
I0711 10:34:03.896245 31515 slave.cpp:283] Agent using credential for: test-principal
I0711 10:34:03.896265 31515 credentials.hpp:37] Loading credentials for authentication from
'/tmp/Endpoint_SlaveEndpointTest_NoAuthorizer_1_nA5OBK/http_credentials'
I0711 10:34:03.896471 31515 http.cpp:976] Creating default 'basic' HTTP authenticator for
realm 'mesos-agent-readonly'
I0711 10:34:03.896608 31515 http.cpp:976] Creating default 'basic' HTTP authenticator for
realm 'mesos-agent-readwrite'
I0711 10:34:03.897930 31515 slave.cpp:565] Agent resources: [{"name":"cpus","scalar":{"value":2.0},"type":"SCALAR"},{"name":"mem","scalar":{"value":1024.0},"type":"SCALAR"},{"name":"disk","scalar":{"value":1024.0},"type":"SCALAR"},{"name":"ports","ranges":{"range":[{"begin":31000,"end":32000}]},"type":"RANGES"}]
I0711 10:34:03.898144 31515 slave.cpp:573] Agent attributes: [  ]
I0711 10:34:03.898154 31515 slave.cpp:578] Agent hostname: 735425c1d315
I0711 10:34:03.898283 31513 status_update_manager.cpp:177] Pausing sending status updates
I0711 10:34:03.899570 31510 state.cpp:64] Recovering state from '/tmp/Endpoint_SlaveEndpointTest_NoAuthorizer_1_64i32j/meta'
I0711 10:34:03.899862 31509 status_update_manager.cpp:203] Recovering status update manager
I0711 10:34:03.900136 31517 containerizer.cpp:582] Recovering containerizer
I0711 10:34:03.901579 31514 provisioner.cpp:416] Provisioner recovery complete
I0711 10:34:03.902039 31512 slave.cpp:6203] Finished recovery
I0711 10:34:03.902499 31512 slave.cpp:6385] Querying resource estimator for oversubscribable
resources
I0711 10:34:03.902734 31513 slave.cpp:6399] Received oversubscribable resources {} from the
resource estimator
I0711 10:34:03.904752 31525 process.cpp:3820] Handling HTTP event for process 'slave(777)'
with path: '/slave(777)/monitor/statistics.json'
I0711 10:34:03.905827 31511 http.cpp:1116] HTTP GET for /slave(777)/monitor/statistics.json
from 172.17.0.4:32996
I0711 10:34:03.905902 31511 http.cpp:937] Authorizing principal 'test-principal' to GET the
'/monitor/statistics.json' endpoint
I0711 10:34:03.909014 31510 slave.cpp:839] Agent terminating
[       OK ] Endpoint/SlaveEndpointTest.NoAuthorizer/1 (28 ms)
[ RUN      ] Endpoint/SlaveEndpointTest.NoAuthorizer/2
I0711 10:34:03.919513 31507 containerizer.cpp:230] Using isolation: posix/cpu,posix/mem,filesystem/posix,network/cni,environment_secret
W0711 10:34:03.920017 31507 backend.cpp:76] Failed to create 'aufs' backend: AufsBackend requires
root privileges
W0711 10:34:03.920114 31507 backend.cpp:76] Failed to create 'bind' backend: BindBackend requires
root privileges
I0711 10:34:03.920153 31507 provisioner.cpp:255] Using default backend 'copy'
I0711 10:34:03.922549 31507 cluster.cpp:448] Creating default 'local' authorizer
I0711 10:34:03.924702 31527 slave.cpp:250] Mesos agent started on (778)@172.17.0.4:45651
I0711 10:34:03.924720 31527 slave.cpp:251] Flags at startup: --acls="" --appc_simple_discovery_uri_prefix="http://"
--appc_store_dir="/tmp/Endpoint_SlaveEndpointTest_NoAuthorizer_2_JM1m5s/store/appc" --authenticate_http_readonly="true"
--authenticate_http_readwrite="true" --authenticatee="crammd5" --authentication_backoff_factor="1secs"
--authorizer="local" --cgroups_cpu_enable_pids_and_tids_count="false" --cgroups_enable_cfs="false"
--cgroups_hierarchy="/sys/fs/cgroup" --cgroups_limit_swap="false" --cgroups_root="mesos" --container_disk_watch_interval="15secs"
--containerizers="mesos" --credential="/tmp/Endpoint_SlaveEndpointTest_NoAuthorizer_2_JM1m5s/credential"
--default_role="*" --disk_watch_interval="1mins" --docker="docker" --docker_kill_orphans="true"
--docker_registry="https://registry-1.docker.io" --docker_remove_delay="6hrs" --docker_socket="/var/run/docker.sock"
--docker_stop_timeout="0ns" --docker_store_dir="/tmp/Endpoint_SlaveEndpointTest_NoAuthorizer_2_JM1m5s/store/docker"
--docker_volume_checkpoint_dir="/var/run/mesos/isolators/docker/volume" --enforce_container_disk_quota="false"
--executor_registration_timeout="1mins" --executor_reregistration_timeout="2secs" --executor_shutdown_grace_period="5secs"
--fetcher_cache_dir="/tmp/Endpoint_SlaveEndpointTest_NoAuthorizer_2_JM1m5s/fetch" --fetcher_cache_size="2GB"
--frameworks_home="" --gc_delay="1weeks" --gc_disk_headroom="0.1" --hadoop_home="" --help="false"
--hostname_lookup="true" --http_command_executor="false" --http_credentials="/tmp/Endpoint_SlaveEndpointTest_NoAuthorizer_2_JM1m5s/http_credentials"
--http_heartbeat_interval="30secs" --initialize_driver_logging="true" --isolation="posix/cpu,posix/mem"
--launcher="posix" --launcher_dir="/mesos/build/src" --logbufsecs="0" --logging_level="INFO"
--max_completed_executors_per_framework="150" --oversubscribed_resources_interval="15secs"
--perf_duration="10secs" --perf_interval="1mins" --port="5051" --qos_correction_interval_min="0ns"
--quiet="false" --recover="reconnect" --recovery_timeout="15mins" --registration_backoff_factor="10ms"
--resources="cpus:2;gpus:0;mem:1024;disk:1024;ports:[31000-32000]" --revocable_cpu_low_priority="true"
--runtime_dir="/tmp/Endpoint_SlaveEndpointTest_NoAuthorizer_2_JM1m5s" --sandbox_directory="/mnt/mesos/sandbox"
--strict="true" --switch_user="true" --systemd_enable_support="true" --systemd_runtime_directory="/run/systemd/system"
--version="false" --work_dir="/tmp/Endpoint_SlaveEndpointTest_NoAuthorizer_2_4qyns2"
I0711 10:34:03.925029 31527 credentials.hpp:86] Loading credential for authentication from
'/tmp/Endpoint_SlaveEndpointTest_NoAuthorizer_2_JM1m5s/credential'
I0711 10:34:03.925165 31527 slave.cpp:283] Agent using credential for: test-principal
I0711 10:34:03.925186 31527 credentials.hpp:37] Loading credentials for authentication from
'/tmp/Endpoint_SlaveEndpointTest_NoAuthorizer_2_JM1m5s/http_credentials'
I0711 10:34:03.925405 31527 http.cpp:976] Creating default 'basic' HTTP authenticator for
realm 'mesos-agent-readonly'
I0711 10:34:03.925642 31527 http.cpp:976] Creating default 'basic' HTTP authenticator for
realm 'mesos-agent-readwrite'
I0711 10:34:03.926990 31527 slave.cpp:565] Agent resources: [{"name":"cpus","scalar":{"value":2.0},"type":"SCALAR"},{"name":"mem","scalar":{"value":1024.0},"type":"SCALAR"},{"name":"disk","scalar":{"value":1024.0},"type":"SCALAR"},{"name":"ports","ranges":{"range":[{"begin":31000,"end":32000}]},"type":"RANGES"}]
I0711 10:34:03.927181 31527 slave.cpp:573] Agent attributes: [  ]
I0711 10:34:03.927189 31527 slave.cpp:578] Agent hostname: 735425c1d315
I0711 10:34:03.927338 31526 status_update_manager.cpp:177] Pausing sending status updates
I0711 10:34:03.928664 31510 state.cpp:64] Recovering state from '/tmp/Endpoint_SlaveEndpointTest_NoAuthorizer_2_4qyns2/meta'
I0711 10:34:03.928922 31524 status_update_manager.cpp:203] Recovering status update manager
I0711 10:34:03.929395 31515 containerizer.cpp:582] Recovering containerizer
I0711 10:34:03.931231 31516 provisioner.cpp:416] Provisioner recovery complete
I0711 10:34:03.931654 31508 slave.cpp:6203] Finished recovery
I0711 10:34:03.932142 31508 slave.cpp:6385] Querying resource estimator for oversubscribable
resources
I0711 10:34:03.932531 31512 slave.cpp:6399] Received oversubscribable resources {} from the
resource estimator
I0711 10:34:03.934902 31528 process.cpp:3820] Handling HTTP event for process 'slave(778)'
with path: '/slave(778)/containers'
I0711 10:34:03.936327 31520 http.cpp:1116] HTTP GET for /slave(778)/containers from 172.17.0.4:32998
I0711 10:34:03.936398 31520 http.cpp:937] Authorizing principal 'test-principal' to GET the
'/containers' endpoint
I0711 10:34:03.940279 31522 slave.cpp:839] Agent terminating
[       OK ] Endpoint/SlaveEndpointTest.NoAuthorizer/2 (31 ms)
[----------] 9 tests from Endpoint/SlaveEndpointTest (279 ms total)

[----------] Global test environment tear-down
[==========] 1577 tests from 172 test cases ran. (302277 ms total)
[  PASSED  ] 1576 tests.
[  FAILED  ] 1 test, listed below:
[  FAILED  ] MasterTest.IgnoreOldAgentReregistration

 1 FAILED TEST
  YOU HAVE 20 DISABLED TESTS

I0711 10:34:04.025204 31532 process.cpp:993] Failed to accept socket: future discarded
make[3]: *** [CMakeFiles/check] Error 1
make[3]: Leaving directory `/mesos/build'
make[2]: *** [CMakeFiles/check.dir/all] Error 2
make[2]: Leaving directory `/mesos/build'
make[1]: *** [CMakeFiles/check.dir/rule] Error 2
make[1]: Leaving directory `/mesos/build'
make: *** [check] Error 2
+ docker rmi mesos-1499766831-10778
Untagged: mesos-1499766831-10778:latest
Deleted: sha256:847e39772189a8ba8ea1feb51e0008d55e7cfd684d6d0a80581f60f149e60200
Deleted: sha256:e7bacfeb02322b702ba8f9ebf7825fb99926c5bb277dfaeb469319a17f41a7e1
Deleted: sha256:4651de4c942e452122aab5238fbef8c8ce2f5ff539f59b44ac748f8e3ce3c3c3
Deleted: sha256:12612505cc7b78b0f7be9f588981ae4dc6b2d95871fa27d8229dafcf89d701b2
Deleted: sha256:43784392371bd21944d8ba8cf8e930ed0673628578c4c3900f6284063db9521f
Deleted: sha256:2a2fb3f3115ec9b42ce1202be1dbe765f515ccf5bf621f56c78da1fa73fa3113
Deleted: sha256:cf500fb4747dfea5386daf8df3629912f0b4f3e63129bbddd70785d3bba1550d
Deleted: sha256:c5389f4b92da4de38cced37c5097ecefe04538784704af9029926cab40ee274b
Deleted: sha256:8b33f48b157934cd1395e9b8d49bd54fa958955224e214169cddc4b8c806caa5
Deleted: sha256:489df6bcdd8d6755d32865e649b05d42a4acbd3e8fed6669f6a795aa09fef09a
Deleted: sha256:2abd23a717f306b432df7a70db2f8e503a40f4f6be8b12ffdbd2a9d86a3258f6
Deleted: sha256:c9335cbe91442927de4f8755902914ddf68a4fdfb92a0455918abcdb09cc5bc9
Deleted: sha256:5e270de7ad3bda02c936652a7dae67d81132f71f223da3e19ae752deb1a28532
Deleted: sha256:63f2571da0f4fb45279e39309f93deef89553313a79cc789a540d85632bf2e58
Deleted: sha256:d98462a7c82dd37f3b9467d1894de127016a74fae6546d460e5e64fbe57f12e4
Deleted: sha256:02def97d2bcd0dbfee43e60132bff8708803337fc98d09976aa3cbdebca2c65b
Deleted: sha256:68154bb4a990628bebe3f1a9089e19e4a90a1cdf82ec9534aefbf922974795c8
Deleted: sha256:f3c8f0bf97e7e3dc1eaff3722003c24326abac80523b1b949532251af565e032
Deleted: sha256:885d0276da56a011a66f9a9d66947ca192a6e6334033b6a0824930aa79b8f7da
Deleted: sha256:49f919e5e6768eedad0879d95c2fe73b4a758dea0d1d49f11ed840e81dca3fa5
Deleted: sha256:2e1d16a7074eebffb9244cc61b0084733c95fc7f4d170b531a33422dd69ef8d8
Deleted: sha256:e6f5f1d3e9e4d37bc4fea5f8fbde55c6d4a269a5f67b36c2b80a6122998e171b
Deleted: sha256:5744832710aae75596afcf6f381167ad67421d3ebaff0b1bb31698924d4700cb
Deleted: sha256:2742c5133822fef4f1024e57c9a2c4984a5847b36870f100af65e2abeda61be9
Deleted: sha256:9bda654f8d7fd5f6e8b24617a8b5a0823534579a3c7b5a2765acf30e270b86c9
Build step 'Execute shell' marked build as failure

Mime
View raw message