mesos-builds mailing list archives

Site index · List index
Message view « Date » · « Thread »
Top « Date » · « Thread »
From Apache Jenkins Server <jenk...@builds.apache.org>
Subject Build failed in Jenkins: Mesos-Buildbot » autotools,gcc,--verbose --enable-libevent --enable-ssl,GLOG_v=1 MESOS_VERBOSE=1,ubuntu:14.04,(ubuntu)&&(!ubuntu-us1)&&(!ubuntu-eu2) #3974
Date Fri, 28 Jul 2017 20:30:26 GMT
See <https://builds.apache.org/job/Mesos-Buildbot/BUILDTOOL=autotools,COMPILER=gcc,CONFIGURATION=--verbose%20--enable-libevent%20--enable-ssl,ENVIRONMENT=GLOG_v=1%20MESOS_VERBOSE=1,OS=ubuntu%3A14.04,label_exp=(ubuntu)&&(!ubuntu-us1)&&(!ubuntu-eu2)/3974/display/redirect?page=changes>

Changes:

[songzihao1990] Fixed the sandbox_path volume source path ownership.

[songzihao1990] Added regression test for sandbox_path volume ownership issue.

[songzihao1990] Fixed the sandbox volume relative host path ownership.

[songzihao1990] Added regression test for sandbox volume ownership issue.

------------------------------------------
[...truncated 31.80 MB...]
I0728 20:30:15.758811 26439 process.cpp:3836] Handling HTTP event for process 'slave(801)'
with path: '/slave(801)/containers'
I0728 20:30:15.760814 26443 http.cpp:1133] HTTP GET for /slave(801)/containers from 172.17.0.2:41174
I0728 20:30:15.760905 26443 http.cpp:957] Authorizing principal 'test-principal' to GET the
'/containers' endpoint
I0728 20:30:15.765318 26443 slave.cpp:843] Agent terminating
[       OK ] Endpoint/SlaveEndpointTest.AuthorizedRequest/2 (36 ms)
[ RUN      ] Endpoint/SlaveEndpointTest.UnauthorizedRequest/0
I0728 20:30:15.778048  7538 containerizer.cpp:230] Using isolation: posix/cpu,posix/mem,filesystem/posix,network/cni,environment_secret
W0728 20:30:15.778507  7538 backend.cpp:76] Failed to create 'aufs' backend: AufsBackend requires
root privileges
W0728 20:30:15.778592  7538 backend.cpp:76] Failed to create 'bind' backend: BindBackend requires
root privileges
I0728 20:30:15.778621  7538 provisioner.cpp:255] Using default backend 'copy'
I0728 20:30:15.781522 26437 slave.cpp:250] Mesos agent started on (802)@172.17.0.2:52498
I0728 20:30:15.781544 26437 slave.cpp:251] Flags at startup: --acls="" --appc_simple_discovery_uri_prefix="http://"
--appc_store_dir="/tmp/Endpoint_SlaveEndpointTest_UnauthorizedRequest_0_pcgPZU/store/appc"
--authenticate_http_executors="true" --authenticate_http_readonly="true" --authenticate_http_readwrite="true"
--authenticatee="crammd5" --authentication_backoff_factor="1secs" --authorizer="local" --cgroups_cpu_enable_pids_and_tids_count="false"
--cgroups_enable_cfs="false" --cgroups_hierarchy="/sys/fs/cgroup" --cgroups_limit_swap="false"
--cgroups_root="mesos" --container_disk_watch_interval="15secs" --containerizers="mesos" --credential="/tmp/Endpoint_SlaveEndpointTest_UnauthorizedRequest_0_pcgPZU/credential"
--default_role="*" --disk_watch_interval="1mins" --docker="docker" --docker_kill_orphans="true"
--docker_registry="https://registry-1.docker.io" --docker_remove_delay="6hrs" --docker_socket="/var/run/docker.sock"
--docker_stop_timeout="0ns" --docker_store_dir="/tmp/Endpoint_SlaveEndpointTest_UnauthorizedRequest_0_pcgPZU/store/docker"
--docker_volume_checkpoint_dir="/var/run/mesos/isolators/docker/volume" --enforce_container_disk_quota="false"
--executor_registration_timeout="1mins" --executor_reregistration_timeout="2secs" --executor_secret_key="/tmp/Endpoint_SlaveEndpointTest_UnauthorizedRequest_0_pcgPZU/executor_secret_key"
--executor_shutdown_grace_period="5secs" --fetcher_cache_dir="/tmp/Endpoint_SlaveEndpointTest_UnauthorizedRequest_0_pcgPZU/fetch"
--fetcher_cache_size="2GB" --frameworks_home="" --gc_delay="1weeks" --gc_disk_headroom="0.1"
--hadoop_home="" --help="false" --hostname_lookup="true" --http_command_executor="false" --http_credentials="/tmp/Endpoint_SlaveEndpointTest_UnauthorizedRequest_0_pcgPZU/http_credentials"
--http_heartbeat_interval="30secs" --initialize_driver_logging="true" --isolation="posix/cpu,posix/mem"
--launcher="posix" --launcher_dir="/mesos/mesos-1.4.0/_build/src" --logbufsecs="0" --logging_level="INFO"
--max_completed_executors_per_framework="150" --oversubscribed_resources_interval="15secs"
--perf_duration="10secs" --perf_interval="1mins" --port="5051" --qos_correction_interval_min="0ns"
--quiet="false" --recover="reconnect" --recovery_timeout="15mins" --registration_backoff_factor="10ms"
--resources="cpus:2;gpus:0;mem:1024;disk:1024;ports:[31000-32000]" --revocable_cpu_low_priority="true"
--runtime_dir="/tmp/Endpoint_SlaveEndpointTest_UnauthorizedRequest_0_pcgPZU" --sandbox_directory="/mnt/mesos/sandbox"
--strict="true" --switch_user="true" --systemd_enable_support="true" --systemd_runtime_directory="/run/systemd/system"
--version="false" --work_dir="/tmp/Endpoint_SlaveEndpointTest_UnauthorizedRequest_0_L3YOm6"
I0728 20:30:15.781939 26437 credentials.hpp:86] Loading credential for authentication from
'/tmp/Endpoint_SlaveEndpointTest_UnauthorizedRequest_0_pcgPZU/credential'
I0728 20:30:15.782071 26437 slave.cpp:283] Agent using credential for: test-principal
I0728 20:30:15.782093 26437 credentials.hpp:37] Loading credentials for authentication from
'/tmp/Endpoint_SlaveEndpointTest_UnauthorizedRequest_0_pcgPZU/http_credentials'
I0728 20:30:15.782346 26437 http.cpp:993] Creating default 'basic' HTTP authenticator for
realm 'mesos-agent-executor'
I0728 20:30:15.782438 26437 http.cpp:1014] Creating default 'jwt' HTTP authenticator for realm
'mesos-agent-executor'
I0728 20:30:15.782583 26437 http.cpp:993] Creating default 'basic' HTTP authenticator for
realm 'mesos-agent-readonly'
I0728 20:30:15.782660 26437 http.cpp:1014] Creating default 'jwt' HTTP authenticator for realm
'mesos-agent-readonly'
I0728 20:30:15.782824 26437 http.cpp:993] Creating default 'basic' HTTP authenticator for
realm 'mesos-agent-readwrite'
I0728 20:30:15.782932 26437 http.cpp:1014] Creating default 'jwt' HTTP authenticator for realm
'mesos-agent-readwrite'
I0728 20:30:15.784606 26437 slave.cpp:565] Agent resources: [{"name":"cpus","scalar":{"value":2.0},"type":"SCALAR"},{"name":"mem","scalar":{"value":1024.0},"type":"SCALAR"},{"name":"disk","scalar":{"value":1024.0},"type":"SCALAR"},{"name":"ports","ranges":{"range":[{"begin":31000,"end":32000}]},"type":"RANGES"}]
I0728 20:30:15.784893 26437 slave.cpp:573] Agent attributes: [  ]
I0728 20:30:15.784914 26437 slave.cpp:582] Agent hostname: 57d9a1ee2cf7
I0728 20:30:15.785060 26435 status_update_manager.cpp:177] Pausing sending status updates
I0728 20:30:15.786599 26439 state.cpp:64] Recovering state from '/tmp/Endpoint_SlaveEndpointTest_UnauthorizedRequest_0_L3YOm6/meta'
I0728 20:30:15.786976 26448 status_update_manager.cpp:203] Recovering status update manager
I0728 20:30:15.787214 26442 containerizer.cpp:582] Recovering containerizer
I0728 20:30:15.788868 26445 provisioner.cpp:416] Provisioner recovery complete
I0728 20:30:15.789263 26443 slave.cpp:6207] Finished recovery
I0728 20:30:15.789772 26443 slave.cpp:6389] Querying resource estimator for oversubscribable
resources
I0728 20:30:15.790004 26437 slave.cpp:6403] Received oversubscribable resources {} from the
resource estimator
I0728 20:30:15.792449 26433 process.cpp:3836] Handling HTTP event for process 'slave(802)'
with path: '/slave(802)/monitor/statistics'
I0728 20:30:15.794615 26447 http.cpp:1133] HTTP GET for /slave(802)/monitor/statistics from
172.17.0.2:41175
I0728 20:30:15.794704 26447 http.cpp:957] Authorizing principal 'test-principal' to GET the
'/monitor/statistics' endpoint
I0728 20:30:15.797773 26438 slave.cpp:843] Agent terminating
[       OK ] Endpoint/SlaveEndpointTest.UnauthorizedRequest/0 (32 ms)
[ RUN      ] Endpoint/SlaveEndpointTest.UnauthorizedRequest/1
I0728 20:30:15.811017  7538 containerizer.cpp:230] Using isolation: posix/cpu,posix/mem,filesystem/posix,network/cni,environment_secret
W0728 20:30:15.811605  7538 backend.cpp:76] Failed to create 'aufs' backend: AufsBackend requires
root privileges
W0728 20:30:15.811712  7538 backend.cpp:76] Failed to create 'bind' backend: BindBackend requires
root privileges
I0728 20:30:15.811749  7538 provisioner.cpp:255] Using default backend 'copy'
I0728 20:30:15.816061 26443 slave.cpp:250] Mesos agent started on (803)@172.17.0.2:52498
I0728 20:30:15.816088 26443 slave.cpp:251] Flags at startup: --acls="" --appc_simple_discovery_uri_prefix="http://"
--appc_store_dir="/tmp/Endpoint_SlaveEndpointTest_UnauthorizedRequest_1_Z3PqNb/store/appc"
--authenticate_http_executors="true" --authenticate_http_readonly="true" --authenticate_http_readwrite="true"
--authenticatee="crammd5" --authentication_backoff_factor="1secs" --authorizer="local" --cgroups_cpu_enable_pids_and_tids_count="false"
--cgroups_enable_cfs="false" --cgroups_hierarchy="/sys/fs/cgroup" --cgroups_limit_swap="false"
--cgroups_root="mesos" --container_disk_watch_interval="15secs" --containerizers="mesos" --credential="/tmp/Endpoint_SlaveEndpointTest_UnauthorizedRequest_1_Z3PqNb/credential"
--default_role="*" --disk_watch_interval="1mins" --docker="docker" --docker_kill_orphans="true"
--docker_registry="https://registry-1.docker.io" --docker_remove_delay="6hrs" --docker_socket="/var/run/docker.sock"
--docker_stop_timeout="0ns" --docker_store_dir="/tmp/Endpoint_SlaveEndpointTest_UnauthorizedRequest_1_Z3PqNb/store/docker"
--docker_volume_checkpoint_dir="/var/run/mesos/isolators/docker/volume" --enforce_container_disk_quota="false"
--executor_registration_timeout="1mins" --executor_reregistration_timeout="2secs" --executor_secret_key="/tmp/Endpoint_SlaveEndpointTest_UnauthorizedRequest_1_Z3PqNb/executor_secret_key"
--executor_shutdown_grace_period="5secs" --fetcher_cache_dir="/tmp/Endpoint_SlaveEndpointTest_UnauthorizedRequest_1_Z3PqNb/fetch"
--fetcher_cache_size="2GB" --frameworks_home="" --gc_delay="1weeks" --gc_disk_headroom="0.1"
--hadoop_home="" --help="false" --hostname_lookup="true" --http_command_executor="false" --http_credentials="/tmp/Endpoint_SlaveEndpointTest_UnauthorizedRequest_1_Z3PqNb/http_credentials"
--http_heartbeat_interval="30secs" --initialize_driver_logging="true" --isolation="posix/cpu,posix/mem"
--launcher="posix" --launcher_dir="/mesos/mesos-1.4.0/_build/src" --logbufsecs="0" --logging_level="INFO"
--max_completed_executors_per_framework="150" --oversubscribed_resources_interval="15secs"
--perf_duration="10secs" --perf_interval="1mins" --port="5051" --qos_correction_interval_min="0ns"
--quiet="false" --recover="reconnect" --recovery_timeout="15mins" --registration_backoff_factor="10ms"
--resources="cpus:2;gpus:0;mem:1024;disk:1024;ports:[31000-32000]" --revocable_cpu_low_priority="true"
--runtime_dir="/tmp/Endpoint_SlaveEndpointTest_UnauthorizedRequest_1_Z3PqNb" --sandbox_directory="/mnt/mesos/sandbox"
--strict="true" --switch_user="true" --systemd_enable_support="true" --systemd_runtime_directory="/run/systemd/system"
--version="false" --work_dir="/tmp/Endpoint_SlaveEndpointTest_UnauthorizedRequest_1_tptc5m"
I0728 20:30:15.816638 26443 credentials.hpp:86] Loading credential for authentication from
'/tmp/Endpoint_SlaveEndpointTest_UnauthorizedRequest_1_Z3PqNb/credential'
I0728 20:30:15.816848 26443 slave.cpp:283] Agent using credential for: test-principal
I0728 20:30:15.816874 26443 credentials.hpp:37] Loading credentials for authentication from
'/tmp/Endpoint_SlaveEndpointTest_UnauthorizedRequest_1_Z3PqNb/http_credentials'
I0728 20:30:15.817242 26443 http.cpp:993] Creating default 'basic' HTTP authenticator for
realm 'mesos-agent-executor'
I0728 20:30:15.817373 26443 http.cpp:1014] Creating default 'jwt' HTTP authenticator for realm
'mesos-agent-executor'
I0728 20:30:15.817591 26443 http.cpp:993] Creating default 'basic' HTTP authenticator for
realm 'mesos-agent-readonly'
I0728 20:30:15.817729 26443 http.cpp:1014] Creating default 'jwt' HTTP authenticator for realm
'mesos-agent-readonly'
I0728 20:30:15.817955 26443 http.cpp:993] Creating default 'basic' HTTP authenticator for
realm 'mesos-agent-readwrite'
I0728 20:30:15.818071 26443 http.cpp:1014] Creating default 'jwt' HTTP authenticator for realm
'mesos-agent-readwrite'
I0728 20:30:15.819607 26443 slave.cpp:565] Agent resources: [{"name":"cpus","scalar":{"value":2.0},"type":"SCALAR"},{"name":"mem","scalar":{"value":1024.0},"type":"SCALAR"},{"name":"disk","scalar":{"value":1024.0},"type":"SCALAR"},{"name":"ports","ranges":{"range":[{"begin":31000,"end":32000}]},"type":"RANGES"}]
I0728 20:30:15.819880 26443 slave.cpp:573] Agent attributes: [  ]
I0728 20:30:15.819905 26443 slave.cpp:582] Agent hostname: 57d9a1ee2cf7
I0728 20:30:15.820075 26433 status_update_manager.cpp:177] Pausing sending status updates
I0728 20:30:15.821207 26435 state.cpp:64] Recovering state from '/tmp/Endpoint_SlaveEndpointTest_UnauthorizedRequest_1_tptc5m/meta'
I0728 20:30:15.821547 26434 status_update_manager.cpp:203] Recovering status update manager
I0728 20:30:15.821807 26445 containerizer.cpp:582] Recovering containerizer
I0728 20:30:15.823403 26447 provisioner.cpp:416] Provisioner recovery complete
I0728 20:30:15.823766 26448 slave.cpp:6207] Finished recovery
I0728 20:30:15.824407 26448 slave.cpp:6389] Querying resource estimator for oversubscribable
resources
I0728 20:30:15.824640 26443 slave.cpp:6403] Received oversubscribable resources {} from the
resource estimator
I0728 20:30:15.826638 26437 process.cpp:3836] Handling HTTP event for process 'slave(803)'
with path: '/slave(803)/monitor/statistics.json'
I0728 20:30:15.828434 26435 http.cpp:1133] HTTP GET for /slave(803)/monitor/statistics.json
from 172.17.0.2:41176
I0728 20:30:15.828523 26435 http.cpp:957] Authorizing principal 'test-principal' to GET the
'/monitor/statistics.json' endpoint
I0728 20:30:15.830788  7538 slave.cpp:843] Agent terminating
[       OK ] Endpoint/SlaveEndpointTest.UnauthorizedRequest/1 (31 ms)
[ RUN      ] Endpoint/SlaveEndpointTest.UnauthorizedRequest/2
I0728 20:30:15.843196  7538 containerizer.cpp:230] Using isolation: posix/cpu,posix/mem,filesystem/posix,network/cni,environment_secret
W0728 20:30:15.843807  7538 backend.cpp:76] Failed to create 'aufs' backend: AufsBackend requires
root privileges
W0728 20:30:15.843919  7538 backend.cpp:76] Failed to create 'bind' backend: BindBackend requires
root privileges
I0728 20:30:15.843966  7538 provisioner.cpp:255] Using default backend 'copy'
I0728 20:30:15.846868 26443 slave.cpp:250] Mesos agent started on (804)@172.17.0.2:52498
I0728 20:30:15.846887 26443 slave.cpp:251] Flags at startup: --acls="" --appc_simple_discovery_uri_prefix="http://"
--appc_store_dir="/tmp/Endpoint_SlaveEndpointTest_UnauthorizedRequest_2_TX4hWs/store/appc"
--authenticate_http_executors="true" --authenticate_http_readonly="true" --authenticate_http_readwrite="true"
--authenticatee="crammd5" --authentication_backoff_factor="1secs" --authorizer="local" --cgroups_cpu_enable_pids_and_tids_count="false"
--cgroups_enable_cfs="false" --cgroups_hierarchy="/sys/fs/cgroup" --cgroups_limit_swap="false"
--cgroups_root="mesos" --container_disk_watch_interval="15secs" --containerizers="mesos" --credential="/tmp/Endpoint_SlaveEndpointTest_UnauthorizedRequest_2_TX4hWs/credential"
--default_role="*" --disk_watch_interval="1mins" --docker="docker" --docker_kill_orphans="true"
--docker_registry="https://registry-1.docker.io" --docker_remove_delay="6hrs" --docker_socket="/var/run/docker.sock"
--docker_stop_timeout="0ns" --docker_store_dir="/tmp/Endpoint_SlaveEndpointTest_UnauthorizedRequest_2_TX4hWs/store/docker"
--docker_volume_checkpoint_dir="/var/run/mesos/isolators/docker/volume" --enforce_container_disk_quota="false"
--executor_registration_timeout="1mins" --executor_reregistration_timeout="2secs" --executor_secret_key="/tmp/Endpoint_SlaveEndpointTest_UnauthorizedRequest_2_TX4hWs/executor_secret_key"
--executor_shutdown_grace_period="5secs" --fetcher_cache_dir="/tmp/Endpoint_SlaveEndpointTest_UnauthorizedRequest_2_TX4hWs/fetch"
--fetcher_cache_size="2GB" --frameworks_home="" --gc_delay="1weeks" --gc_disk_headroom="0.1"
--hadoop_home="" --help="false" --hostname_lookup="true" --http_command_executor="false" --http_credentials="/tmp/Endpoint_SlaveEndpointTest_UnauthorizedRequest_2_TX4hWs/http_credentials"
--http_heartbeat_interval="30secs" --initialize_driver_logging="true" --isolation="posix/cpu,posix/mem"
--launcher="posix" --launcher_dir="/mesos/mesos-1.4.0/_build/src" --logbufsecs="0" --logging_level="INFO"
--max_completed_executors_per_framework="150" --oversubscribed_resources_interval="15secs"
--perf_duration="10secs" --perf_interval="1mins" --port="5051" --qos_correction_interval_min="0ns"
--quiet="false" --recover="reconnect" --recovery_timeout="15mins" --registration_backoff_factor="10ms"
--resources="cpus:2;gpus:0;mem:1024;disk:1024;ports:[31000-32000]" --revocable_cpu_low_priority="true"
--runtime_dir="/tmp/Endpoint_SlaveEndpointTest_UnauthorizedRequest_2_TX4hWs" --sandbox_directory="/mnt/mesos/sandbox"
--strict="true" --switch_user="true" --systemd_enable_support="true" --systemd_runtime_directory="/run/systemd/system"
--version="false" --work_dir="/tmp/Endpoint_SlaveEndpointTest_UnauthorizedRequest_2_jvNP8D"
I0728 20:30:15.847254 26443 credentials.hpp:86] Loading credential for authentication from
'/tmp/Endpoint_SlaveEndpointTest_UnauthorizedRequest_2_TX4hWs/credential'
I0728 20:30:15.847398 26443 slave.cpp:283] Agent using credential for: test-principal
I0728 20:30:15.847425 26443 credentials.hpp:37] Loading credentials for authentication from
'/tmp/Endpoint_SlaveEndpointTest_UnauthorizedRequest_2_TX4hWs/http_credentials'
I0728 20:30:15.847718 26443 http.cpp:993] Creating default 'basic' HTTP authenticator for
realm 'mesos-agent-executor'
I0728 20:30:15.847812 26443 http.cpp:1014] Creating default 'jwt' HTTP authenticator for realm
'mesos-agent-executor'
I0728 20:30:15.848101 26443 http.cpp:993] Creating default 'basic' HTTP authenticator for
realm 'mesos-agent-readonly'
I0728 20:30:15.848222 26443 http.cpp:1014] Creating default 'jwt' HTTP authenticator for realm
'mesos-agent-readonly'
I0728 20:30:15.848464 26443 http.cpp:993] Creating default 'basic' HTTP authenticator for
realm 'mesos-agent-readwrite'
I0728 20:30:15.848559 26443 http.cpp:1014] Creating default 'jwt' HTTP authenticator for realm
'mesos-agent-readwrite'
I0728 20:30:15.849792 26443 slave.cpp:565] Agent resources: [{"name":"cpus","scalar":{"value":2.0},"type":"SCALAR"},{"name":"mem","scalar":{"value":1024.0},"type":"SCALAR"},{"name":"disk","scalar":{"value":1024.0},"type":"SCALAR"},{"name":"ports","ranges":{"range":[{"begin":31000,"end":32000}]},"type":"RANGES"}]
I0728 20:30:15.850003 26443 slave.cpp:573] Agent attributes: [  ]
I0728 20:30:15.850016 26443 slave.cpp:582] Agent hostname: 57d9a1ee2cf7
I0728 20:30:15.850118 26438 status_update_manager.cpp:177] Pausing sending status updates
I0728 20:30:15.851300 26446 state.cpp:64] Recovering state from '/tmp/Endpoint_SlaveEndpointTest_UnauthorizedRequest_2_jvNP8D/meta'
I0728 20:30:15.851604 26437 status_update_manager.cpp:203] Recovering status update manager
I0728 20:30:15.851778 26448 containerizer.cpp:582] Recovering containerizer
I0728 20:30:15.853484 26437 provisioner.cpp:416] Provisioner recovery complete
I0728 20:30:15.853983 26436 slave.cpp:6207] Finished recovery
I0728 20:30:15.854588 26436 slave.cpp:6389] Querying resource estimator for oversubscribable
resources
I0728 20:30:15.854810 26447 slave.cpp:6403] Received oversubscribable resources {} from the
resource estimator
I0728 20:30:15.856997 26441 process.cpp:3836] Handling HTTP event for process 'slave(804)'
with path: '/slave(804)/containers'
I0728 20:30:15.859088 26435 http.cpp:1133] HTTP GET for /slave(804)/containers from 172.17.0.2:41177
I0728 20:30:15.859185 26435 http.cpp:957] Authorizing principal 'test-principal' to GET the
'/containers' endpoint
I0728 20:30:15.861690 26445 slave.cpp:843] Agent terminating
[       OK ] Endpoint/SlaveEndpointTest.UnauthorizedRequest/2 (30 ms)
[ RUN      ] Endpoint/SlaveEndpointTest.NoAuthorizer/0
I0728 20:30:15.874601  7538 containerizer.cpp:230] Using isolation: posix/cpu,posix/mem,filesystem/posix,network/cni,environment_secret
W0728 20:30:15.875242  7538 backend.cpp:76] Failed to create 'aufs' backend: AufsBackend requires
root privileges
W0728 20:30:15.875356  7538 backend.cpp:76] Failed to create 'bind' backend: BindBackend requires
root privileges
I0728 20:30:15.875396  7538 provisioner.cpp:255] Using default backend 'copy'
I0728 20:30:15.877426  7538 cluster.cpp:448] Creating default 'local' authorizer
I0728 20:30:15.879462 26443 slave.cpp:250] Mesos agent started on (805)@172.17.0.2:52498
I0728 20:30:15.879488 26443 slave.cpp:251] Flags at startup: --acls="" --appc_simple_discovery_uri_prefix="http://"
--appc_store_dir="/tmp/Endpoint_SlaveEndpointTest_NoAuthorizer_0_zpUbpK/store/appc" --authenticate_http_executors="true"
--authenticate_http_readonly="true" --authenticate_http_readwrite="true" --authenticatee="crammd5"
--authentication_backoff_factor="1secs" --authorizer="local" --cgroups_cpu_enable_pids_and_tids_count="false"
--cgroups_enable_cfs="false" --cgroups_hierarchy="/sys/fs/cgroup" --cgroups_limit_swap="false"
--cgroups_root="mesos" --container_disk_watch_interval="15secs" --containerizers="mesos" --credential="/tmp/Endpoint_SlaveEndpointTest_NoAuthorizer_0_zpUbpK/credential"
--default_role="*" --disk_watch_interval="1mins" --docker="docker" --docker_kill_orphans="true"
--docker_registry="https://registry-1.docker.io" --docker_remove_delay="6hrs" --docker_socket="/var/run/docker.sock"
--docker_stop_timeout="0ns" --docker_store_dir="/tmp/Endpoint_SlaveEndpointTest_NoAuthorizer_0_zpUbpK/store/docker"
--docker_volume_checkpoint_dir="/var/run/mesos/isolators/docker/volume" --enforce_container_disk_quota="false"
--executor_registration_timeout="1mins" --executor_reregistration_timeout="2secs" --executor_secret_key="/tmp/Endpoint_SlaveEndpointTest_NoAuthorizer_0_zpUbpK/executor_secret_key"
--executor_shutdown_grace_period="5secs" --fetcher_cache_dir="/tmp/Endpoint_SlaveEndpointTest_NoAuthorizer_0_zpUbpK/fetch"
--fetcher_cache_size="2GB" --frameworks_home="" --gc_delay="1weeks" --gc_disk_headroom="0.1"
--hadoop_home="" --help="false" --hostname_lookup="true" --http_command_executor="false" --http_credentials="/tmp/Endpoint_SlaveEndpointTest_NoAuthorizer_0_zpUbpK/http_credentials"
--http_heartbeat_interval="30secs" --initialize_driver_logging="true" --isolation="posix/cpu,posix/mem"
--launcher="posix" --launcher_dir="/mesos/mesos-1.4.0/_build/src" --logbufsecs="0" --logging_level="INFO"
--max_completed_executors_per_framework="150" --oversubscribed_resources_interval="15secs"
--perf_duration="10secs" --perf_interval="1mins" --port="5051" --qos_correction_interval_min="0ns"
--quiet="false" --recover="reconnect" --recovery_timeout="15mins" --registration_backoff_factor="10ms"
--resources="cpus:2;gpus:0;mem:1024;disk:1024;ports:[31000-32000]" --revocable_cpu_low_priority="true"
--runtime_dir="/tmp/Endpoint_SlaveEndpointTest_NoAuthorizer_0_zpUbpK" --sandbox_directory="/mnt/mesos/sandbox"
--strict="true" --switch_user="true" --systemd_enable_support="true" --systemd_runtime_directory="/run/systemd/system"
--version="false" --work_dir="/tmp/Endpoint_SlaveEndpointTest_NoAuthorizer_0_hhZGwV"
I0728 20:30:15.880012 26443 credentials.hpp:86] Loading credential for authentication from
'/tmp/Endpoint_SlaveEndpointTest_NoAuthorizer_0_zpUbpK/credential'
I0728 20:30:15.880264 26443 slave.cpp:283] Agent using credential for: test-principal
I0728 20:30:15.880293 26443 credentials.hpp:37] Loading credentials for authentication from
'/tmp/Endpoint_SlaveEndpointTest_NoAuthorizer_0_zpUbpK/http_credentials'
I0728 20:30:15.880678 26443 http.cpp:993] Creating default 'basic' HTTP authenticator for
realm 'mesos-agent-executor'
I0728 20:30:15.880828 26443 http.cpp:1014] Creating default 'jwt' HTTP authenticator for realm
'mesos-agent-executor'
I0728 20:30:15.881065 26443 http.cpp:993] Creating default 'basic' HTTP authenticator for
realm 'mesos-agent-readonly'
I0728 20:30:15.881201 26443 http.cpp:1014] Creating default 'jwt' HTTP authenticator for realm
'mesos-agent-readonly'
I0728 20:30:15.881428 26443 http.cpp:993] Creating default 'basic' HTTP authenticator for
realm 'mesos-agent-readwrite'
I0728 20:30:15.881552 26443 http.cpp:1014] Creating default 'jwt' HTTP authenticator for realm
'mesos-agent-readwrite'
I0728 20:30:15.883205 26443 slave.cpp:565] Agent resources: [{"name":"cpus","scalar":{"value":2.0},"type":"SCALAR"},{"name":"mem","scalar":{"value":1024.0},"type":"SCALAR"},{"name":"disk","scalar":{"value":1024.0},"type":"SCALAR"},{"name":"ports","ranges":{"range":[{"begin":31000,"end":32000}]},"type":"RANGES"}]
I0728 20:30:15.883491 26443 slave.cpp:573] Agent attributes: [  ]
I0728 20:30:15.883510 26443 slave.cpp:582] Agent hostname: 57d9a1ee2cf7
I0728 20:30:15.883656 26448 status_update_manager.cpp:177] Pausing sending status updates
I0728 20:30:15.885097 26433 state.cpp:64] Recovering state from '/tmp/Endpoint_SlaveEndpointTest_NoAuthorizer_0_hhZGwV/meta'
I0728 20:30:15.885489 26444 status_update_manager.cpp:203] Recovering status update manager
I0728 20:30:15.885757 26441 containerizer.cpp:582] Recovering containerizer
I0728 20:30:15.887519 26446 provisioner.cpp:416] Provisioner recovery complete
I0728 20:30:15.887967 26439 slave.cpp:6207] Finished recovery
I0728 20:30:15.888556 26439 slave.cpp:6389] Querying resource estimator for oversubscribable
resources
I0728 20:30:15.888824 26440 slave.cpp:6403] Received oversubscribable resources {} from the
resource estimator
I0728 20:30:15.891481 26436 process.cpp:3836] Handling HTTP event for process 'slave(805)'
with path: '/slave(805)/monitor/statistics'
I0728 20:30:15.893739 26444 http.cpp:1133] HTTP GET for /slave(805)/monitor/statistics from
172.17.0.2:41178
I0728 20:30:15.893829 26444 http.cpp:957] Authorizing principal 'test-principal' to GET the
'/monitor/statistics' endpoint
I0728 20:30:15.898104 26447 slave.cpp:843] Agent terminating
[       OK ] Endpoint/SlaveEndpointTest.NoAuthorizer/0 (36 ms)
[ RUN      ] Endpoint/SlaveEndpointTest.NoAuthorizer/1
I0728 20:30:15.911401  7538 containerizer.cpp:230] Using isolation: posix/cpu,posix/mem,filesystem/posix,network/cni,environment_secret
W0728 20:30:15.911964  7538 backend.cpp:76] Failed to create 'aufs' backend: AufsBackend requires
root privileges
W0728 20:30:15.912084  7538 backend.cpp:76] Failed to create 'bind' backend: BindBackend requires
root privileges
I0728 20:30:15.912122  7538 provisioner.cpp:255] Using default backend 'copy'
I0728 20:30:15.913997  7538 cluster.cpp:448] Creating default 'local' authorizer
I0728 20:30:15.915804 26440 slave.cpp:250] Mesos agent started on (806)@172.17.0.2:52498
I0728 20:30:15.915833 26440 slave.cpp:251] Flags at startup: --acls="" --appc_simple_discovery_uri_prefix="http://"
--appc_store_dir="/tmp/Endpoint_SlaveEndpointTest_NoAuthorizer_1_MT5Ff2/store/appc" --authenticate_http_executors="true"
--authenticate_http_readonly="true" --authenticate_http_readwrite="true" --authenticatee="crammd5"
--authentication_backoff_factor="1secs" --authorizer="local" --cgroups_cpu_enable_pids_and_tids_count="false"
--cgroups_enable_cfs="false" --cgroups_hierarchy="/sys/fs/cgroup" --cgroups_limit_swap="false"
--cgroups_root="mesos" --container_disk_watch_interval="15secs" --containerizers="mesos" --credential="/tmp/Endpoint_SlaveEndpointTest_NoAuthorizer_1_MT5Ff2/credential"
--default_role="*" --disk_watch_interval="1mins" --docker="docker" --docker_kill_orphans="true"
--docker_registry="https://registry-1.docker.io" --docker_remove_delay="6hrs" --docker_socket="/var/run/docker.sock"
--docker_stop_timeout="0ns" --docker_store_dir="/tmp/Endpoint_SlaveEndpointTest_NoAuthorizer_1_MT5Ff2/store/docker"
--docker_volume_checkpoint_dir="/var/run/mesos/isolators/docker/volume" --enforce_container_disk_quota="false"
--executor_registration_timeout="1mins" --executor_reregistration_timeout="2secs" --executor_secret_key="/tmp/Endpoint_SlaveEndpointTest_NoAuthorizer_1_MT5Ff2/executor_secret_key"
--executor_shutdown_grace_period="5secs" --fetcher_cache_dir="/tmp/Endpoint_SlaveEndpointTest_NoAuthorizer_1_MT5Ff2/fetch"
--fetcher_cache_size="2GB" --frameworks_home="" --gc_delay="1weeks" --gc_disk_headroom="0.1"
--hadoop_home="" --help="false" --hostname_lookup="true" --http_command_executor="false" --http_credentials="/tmp/Endpoint_SlaveEndpointTest_NoAuthorizer_1_MT5Ff2/http_credentials"
--http_heartbeat_interval="30secs" --initialize_driver_logging="true" --isolation="posix/cpu,posix/mem"
--launcher="posix" --launcher_dir="/mesos/mesos-1.4.0/_build/src" --logbufsecs="0" --logging_level="INFO"
--max_completed_executors_per_framework="150" --oversubscribed_resources_interval="15secs"
--perf_duration="10secs" --perf_interval="1mins" --port="5051" --qos_correction_interval_min="0ns"
--quiet="false" --recover="reconnect" --recovery_timeout="15mins" --registration_backoff_factor="10ms"
--resources="cpus:2;gpus:0;mem:1024;disk:1024;ports:[31000-32000]" --revocable_cpu_low_priority="true"
--runtime_dir="/tmp/Endpoint_SlaveEndpointTest_NoAuthorizer_1_MT5Ff2" --sandbox_directory="/mnt/mesos/sandbox"
--strict="true" --switch_user="true" --systemd_enable_support="true" --systemd_runtime_directory="/run/systemd/system"
--version="false" --work_dir="/tmp/Endpoint_SlaveEndpointTest_NoAuthorizer_1_RNCahd"
I0728 20:30:15.916443 26440 credentials.hpp:86] Loading credential for authentication from
'/tmp/Endpoint_SlaveEndpointTest_NoAuthorizer_1_MT5Ff2/credential'
I0728 20:30:15.916581 26440 slave.cpp:283] Agent using credential for: test-principal
I0728 20:30:15.916601 26440 credentials.hpp:37] Loading credentials for authentication from
'/tmp/Endpoint_SlaveEndpointTest_NoAuthorizer_1_MT5Ff2/http_credentials'
I0728 20:30:15.916852 26440 http.cpp:993] Creating default 'basic' HTTP authenticator for
realm 'mesos-agent-executor'
I0728 20:30:15.916944 26440 http.cpp:1014] Creating default 'jwt' HTTP authenticator for realm
'mesos-agent-executor'
I0728 20:30:15.917091 26440 http.cpp:993] Creating default 'basic' HTTP authenticator for
realm 'mesos-agent-readonly'
I0728 20:30:15.917170 26440 http.cpp:1014] Creating default 'jwt' HTTP authenticator for realm
'mesos-agent-readonly'
I0728 20:30:15.917315 26440 http.cpp:993] Creating default 'basic' HTTP authenticator for
realm 'mesos-agent-readwrite'
I0728 20:30:15.917392 26440 http.cpp:1014] Creating default 'jwt' HTTP authenticator for realm
'mesos-agent-readwrite'
I0728 20:30:15.918577 26440 slave.cpp:565] Agent resources: [{"name":"cpus","scalar":{"value":2.0},"type":"SCALAR"},{"name":"mem","scalar":{"value":1024.0},"type":"SCALAR"},{"name":"disk","scalar":{"value":1024.0},"type":"SCALAR"},{"name":"ports","ranges":{"range":[{"begin":31000,"end":32000}]},"type":"RANGES"}]
I0728 20:30:15.918865 26440 slave.cpp:573] Agent attributes: [  ]
I0728 20:30:15.918884 26440 slave.cpp:582] Agent hostname: 57d9a1ee2cf7
I0728 20:30:15.919061 26437 status_update_manager.cpp:177] Pausing sending status updates
I0728 20:30:15.920593 26447 state.cpp:64] Recovering state from '/tmp/Endpoint_SlaveEndpointTest_NoAuthorizer_1_RNCahd/meta'
I0728 20:30:15.920999 26436 status_update_manager.cpp:203] Recovering status update manager
I0728 20:30:15.921217 26446 containerizer.cpp:582] Recovering containerizer
I0728 20:30:15.922870 26436 provisioner.cpp:416] Provisioner recovery complete
I0728 20:30:15.923285 26438 slave.cpp:6207] Finished recovery
I0728 20:30:15.923775 26438 slave.cpp:6389] Querying resource estimator for oversubscribable
resources
I0728 20:30:15.923985 26440 slave.cpp:6403] Received oversubscribable resources {} from the
resource estimator
I0728 20:30:15.926059 26437 process.cpp:3836] Handling HTTP event for process 'slave(806)'
with path: '/slave(806)/monitor/statistics.json'
I0728 20:30:15.927997 26441 http.cpp:1133] HTTP GET for /slave(806)/monitor/statistics.json
from 172.17.0.2:41179
I0728 20:30:15.928108 26441 http.cpp:957] Authorizing principal 'test-principal' to GET the
'/monitor/statistics.json' endpoint
I0728 20:30:15.931510 26438 slave.cpp:843] Agent terminating
[       OK ] Endpoint/SlaveEndpointTest.NoAuthorizer/1 (33 ms)
[ RUN      ] Endpoint/SlaveEndpointTest.NoAuthorizer/2
I0728 20:30:15.943888  7538 containerizer.cpp:230] Using isolation: posix/cpu,posix/mem,filesystem/posix,network/cni,environment_secret
W0728 20:30:15.944357  7538 backend.cpp:76] Failed to create 'aufs' backend: AufsBackend requires
root privileges
W0728 20:30:15.944447  7538 backend.cpp:76] Failed to create 'bind' backend: BindBackend requires
root privileges
I0728 20:30:15.944476  7538 provisioner.cpp:255] Using default backend 'copy'
I0728 20:30:15.946008  7538 cluster.cpp:448] Creating default 'local' authorizer
I0728 20:30:15.947440 26447 slave.cpp:250] Mesos agent started on (807)@172.17.0.2:52498
I0728 20:30:15.947465 26447 slave.cpp:251] Flags at startup: --acls="" --appc_simple_discovery_uri_prefix="http://"
--appc_store_dir="/tmp/Endpoint_SlaveEndpointTest_NoAuthorizer_2_uYv8rk/store/appc" --authenticate_http_executors="true"
--authenticate_http_readonly="true" --authenticate_http_readwrite="true" --authenticatee="crammd5"
--authentication_backoff_factor="1secs" --authorizer="local" --cgroups_cpu_enable_pids_and_tids_count="false"
--cgroups_enable_cfs="false" --cgroups_hierarchy="/sys/fs/cgroup" --cgroups_limit_swap="false"
--cgroups_root="mesos" --container_disk_watch_interval="15secs" --containerizers="mesos" --credential="/tmp/Endpoint_SlaveEndpointTest_NoAuthorizer_2_uYv8rk/credential"
--default_role="*" --disk_watch_interval="1mins" --docker="docker" --docker_kill_orphans="true"
--docker_registry="https://registry-1.docker.io" --docker_remove_delay="6hrs" --docker_socket="/var/run/docker.sock"
--docker_stop_timeout="0ns" --docker_store_dir="/tmp/Endpoint_SlaveEndpointTest_NoAuthorizer_2_uYv8rk/store/docker"
--docker_volume_checkpoint_dir="/var/run/mesos/isolators/docker/volume" --enforce_container_disk_quota="false"
--executor_registration_timeout="1mins" --executor_reregistration_timeout="2secs" --executor_secret_key="/tmp/Endpoint_SlaveEndpointTest_NoAuthorizer_2_uYv8rk/executor_secret_key"
--executor_shutdown_grace_period="5secs" --fetcher_cache_dir="/tmp/Endpoint_SlaveEndpointTest_NoAuthorizer_2_uYv8rk/fetch"
--fetcher_cache_size="2GB" --frameworks_home="" --gc_delay="1weeks" --gc_disk_headroom="0.1"
--hadoop_home="" --help="false" --hostname_lookup="true" --http_command_executor="false" --http_credentials="/tmp/Endpoint_SlaveEndpointTest_NoAuthorizer_2_uYv8rk/http_credentials"
--http_heartbeat_interval="30secs" --initialize_driver_logging="true" --isolation="posix/cpu,posix/mem"
--launcher="posix" --launcher_dir="/mesos/mesos-1.4.0/_build/src" --logbufsecs="0" --logging_level="INFO"
--max_completed_executors_per_framework="150" --oversubscribed_resources_interval="15secs"
--perf_duration="10secs" --perf_interval="1mins" --port="5051" --qos_correction_interval_min="0ns"
--quiet="false" --recover="reconnect" --recovery_timeout="15mins" --registration_backoff_factor="10ms"
--resources="cpus:2;gpus:0;mem:1024;disk:1024;ports:[31000-32000]" --revocable_cpu_low_priority="true"
--runtime_dir="/tmp/Endpoint_SlaveEndpointTest_NoAuthorizer_2_uYv8rk" --sandbox_directory="/mnt/mesos/sandbox"
--strict="true" --switch_user="true" --systemd_enable_support="true" --systemd_runtime_directory="/run/systemd/system"
--version="false" --work_dir="/tmp/Endpoint_SlaveEndpointTest_NoAuthorizer_2_UJIdov"
I0728 20:30:15.948006 26447 credentials.hpp:86] Loading credential for authentication from
'/tmp/Endpoint_SlaveEndpointTest_NoAuthorizer_2_uYv8rk/credential'
I0728 20:30:15.948164 26447 slave.cpp:283] Agent using credential for: test-principal
I0728 20:30:15.948187 26447 credentials.hpp:37] Loading credentials for authentication from
'/tmp/Endpoint_SlaveEndpointTest_NoAuthorizer_2_uYv8rk/http_credentials'
I0728 20:30:15.948449 26447 http.cpp:993] Creating default 'basic' HTTP authenticator for
realm 'mesos-agent-executor'
I0728 20:30:15.948549 26447 http.cpp:1014] Creating default 'jwt' HTTP authenticator for realm
'mesos-agent-executor'
I0728 20:30:15.948704 26447 http.cpp:993] Creating default 'basic' HTTP authenticator for
realm 'mesos-agent-readonly'
I0728 20:30:15.948783 26447 http.cpp:1014] Creating default 'jwt' HTTP authenticator for realm
'mesos-agent-readonly'
I0728 20:30:15.948925 26447 http.cpp:993] Creating default 'basic' HTTP authenticator for
realm 'mesos-agent-readwrite'
I0728 20:30:15.949005 26447 http.cpp:1014] Creating default 'jwt' HTTP authenticator for realm
'mesos-agent-readwrite'
I0728 20:30:15.950224 26447 slave.cpp:565] Agent resources: [{"name":"cpus","scalar":{"value":2.0},"type":"SCALAR"},{"name":"mem","scalar":{"value":1024.0},"type":"SCALAR"},{"name":"disk","scalar":{"value":1024.0},"type":"SCALAR"},{"name":"ports","ranges":{"range":[{"begin":31000,"end":32000}]},"type":"RANGES"}]
I0728 20:30:15.950434 26447 slave.cpp:573] Agent attributes: [  ]
I0728 20:30:15.950450 26447 slave.cpp:582] Agent hostname: 57d9a1ee2cf7
I0728 20:30:15.950589 26433 status_update_manager.cpp:177] Pausing sending status updates
I0728 20:30:15.952078 26436 state.cpp:64] Recovering state from '/tmp/Endpoint_SlaveEndpointTest_NoAuthorizer_2_UJIdov/meta'
I0728 20:30:15.952451 26446 status_update_manager.cpp:203] Recovering status update manager
I0728 20:30:15.952677 26444 containerizer.cpp:582] Recovering containerizer
I0728 20:30:15.954071 26446 provisioner.cpp:416] Provisioner recovery complete
I0728 20:30:15.954397 26439 slave.cpp:6207] Finished recovery
I0728 20:30:15.954926 26439 slave.cpp:6389] Querying resource estimator for oversubscribable
resources
I0728 20:30:15.955188 26443 slave.cpp:6403] Received oversubscribable resources {} from the
resource estimator
I0728 20:30:15.957343 26433 process.cpp:3836] Handling HTTP event for process 'slave(807)'
with path: '/slave(807)/containers'
I0728 20:30:15.959512 26435 http.cpp:1133] HTTP GET for /slave(807)/containers from 172.17.0.2:41180
I0728 20:30:15.959606 26435 http.cpp:957] Authorizing principal 'test-principal' to GET the
'/containers' endpoint
I0728 20:30:15.963642 26440 slave.cpp:843] Agent terminating
[       OK ] Endpoint/SlaveEndpointTest.NoAuthorizer/2 (30 ms)
[----------] 9 tests from Endpoint/SlaveEndpointTest (304 ms total)

[----------] Global test environment tear-down
[==========] 1657 tests from 183 test cases ran. (502129 ms total)
[  PASSED  ] 1656 tests.
[  FAILED  ] 1 test, listed below:
[  FAILED  ] MasterTest.IgnoreOldAgentReregistration

 1 FAILED TEST
  YOU HAVE 20 DISABLED TESTS

I0728 20:30:16.034404 26449 process.cpp:1006] Failed to accept socket: future discarded
make[4]: *** [check-local] Error 1
make[4]: Leaving directory `/mesos/mesos-1.4.0/_build/src'
make[3]: *** [check-am] Error 2
make[3]: Leaving directory `/mesos/mesos-1.4.0/_build/src'
make[2]: *** [check] Error 2
make[2]: Leaving directory `/mesos/mesos-1.4.0/_build/src'
make[1]: *** [check-recursive] Error 1
make[1]: Leaving directory `/mesos/mesos-1.4.0/_build'
make: *** [distcheck] Error 1
+ docker rmi mesos-1501270422-23961
Untagged: mesos-1501270422-23961:latest
Deleted: sha256:37db661437ca13a1f975d4eedb77e6b7da1c5b640d05090afba3cdbf17129815
Deleted: sha256:91f053370895019d59c1e975c6c6dfe23ed37d184dd641ed20db91f7c6bc36b1
Deleted: sha256:47ab1ac916a1bc742a0ada01035cc6d8e92a4317e49e916fb3d65c6bfdb4ad7f
Deleted: sha256:b1cb7e427ba503ae442fb52e92e6cc1d38cc8c299437812ac7a23cff5ec79573
Deleted: sha256:aa5584638e7b2182dc9aa86a0baa65acc90a7d526e1eda59e17db7462e63f7f0
Deleted: sha256:0fd2dfb294fcd83fcb5eaaa0bdc8538665bb10c96a7ca6e1ecbe480e73a16f5a
Deleted: sha256:357a1b5eae9b4e9f0af2ae890e8be3306b441d671d2d9b20b4dc3553faf71ced
Deleted: sha256:dae4f0e4f6c53f2a0e5550307ec31b76e3f9803bcd393e159af3f8fb4a4ed9a2
Deleted: sha256:cd788beb138eaa4c44f2dff3a26b84853b15e92b8cd608643f47a22eca81ea6f
Deleted: sha256:3800b9ba95db0c277b79cccf1f78ea0c749d3327b5b2d35d9fa8914a879abdd4
Deleted: sha256:02f989b282709fea49f1269b3d93ee81a3025295546226672b968a9957206434
Deleted: sha256:eead7be684a6432bf6d039aaee94596c39a501a916589c0b1863b721eb77369f
Deleted: sha256:ad96abd58e4e8db2e5e3d44084430f57cb56866c798f8655d934a246a85ed4aa
Deleted: sha256:e95588921a9a085791a10bf72a777e84962c32e928c03062352995a1e716b636
Deleted: sha256:c9ab0f2c9bec26b181ce24883c8b9c1f0f25974a927626b93f0c09323a697a9c
Deleted: sha256:b9236066d72c9beb1739749147a9e5d8040827419adeace0316a9359ad6e02c2
Deleted: sha256:15dbe62ba990f844e0a8abe98b3a21d07195d639bee525f2394fdf6b8e99929f
Deleted: sha256:4d96c2fe0f512228f30252e91fdf9af15efb13fe22c5b24bd59ce30ea345e16d
Deleted: sha256:388c89586d4587c2f9c9dfe083e5f059d34f4f3a5ddd0f91de08dd684c81e48c
Deleted: sha256:7eb4cdce5db87c8535a6896bfd8ec3fb768ad3d47882978036b5cc2b28b6dbfd
Deleted: sha256:b012fa84fbbaba02a71d2b15dd992ca9facc7b1779cfec7b38456956a17a1de9
Deleted: sha256:88c64f9fdc866f72d6ab2c44781246eee08b245f62320f1bcae57a2bb8e0ed13
Deleted: sha256:a318c0ea3bcab7095ce3b815650ce78ed47d6bef4e5949f5c187ea9c32b95f25
Deleted: sha256:8b1f94a4c4598899773cda3a913d55f565d96bc9e7477b485fe9fab427c82ce1
Build step 'Execute shell' marked build as failure
Not sending mail to unregistered user songzihao1990@gmail.com

Mime
View raw message