mesos-builds mailing list archives

Site index · List index
Message view « Date » · « Thread »
Top « Date » · « Thread »
From Apache Jenkins Server <jenk...@builds.apache.org>
Subject Build failed in Jenkins: Mesos-Buildbot » autotools,gcc,--verbose --enable-libevent --enable-ssl,GLOG_v=1 MESOS_VERBOSE=1,centos:7,(ubuntu)&&(!ubuntu-us1)&&(!ubuntu-eu2) #3951
Date Tue, 25 Jul 2017 05:14:37 GMT
See <https://builds.apache.org/job/Mesos-Buildbot/BUILDTOOL=autotools,COMPILER=gcc,CONFIGURATION=--verbose%20--enable-libevent%20--enable-ssl,ENVIRONMENT=GLOG_v=1%20MESOS_VERBOSE=1,OS=centos%3A7,label_exp=(ubuntu)&&(!ubuntu-us1)&&(!ubuntu-eu2)/3951/display/redirect>

------------------------------------------
[...truncated 31.37 MB...]
[ RUN      ] Endpoint/SlaveEndpointTest.UnauthorizedRequest/0
I0725 05:14:27.709616  9234 containerizer.cpp:230] Using isolation: posix/cpu,posix/mem,filesystem/posix,network/cni,environment_secret
W0725 05:14:27.710132  9234 backend.cpp:76] Failed to create 'aufs' backend: AufsBackend requires
root privileges
W0725 05:14:27.710250  9234 backend.cpp:76] Failed to create 'bind' backend: BindBackend requires
root privileges
I0725 05:14:27.710294  9234 provisioner.cpp:255] Using default backend 'copy'
I0725 05:14:27.713330 30007 slave.cpp:250] Mesos agent started on (796)@172.17.0.6:46247
I0725 05:14:27.713352 30007 slave.cpp:251] Flags at startup: --acls="" --appc_simple_discovery_uri_prefix="http://"
--appc_store_dir="/tmp/Endpoint_SlaveEndpointTest_UnauthorizedRequest_0_1HMuvq/store/appc"
--authenticate_http_executors="true" --authenticate_http_readonly="true" --authenticate_http_readwrite="true"
--authenticatee="crammd5" --authentication_backoff_factor="1secs" --authorizer="local" --cgroups_cpu_enable_pids_and_tids_count="false"
--cgroups_enable_cfs="false" --cgroups_hierarchy="/sys/fs/cgroup" --cgroups_limit_swap="false"
--cgroups_root="mesos" --container_disk_watch_interval="15secs" --containerizers="mesos" --credential="/tmp/Endpoint_SlaveEndpointTest_UnauthorizedRequest_0_1HMuvq/credential"
--default_role="*" --disk_watch_interval="1mins" --docker="docker" --docker_kill_orphans="true"
--docker_registry="https://registry-1.docker.io" --docker_remove_delay="6hrs" --docker_socket="/var/run/docker.sock"
--docker_stop_timeout="0ns" --docker_store_dir="/tmp/Endpoint_SlaveEndpointTest_UnauthorizedRequest_0_1HMuvq/store/docker"
--docker_volume_checkpoint_dir="/var/run/mesos/isolators/docker/volume" --enforce_container_disk_quota="false"
--executor_registration_timeout="1mins" --executor_reregistration_timeout="2secs" --executor_secret_key="/tmp/Endpoint_SlaveEndpointTest_UnauthorizedRequest_0_1HMuvq/executor_secret_key"
--executor_shutdown_grace_period="5secs" --fetcher_cache_dir="/tmp/Endpoint_SlaveEndpointTest_UnauthorizedRequest_0_1HMuvq/fetch"
--fetcher_cache_size="2GB" --frameworks_home="" --gc_delay="1weeks" --gc_disk_headroom="0.1"
--hadoop_home="" --help="false" --hostname_lookup="true" --http_command_executor="false" --http_credentials="/tmp/Endpoint_SlaveEndpointTest_UnauthorizedRequest_0_1HMuvq/http_credentials"
--http_heartbeat_interval="30secs" --initialize_driver_logging="true" --isolation="posix/cpu,posix/mem"
--launcher="posix" --launcher_dir="/mesos/mesos-1.4.0/_build/src" --logbufsecs="0" --logging_level="INFO"
--max_completed_executors_per_framework="150" --oversubscribed_resources_interval="15secs"
--perf_duration="10secs" --perf_interval="1mins" --port="5051" --qos_correction_interval_min="0ns"
--quiet="false" --recover="reconnect" --recovery_timeout="15mins" --registration_backoff_factor="10ms"
--resources="cpus:2;gpus:0;mem:1024;disk:1024;ports:[31000-32000]" --revocable_cpu_low_priority="true"
--runtime_dir="/tmp/Endpoint_SlaveEndpointTest_UnauthorizedRequest_0_1HMuvq" --sandbox_directory="/mnt/mesos/sandbox"
--strict="true" --switch_user="true" --systemd_enable_support="true" --systemd_runtime_directory="/run/systemd/system"
--version="false" --work_dir="/tmp/Endpoint_SlaveEndpointTest_UnauthorizedRequest_0_ttgTJB"
I0725 05:14:27.713788 30007 credentials.hpp:86] Loading credential for authentication from
'/tmp/Endpoint_SlaveEndpointTest_UnauthorizedRequest_0_1HMuvq/credential'
I0725 05:14:27.713953 30007 slave.cpp:283] Agent using credential for: test-principal
I0725 05:14:27.713977 30007 credentials.hpp:37] Loading credentials for authentication from
'/tmp/Endpoint_SlaveEndpointTest_UnauthorizedRequest_0_1HMuvq/http_credentials'
I0725 05:14:27.714324 30007 http.cpp:993] Creating default 'basic' HTTP authenticator for
realm 'mesos-agent-executor'
I0725 05:14:27.714455 30007 http.cpp:1014] Creating default 'jwt' HTTP authenticator for realm
'mesos-agent-executor'
I0725 05:14:27.714658 30007 http.cpp:993] Creating default 'basic' HTTP authenticator for
realm 'mesos-agent-readonly'
I0725 05:14:27.714776 30007 http.cpp:1014] Creating default 'jwt' HTTP authenticator for realm
'mesos-agent-readonly'
I0725 05:14:27.714943 30007 http.cpp:993] Creating default 'basic' HTTP authenticator for
realm 'mesos-agent-readwrite'
I0725 05:14:27.715029 30007 http.cpp:1014] Creating default 'jwt' HTTP authenticator for realm
'mesos-agent-readwrite'
I0725 05:14:27.716372 30007 slave.cpp:565] Agent resources: [{"name":"cpus","scalar":{"value":2.0},"type":"SCALAR"},{"name":"mem","scalar":{"value":1024.0},"type":"SCALAR"},{"name":"disk","scalar":{"value":1024.0},"type":"SCALAR"},{"name":"ports","ranges":{"range":[{"begin":31000,"end":32000}]},"type":"RANGES"}]
I0725 05:14:27.716605 30007 slave.cpp:573] Agent attributes: [  ]
I0725 05:14:27.716621 30007 slave.cpp:582] Agent hostname: 3cbb5ca770bf
I0725 05:14:27.716738 30018 status_update_manager.cpp:177] Pausing sending status updates
I0725 05:14:27.718061 30010 state.cpp:64] Recovering state from '/tmp/Endpoint_SlaveEndpointTest_UnauthorizedRequest_0_ttgTJB/meta'
I0725 05:14:27.718384 30009 status_update_manager.cpp:203] Recovering status update manager
I0725 05:14:27.718562 30025 containerizer.cpp:582] Recovering containerizer
I0725 05:14:27.719841 30021 provisioner.cpp:416] Provisioner recovery complete
I0725 05:14:27.720160 30015 slave.cpp:6207] Finished recovery
I0725 05:14:27.720643 30015 slave.cpp:6389] Querying resource estimator for oversubscribable
resources
I0725 05:14:27.720882 30013 slave.cpp:6403] Received oversubscribable resources {} from the
resource estimator
I0725 05:14:27.722781 30012 process.cpp:3837] Handling HTTP event for process 'slave(796)'
with path: '/slave(796)/monitor/statistics'
I0725 05:14:27.724391 30009 http.cpp:1133] HTTP GET for /slave(796)/monitor/statistics from
172.17.0.6:48174
I0725 05:14:27.724464 30009 http.cpp:957] Authorizing principal 'test-principal' to GET the
'/monitor/statistics' endpoint
I0725 05:14:27.726344 30015 slave.cpp:843] Agent terminating
[       OK ] Endpoint/SlaveEndpointTest.UnauthorizedRequest/0 (26 ms)
[ RUN      ] Endpoint/SlaveEndpointTest.UnauthorizedRequest/1
I0725 05:14:27.736208  9234 containerizer.cpp:230] Using isolation: posix/cpu,posix/mem,filesystem/posix,network/cni,environment_secret
W0725 05:14:27.736697  9234 backend.cpp:76] Failed to create 'aufs' backend: AufsBackend requires
root privileges
W0725 05:14:27.736791  9234 backend.cpp:76] Failed to create 'bind' backend: BindBackend requires
root privileges
I0725 05:14:27.736829  9234 provisioner.cpp:255] Using default backend 'copy'
I0725 05:14:27.739919 30025 slave.cpp:250] Mesos agent started on (797)@172.17.0.6:46247
I0725 05:14:27.739943 30025 slave.cpp:251] Flags at startup: --acls="" --appc_simple_discovery_uri_prefix="http://"
--appc_store_dir="/tmp/Endpoint_SlaveEndpointTest_UnauthorizedRequest_1_hnSsNH/store/appc"
--authenticate_http_executors="true" --authenticate_http_readonly="true" --authenticate_http_readwrite="true"
--authenticatee="crammd5" --authentication_backoff_factor="1secs" --authorizer="local" --cgroups_cpu_enable_pids_and_tids_count="false"
--cgroups_enable_cfs="false" --cgroups_hierarchy="/sys/fs/cgroup" --cgroups_limit_swap="false"
--cgroups_root="mesos" --container_disk_watch_interval="15secs" --containerizers="mesos" --credential="/tmp/Endpoint_SlaveEndpointTest_UnauthorizedRequest_1_hnSsNH/credential"
--default_role="*" --disk_watch_interval="1mins" --docker="docker" --docker_kill_orphans="true"
--docker_registry="https://registry-1.docker.io" --docker_remove_delay="6hrs" --docker_socket="/var/run/docker.sock"
--docker_stop_timeout="0ns" --docker_store_dir="/tmp/Endpoint_SlaveEndpointTest_UnauthorizedRequest_1_hnSsNH/store/docker"
--docker_volume_checkpoint_dir="/var/run/mesos/isolators/docker/volume" --enforce_container_disk_quota="false"
--executor_registration_timeout="1mins" --executor_reregistration_timeout="2secs" --executor_secret_key="/tmp/Endpoint_SlaveEndpointTest_UnauthorizedRequest_1_hnSsNH/executor_secret_key"
--executor_shutdown_grace_period="5secs" --fetcher_cache_dir="/tmp/Endpoint_SlaveEndpointTest_UnauthorizedRequest_1_hnSsNH/fetch"
--fetcher_cache_size="2GB" --frameworks_home="" --gc_delay="1weeks" --gc_disk_headroom="0.1"
--hadoop_home="" --help="false" --hostname_lookup="true" --http_command_executor="false" --http_credentials="/tmp/Endpoint_SlaveEndpointTest_UnauthorizedRequest_1_hnSsNH/http_credentials"
--http_heartbeat_interval="30secs" --initialize_driver_logging="true" --isolation="posix/cpu,posix/mem"
--launcher="posix" --launcher_dir="/mesos/mesos-1.4.0/_build/src" --logbufsecs="0" --logging_level="INFO"
--max_completed_executors_per_framework="150" --oversubscribed_resources_interval="15secs"
--perf_duration="10secs" --perf_interval="1mins" --port="5051" --qos_correction_interval_min="0ns"
--quiet="false" --recover="reconnect" --recovery_timeout="15mins" --registration_backoff_factor="10ms"
--resources="cpus:2;gpus:0;mem:1024;disk:1024;ports:[31000-32000]" --revocable_cpu_low_priority="true"
--runtime_dir="/tmp/Endpoint_SlaveEndpointTest_UnauthorizedRequest_1_hnSsNH" --sandbox_directory="/mnt/mesos/sandbox"
--strict="true" --switch_user="true" --systemd_enable_support="true" --systemd_runtime_directory="/run/systemd/system"
--version="false" --work_dir="/tmp/Endpoint_SlaveEndpointTest_UnauthorizedRequest_1_bveUXS"
I0725 05:14:27.740378 30025 credentials.hpp:86] Loading credential for authentication from
'/tmp/Endpoint_SlaveEndpointTest_UnauthorizedRequest_1_hnSsNH/credential'
I0725 05:14:27.740535 30025 slave.cpp:283] Agent using credential for: test-principal
I0725 05:14:27.740558 30025 credentials.hpp:37] Loading credentials for authentication from
'/tmp/Endpoint_SlaveEndpointTest_UnauthorizedRequest_1_hnSsNH/http_credentials'
I0725 05:14:27.740847 30025 http.cpp:993] Creating default 'basic' HTTP authenticator for
realm 'mesos-agent-executor'
I0725 05:14:27.740953 30025 http.cpp:1014] Creating default 'jwt' HTTP authenticator for realm
'mesos-agent-executor'
I0725 05:14:27.741116 30025 http.cpp:993] Creating default 'basic' HTTP authenticator for
realm 'mesos-agent-readonly'
I0725 05:14:27.741201 30025 http.cpp:1014] Creating default 'jwt' HTTP authenticator for realm
'mesos-agent-readonly'
I0725 05:14:27.741349 30025 http.cpp:993] Creating default 'basic' HTTP authenticator for
realm 'mesos-agent-readwrite'
I0725 05:14:27.741439 30025 http.cpp:1014] Creating default 'jwt' HTTP authenticator for realm
'mesos-agent-readwrite'
I0725 05:14:27.742806 30025 slave.cpp:565] Agent resources: [{"name":"cpus","scalar":{"value":2.0},"type":"SCALAR"},{"name":"mem","scalar":{"value":1024.0},"type":"SCALAR"},{"name":"disk","scalar":{"value":1024.0},"type":"SCALAR"},{"name":"ports","ranges":{"range":[{"begin":31000,"end":32000}]},"type":"RANGES"}]
I0725 05:14:27.743052 30025 slave.cpp:573] Agent attributes: [  ]
I0725 05:14:27.743068 30025 slave.cpp:582] Agent hostname: 3cbb5ca770bf
I0725 05:14:27.743211 30026 status_update_manager.cpp:177] Pausing sending status updates
I0725 05:14:27.744527 30022 state.cpp:64] Recovering state from '/tmp/Endpoint_SlaveEndpointTest_UnauthorizedRequest_1_bveUXS/meta'
I0725 05:14:27.744792 30020 status_update_manager.cpp:203] Recovering status update manager
I0725 05:14:27.744989 30006 containerizer.cpp:582] Recovering containerizer
I0725 05:14:27.746273 30013 provisioner.cpp:416] Provisioner recovery complete
I0725 05:14:27.746621 30012 slave.cpp:6207] Finished recovery
I0725 05:14:27.747040 30012 slave.cpp:6389] Querying resource estimator for oversubscribable
resources
I0725 05:14:27.747269 30023 slave.cpp:6403] Received oversubscribable resources {} from the
resource estimator
I0725 05:14:27.749467 30011 process.cpp:3837] Handling HTTP event for process 'slave(797)'
with path: '/slave(797)/monitor/statistics.json'
I0725 05:14:27.751111 30020 http.cpp:1133] HTTP GET for /slave(797)/monitor/statistics.json
from 172.17.0.6:48176
I0725 05:14:27.751186 30020 http.cpp:957] Authorizing principal 'test-principal' to GET the
'/monitor/statistics.json' endpoint
I0725 05:14:27.753145 30016 slave.cpp:843] Agent terminating
[       OK ] Endpoint/SlaveEndpointTest.UnauthorizedRequest/1 (27 ms)
[ RUN      ] Endpoint/SlaveEndpointTest.UnauthorizedRequest/2
I0725 05:14:27.764230  9234 containerizer.cpp:230] Using isolation: posix/cpu,posix/mem,filesystem/posix,network/cni,environment_secret
W0725 05:14:27.764853  9234 backend.cpp:76] Failed to create 'aufs' backend: AufsBackend requires
root privileges
W0725 05:14:27.764963  9234 backend.cpp:76] Failed to create 'bind' backend: BindBackend requires
root privileges
I0725 05:14:27.764997  9234 provisioner.cpp:255] Using default backend 'copy'
I0725 05:14:27.768394 30026 slave.cpp:250] Mesos agent started on (798)@172.17.0.6:46247
I0725 05:14:27.768427 30026 slave.cpp:251] Flags at startup: --acls="" --appc_simple_discovery_uri_prefix="http://"
--appc_store_dir="/tmp/Endpoint_SlaveEndpointTest_UnauthorizedRequest_2_LWsKlZ/store/appc"
--authenticate_http_executors="true" --authenticate_http_readonly="true" --authenticate_http_readwrite="true"
--authenticatee="crammd5" --authentication_backoff_factor="1secs" --authorizer="local" --cgroups_cpu_enable_pids_and_tids_count="false"
--cgroups_enable_cfs="false" --cgroups_hierarchy="/sys/fs/cgroup" --cgroups_limit_swap="false"
--cgroups_root="mesos" --container_disk_watch_interval="15secs" --containerizers="mesos" --credential="/tmp/Endpoint_SlaveEndpointTest_UnauthorizedRequest_2_LWsKlZ/credential"
--default_role="*" --disk_watch_interval="1mins" --docker="docker" --docker_kill_orphans="true"
--docker_registry="https://registry-1.docker.io" --docker_remove_delay="6hrs" --docker_socket="/var/run/docker.sock"
--docker_stop_timeout="0ns" --docker_store_dir="/tmp/Endpoint_SlaveEndpointTest_UnauthorizedRequest_2_LWsKlZ/store/docker"
--docker_volume_checkpoint_dir="/var/run/mesos/isolators/docker/volume" --enforce_container_disk_quota="false"
--executor_registration_timeout="1mins" --executor_reregistration_timeout="2secs" --executor_secret_key="/tmp/Endpoint_SlaveEndpointTest_UnauthorizedRequest_2_LWsKlZ/executor_secret_key"
--executor_shutdown_grace_period="5secs" --fetcher_cache_dir="/tmp/Endpoint_SlaveEndpointTest_UnauthorizedRequest_2_LWsKlZ/fetch"
--fetcher_cache_size="2GB" --frameworks_home="" --gc_delay="1weeks" --gc_disk_headroom="0.1"
--hadoop_home="" --help="false" --hostname_lookup="true" --http_command_executor="false" --http_credentials="/tmp/Endpoint_SlaveEndpointTest_UnauthorizedRequest_2_LWsKlZ/http_credentials"
--http_heartbeat_interval="30secs" --initialize_driver_logging="true" --isolation="posix/cpu,posix/mem"
--launcher="posix" --launcher_dir="/mesos/mesos-1.4.0/_build/src" --logbufsecs="0" --logging_level="INFO"
--max_completed_executors_per_framework="150" --oversubscribed_resources_interval="15secs"
--perf_duration="10secs" --perf_interval="1mins" --port="5051" --qos_correction_interval_min="0ns"
--quiet="false" --recover="reconnect" --recovery_timeout="15mins" --registration_backoff_factor="10ms"
--resources="cpus:2;gpus:0;mem:1024;disk:1024;ports:[31000-32000]" --revocable_cpu_low_priority="true"
--runtime_dir="/tmp/Endpoint_SlaveEndpointTest_UnauthorizedRequest_2_LWsKlZ" --sandbox_directory="/mnt/mesos/sandbox"
--strict="true" --switch_user="true" --systemd_enable_support="true" --systemd_runtime_directory="/run/systemd/system"
--version="false" --work_dir="/tmp/Endpoint_SlaveEndpointTest_UnauthorizedRequest_2_HVS2ra"
I0725 05:14:27.769111 30026 credentials.hpp:86] Loading credential for authentication from
'/tmp/Endpoint_SlaveEndpointTest_UnauthorizedRequest_2_LWsKlZ/credential'
I0725 05:14:27.769345 30026 slave.cpp:283] Agent using credential for: test-principal
I0725 05:14:27.769387 30026 credentials.hpp:37] Loading credentials for authentication from
'/tmp/Endpoint_SlaveEndpointTest_UnauthorizedRequest_2_LWsKlZ/http_credentials'
I0725 05:14:27.769858 30026 http.cpp:993] Creating default 'basic' HTTP authenticator for
realm 'mesos-agent-executor'
I0725 05:14:27.770018 30026 http.cpp:1014] Creating default 'jwt' HTTP authenticator for realm
'mesos-agent-executor'
I0725 05:14:27.770328 30026 http.cpp:993] Creating default 'basic' HTTP authenticator for
realm 'mesos-agent-readonly'
I0725 05:14:27.770462 30026 http.cpp:1014] Creating default 'jwt' HTTP authenticator for realm
'mesos-agent-readonly'
I0725 05:14:27.770707 30026 http.cpp:993] Creating default 'basic' HTTP authenticator for
realm 'mesos-agent-readwrite'
I0725 05:14:27.770836 30026 http.cpp:1014] Creating default 'jwt' HTTP authenticator for realm
'mesos-agent-readwrite'
I0725 05:14:27.773243 30026 slave.cpp:565] Agent resources: [{"name":"cpus","scalar":{"value":2.0},"type":"SCALAR"},{"name":"mem","scalar":{"value":1024.0},"type":"SCALAR"},{"name":"disk","scalar":{"value":1024.0},"type":"SCALAR"},{"name":"ports","ranges":{"range":[{"begin":31000,"end":32000}]},"type":"RANGES"}]
I0725 05:14:27.773669 30026 slave.cpp:573] Agent attributes: [  ]
I0725 05:14:27.773695 30026 slave.cpp:582] Agent hostname: 3cbb5ca770bf
I0725 05:14:27.773869 30006 status_update_manager.cpp:177] Pausing sending status updates
I0725 05:14:27.776084 30019 state.cpp:64] Recovering state from '/tmp/Endpoint_SlaveEndpointTest_UnauthorizedRequest_2_HVS2ra/meta'
I0725 05:14:27.776413 30011 status_update_manager.cpp:203] Recovering status update manager
I0725 05:14:27.776661 30007 containerizer.cpp:582] Recovering containerizer
I0725 05:14:27.778125 30025 provisioner.cpp:416] Provisioner recovery complete
I0725 05:14:27.778585 30026 slave.cpp:6207] Finished recovery
I0725 05:14:27.779194 30026 slave.cpp:6389] Querying resource estimator for oversubscribable
resources
I0725 05:14:27.779446 30017 slave.cpp:6403] Received oversubscribable resources {} from the
resource estimator
I0725 05:14:27.781913 30007 process.cpp:3837] Handling HTTP event for process 'slave(798)'
with path: '/slave(798)/containers'
I0725 05:14:27.783715 30020 http.cpp:1133] HTTP GET for /slave(798)/containers from 172.17.0.6:48178
I0725 05:14:27.783807 30020 http.cpp:957] Authorizing principal 'test-principal' to GET the
'/containers' endpoint
I0725 05:14:27.785670 30026 slave.cpp:843] Agent terminating
[       OK ] Endpoint/SlaveEndpointTest.UnauthorizedRequest/2 (33 ms)
[ RUN      ] Endpoint/SlaveEndpointTest.NoAuthorizer/0
I0725 05:14:27.797466  9234 containerizer.cpp:230] Using isolation: posix/cpu,posix/mem,filesystem/posix,network/cni,environment_secret
W0725 05:14:27.798017  9234 backend.cpp:76] Failed to create 'aufs' backend: AufsBackend requires
root privileges
W0725 05:14:27.798120  9234 backend.cpp:76] Failed to create 'bind' backend: BindBackend requires
root privileges
I0725 05:14:27.798156  9234 provisioner.cpp:255] Using default backend 'copy'
I0725 05:14:27.799933  9234 cluster.cpp:448] Creating default 'local' authorizer
I0725 05:14:27.801659 30015 slave.cpp:250] Mesos agent started on (799)@172.17.0.6:46247
I0725 05:14:27.801683 30015 slave.cpp:251] Flags at startup: --acls="" --appc_simple_discovery_uri_prefix="http://"
--appc_store_dir="/tmp/Endpoint_SlaveEndpointTest_NoAuthorizer_0_hzOqdh/store/appc" --authenticate_http_executors="true"
--authenticate_http_readonly="true" --authenticate_http_readwrite="true" --authenticatee="crammd5"
--authentication_backoff_factor="1secs" --authorizer="local" --cgroups_cpu_enable_pids_and_tids_count="false"
--cgroups_enable_cfs="false" --cgroups_hierarchy="/sys/fs/cgroup" --cgroups_limit_swap="false"
--cgroups_root="mesos" --container_disk_watch_interval="15secs" --containerizers="mesos" --credential="/tmp/Endpoint_SlaveEndpointTest_NoAuthorizer_0_hzOqdh/credential"
--default_role="*" --disk_watch_interval="1mins" --docker="docker" --docker_kill_orphans="true"
--docker_registry="https://registry-1.docker.io" --docker_remove_delay="6hrs" --docker_socket="/var/run/docker.sock"
--docker_stop_timeout="0ns" --docker_store_dir="/tmp/Endpoint_SlaveEndpointTest_NoAuthorizer_0_hzOqdh/store/docker"
--docker_volume_checkpoint_dir="/var/run/mesos/isolators/docker/volume" --enforce_container_disk_quota="false"
--executor_registration_timeout="1mins" --executor_reregistration_timeout="2secs" --executor_secret_key="/tmp/Endpoint_SlaveEndpointTest_NoAuthorizer_0_hzOqdh/executor_secret_key"
--executor_shutdown_grace_period="5secs" --fetcher_cache_dir="/tmp/Endpoint_SlaveEndpointTest_NoAuthorizer_0_hzOqdh/fetch"
--fetcher_cache_size="2GB" --frameworks_home="" --gc_delay="1weeks" --gc_disk_headroom="0.1"
--hadoop_home="" --help="false" --hostname_lookup="true" --http_command_executor="false" --http_credentials="/tmp/Endpoint_SlaveEndpointTest_NoAuthorizer_0_hzOqdh/http_credentials"
--http_heartbeat_interval="30secs" --initialize_driver_logging="true" --isolation="posix/cpu,posix/mem"
--launcher="posix" --launcher_dir="/mesos/mesos-1.4.0/_build/src" --logbufsecs="0" --logging_level="INFO"
--max_completed_executors_per_framework="150" --oversubscribed_resources_interval="15secs"
--perf_duration="10secs" --perf_interval="1mins" --port="5051" --qos_correction_interval_min="0ns"
--quiet="false" --recover="reconnect" --recovery_timeout="15mins" --registration_backoff_factor="10ms"
--resources="cpus:2;gpus:0;mem:1024;disk:1024;ports:[31000-32000]" --revocable_cpu_low_priority="true"
--runtime_dir="/tmp/Endpoint_SlaveEndpointTest_NoAuthorizer_0_hzOqdh" --sandbox_directory="/mnt/mesos/sandbox"
--strict="true" --switch_user="true" --systemd_enable_support="true" --systemd_runtime_directory="/run/systemd/system"
--version="false" --work_dir="/tmp/Endpoint_SlaveEndpointTest_NoAuthorizer_0_3OVQes"
I0725 05:14:27.802198 30015 credentials.hpp:86] Loading credential for authentication from
'/tmp/Endpoint_SlaveEndpointTest_NoAuthorizer_0_hzOqdh/credential'
I0725 05:14:27.802418 30015 slave.cpp:283] Agent using credential for: test-principal
I0725 05:14:27.802449 30015 credentials.hpp:37] Loading credentials for authentication from
'/tmp/Endpoint_SlaveEndpointTest_NoAuthorizer_0_hzOqdh/http_credentials'
I0725 05:14:27.802783 30015 http.cpp:993] Creating default 'basic' HTTP authenticator for
realm 'mesos-agent-executor'
I0725 05:14:27.802906 30015 http.cpp:1014] Creating default 'jwt' HTTP authenticator for realm
'mesos-agent-executor'
I0725 05:14:27.803107 30015 http.cpp:993] Creating default 'basic' HTTP authenticator for
realm 'mesos-agent-readonly'
I0725 05:14:27.803215 30015 http.cpp:1014] Creating default 'jwt' HTTP authenticator for realm
'mesos-agent-readonly'
I0725 05:14:27.803406 30015 http.cpp:993] Creating default 'basic' HTTP authenticator for
realm 'mesos-agent-readwrite'
I0725 05:14:27.803495 30015 http.cpp:1014] Creating default 'jwt' HTTP authenticator for realm
'mesos-agent-readwrite'
I0725 05:14:27.804924 30015 slave.cpp:565] Agent resources: [{"name":"cpus","scalar":{"value":2.0},"type":"SCALAR"},{"name":"mem","scalar":{"value":1024.0},"type":"SCALAR"},{"name":"disk","scalar":{"value":1024.0},"type":"SCALAR"},{"name":"ports","ranges":{"range":[{"begin":31000,"end":32000}]},"type":"RANGES"}]
I0725 05:14:27.805194 30015 slave.cpp:573] Agent attributes: [  ]
I0725 05:14:27.805212 30015 slave.cpp:582] Agent hostname: 3cbb5ca770bf
I0725 05:14:27.805380 30027 status_update_manager.cpp:177] Pausing sending status updates
I0725 05:14:27.807013 30010 state.cpp:64] Recovering state from '/tmp/Endpoint_SlaveEndpointTest_NoAuthorizer_0_3OVQes/meta'
I0725 05:14:27.807396 30014 status_update_manager.cpp:203] Recovering status update manager
I0725 05:14:27.807590 30014 containerizer.cpp:582] Recovering containerizer
I0725 05:14:27.808962 30019 provisioner.cpp:416] Provisioner recovery complete
I0725 05:14:27.809298 30015 slave.cpp:6207] Finished recovery
I0725 05:14:27.809790 30015 slave.cpp:6389] Querying resource estimator for oversubscribable
resources
I0725 05:14:27.810077 30020 slave.cpp:6403] Received oversubscribable resources {} from the
resource estimator
I0725 05:14:27.812342 30018 process.cpp:3837] Handling HTTP event for process 'slave(799)'
with path: '/slave(799)/monitor/statistics'
I0725 05:14:27.814028 30029 http.cpp:1133] HTTP GET for /slave(799)/monitor/statistics from
172.17.0.6:48180
I0725 05:14:27.814107 30029 http.cpp:957] Authorizing principal 'test-principal' to GET the
'/monitor/statistics' endpoint
I0725 05:14:27.817564 30024 slave.cpp:843] Agent terminating
[       OK ] Endpoint/SlaveEndpointTest.NoAuthorizer/0 (31 ms)
[ RUN      ] Endpoint/SlaveEndpointTest.NoAuthorizer/1
I0725 05:14:27.828593  9234 containerizer.cpp:230] Using isolation: posix/cpu,posix/mem,filesystem/posix,network/cni,environment_secret
W0725 05:14:27.829118  9234 backend.cpp:76] Failed to create 'aufs' backend: AufsBackend requires
root privileges
W0725 05:14:27.829226  9234 backend.cpp:76] Failed to create 'bind' backend: BindBackend requires
root privileges
I0725 05:14:27.829262  9234 provisioner.cpp:255] Using default backend 'copy'
I0725 05:14:27.831018  9234 cluster.cpp:448] Creating default 'local' authorizer
I0725 05:14:27.832710 30028 slave.cpp:250] Mesos agent started on (800)@172.17.0.6:46247
I0725 05:14:27.832734 30028 slave.cpp:251] Flags at startup: --acls="" --appc_simple_discovery_uri_prefix="http://"
--appc_store_dir="/tmp/Endpoint_SlaveEndpointTest_NoAuthorizer_1_XsdHnz/store/appc" --authenticate_http_executors="true"
--authenticate_http_readonly="true" --authenticate_http_readwrite="true" --authenticatee="crammd5"
--authentication_backoff_factor="1secs" --authorizer="local" --cgroups_cpu_enable_pids_and_tids_count="false"
--cgroups_enable_cfs="false" --cgroups_hierarchy="/sys/fs/cgroup" --cgroups_limit_swap="false"
--cgroups_root="mesos" --container_disk_watch_interval="15secs" --containerizers="mesos" --credential="/tmp/Endpoint_SlaveEndpointTest_NoAuthorizer_1_XsdHnz/credential"
--default_role="*" --disk_watch_interval="1mins" --docker="docker" --docker_kill_orphans="true"
--docker_registry="https://registry-1.docker.io" --docker_remove_delay="6hrs" --docker_socket="/var/run/docker.sock"
--docker_stop_timeout="0ns" --docker_store_dir="/tmp/Endpoint_SlaveEndpointTest_NoAuthorizer_1_XsdHnz/store/docker"
--docker_volume_checkpoint_dir="/var/run/mesos/isolators/docker/volume" --enforce_container_disk_quota="false"
--executor_registration_timeout="1mins" --executor_reregistration_timeout="2secs" --executor_secret_key="/tmp/Endpoint_SlaveEndpointTest_NoAuthorizer_1_XsdHnz/executor_secret_key"
--executor_shutdown_grace_period="5secs" --fetcher_cache_dir="/tmp/Endpoint_SlaveEndpointTest_NoAuthorizer_1_XsdHnz/fetch"
--fetcher_cache_size="2GB" --frameworks_home="" --gc_delay="1weeks" --gc_disk_headroom="0.1"
--hadoop_home="" --help="false" --hostname_lookup="true" --http_command_executor="false" --http_credentials="/tmp/Endpoint_SlaveEndpointTest_NoAuthorizer_1_XsdHnz/http_credentials"
--http_heartbeat_interval="30secs" --initialize_driver_logging="true" --isolation="posix/cpu,posix/mem"
--launcher="posix" --launcher_dir="/mesos/mesos-1.4.0/_build/src" --logbufsecs="0" --logging_level="INFO"
--max_completed_executors_per_framework="150" --oversubscribed_resources_interval="15secs"
--perf_duration="10secs" --perf_interval="1mins" --port="5051" --qos_correction_interval_min="0ns"
--quiet="false" --recover="reconnect" --recovery_timeout="15mins" --registration_backoff_factor="10ms"
--resources="cpus:2;gpus:0;mem:1024;disk:1024;ports:[31000-32000]" --revocable_cpu_low_priority="true"
--runtime_dir="/tmp/Endpoint_SlaveEndpointTest_NoAuthorizer_1_XsdHnz" --sandbox_directory="/mnt/mesos/sandbox"
--strict="true" --switch_user="true" --systemd_enable_support="true" --systemd_runtime_directory="/run/systemd/system"
--version="false" --work_dir="/tmp/Endpoint_SlaveEndpointTest_NoAuthorizer_1_xNdskK"
I0725 05:14:27.833142 30028 credentials.hpp:86] Loading credential for authentication from
'/tmp/Endpoint_SlaveEndpointTest_NoAuthorizer_1_XsdHnz/credential'
I0725 05:14:27.833325 30028 slave.cpp:283] Agent using credential for: test-principal
I0725 05:14:27.833348 30028 credentials.hpp:37] Loading credentials for authentication from
'/tmp/Endpoint_SlaveEndpointTest_NoAuthorizer_1_XsdHnz/http_credentials'
I0725 05:14:27.833694 30028 http.cpp:993] Creating default 'basic' HTTP authenticator for
realm 'mesos-agent-executor'
I0725 05:14:27.833818 30028 http.cpp:1014] Creating default 'jwt' HTTP authenticator for realm
'mesos-agent-executor'
I0725 05:14:27.834015 30028 http.cpp:993] Creating default 'basic' HTTP authenticator for
realm 'mesos-agent-readonly'
I0725 05:14:27.834111 30028 http.cpp:1014] Creating default 'jwt' HTTP authenticator for realm
'mesos-agent-readonly'
I0725 05:14:27.834326 30028 http.cpp:993] Creating default 'basic' HTTP authenticator for
realm 'mesos-agent-readwrite'
I0725 05:14:27.834439 30028 http.cpp:1014] Creating default 'jwt' HTTP authenticator for realm
'mesos-agent-readwrite'
I0725 05:14:27.835880 30028 slave.cpp:565] Agent resources: [{"name":"cpus","scalar":{"value":2.0},"type":"SCALAR"},{"name":"mem","scalar":{"value":1024.0},"type":"SCALAR"},{"name":"disk","scalar":{"value":1024.0},"type":"SCALAR"},{"name":"ports","ranges":{"range":[{"begin":31000,"end":32000}]},"type":"RANGES"}]
I0725 05:14:27.836127 30028 slave.cpp:573] Agent attributes: [  ]
I0725 05:14:27.836143 30028 slave.cpp:582] Agent hostname: 3cbb5ca770bf
I0725 05:14:27.836272 30010 status_update_manager.cpp:177] Pausing sending status updates
I0725 05:14:27.837779 30013 state.cpp:64] Recovering state from '/tmp/Endpoint_SlaveEndpointTest_NoAuthorizer_1_xNdskK/meta'
I0725 05:14:27.838102 30023 status_update_manager.cpp:203] Recovering status update manager
I0725 05:14:27.838351 30015 containerizer.cpp:582] Recovering containerizer
I0725 05:14:27.839748 30006 provisioner.cpp:416] Provisioner recovery complete
I0725 05:14:27.840138 30011 slave.cpp:6207] Finished recovery
I0725 05:14:27.840646 30011 slave.cpp:6389] Querying resource estimator for oversubscribable
resources
I0725 05:14:27.840895 30020 slave.cpp:6403] Received oversubscribable resources {} from the
resource estimator
I0725 05:14:27.843222 30012 process.cpp:3837] Handling HTTP event for process 'slave(800)'
with path: '/slave(800)/monitor/statistics.json'
I0725 05:14:27.844959 30025 http.cpp:1133] HTTP GET for /slave(800)/monitor/statistics.json
from 172.17.0.6:48184
I0725 05:14:27.845039 30025 http.cpp:957] Authorizing principal 'test-principal' to GET the
'/monitor/statistics.json' endpoint
I0725 05:14:27.848229 30020 slave.cpp:843] Agent terminating
[       OK ] Endpoint/SlaveEndpointTest.NoAuthorizer/1 (30 ms)
[ RUN      ] Endpoint/SlaveEndpointTest.NoAuthorizer/2
I0725 05:14:27.859891  9234 containerizer.cpp:230] Using isolation: posix/cpu,posix/mem,filesystem/posix,network/cni,environment_secret
W0725 05:14:27.860445  9234 backend.cpp:76] Failed to create 'aufs' backend: AufsBackend requires
root privileges
W0725 05:14:27.860550  9234 backend.cpp:76] Failed to create 'bind' backend: BindBackend requires
root privileges
I0725 05:14:27.860592  9234 provisioner.cpp:255] Using default backend 'copy'
I0725 05:14:27.862356  9234 cluster.cpp:448] Creating default 'local' authorizer
I0725 05:14:27.864027 30006 slave.cpp:250] Mesos agent started on (801)@172.17.0.6:46247
I0725 05:14:27.864056 30006 slave.cpp:251] Flags at startup: --acls="" --appc_simple_discovery_uri_prefix="http://"
--appc_store_dir="/tmp/Endpoint_SlaveEndpointTest_NoAuthorizer_2_pQGxQR/store/appc" --authenticate_http_executors="true"
--authenticate_http_readonly="true" --authenticate_http_readwrite="true" --authenticatee="crammd5"
--authentication_backoff_factor="1secs" --authorizer="local" --cgroups_cpu_enable_pids_and_tids_count="false"
--cgroups_enable_cfs="false" --cgroups_hierarchy="/sys/fs/cgroup" --cgroups_limit_swap="false"
--cgroups_root="mesos" --container_disk_watch_interval="15secs" --containerizers="mesos" --credential="/tmp/Endpoint_SlaveEndpointTest_NoAuthorizer_2_pQGxQR/credential"
--default_role="*" --disk_watch_interval="1mins" --docker="docker" --docker_kill_orphans="true"
--docker_registry="https://registry-1.docker.io" --docker_remove_delay="6hrs" --docker_socket="/var/run/docker.sock"
--docker_stop_timeout="0ns" --docker_store_dir="/tmp/Endpoint_SlaveEndpointTest_NoAuthorizer_2_pQGxQR/store/docker"
--docker_volume_checkpoint_dir="/var/run/mesos/isolators/docker/volume" --enforce_container_disk_quota="false"
--executor_registration_timeout="1mins" --executor_reregistration_timeout="2secs" --executor_secret_key="/tmp/Endpoint_SlaveEndpointTest_NoAuthorizer_2_pQGxQR/executor_secret_key"
--executor_shutdown_grace_period="5secs" --fetcher_cache_dir="/tmp/Endpoint_SlaveEndpointTest_NoAuthorizer_2_pQGxQR/fetch"
--fetcher_cache_size="2GB" --frameworks_home="" --gc_delay="1weeks" --gc_disk_headroom="0.1"
--hadoop_home="" --help="false" --hostname_lookup="true" --http_command_executor="false" --http_credentials="/tmp/Endpoint_SlaveEndpointTest_NoAuthorizer_2_pQGxQR/http_credentials"
--http_heartbeat_interval="30secs" --initialize_driver_logging="true" --isolation="posix/cpu,posix/mem"
--launcher="posix" --launcher_dir="/mesos/mesos-1.4.0/_build/src" --logbufsecs="0" --logging_level="INFO"
--max_completed_executors_per_framework="150" --oversubscribed_resources_interval="15secs"
--perf_duration="10secs" --perf_interval="1mins" --port="5051" --qos_correction_interval_min="0ns"
--quiet="false" --recover="reconnect" --recovery_timeout="15mins" --registration_backoff_factor="10ms"
--resources="cpus:2;gpus:0;mem:1024;disk:1024;ports:[31000-32000]" --revocable_cpu_low_priority="true"
--runtime_dir="/tmp/Endpoint_SlaveEndpointTest_NoAuthorizer_2_pQGxQR" --sandbox_directory="/mnt/mesos/sandbox"
--strict="true" --switch_user="true" --systemd_enable_support="true" --systemd_runtime_directory="/run/systemd/system"
--version="false" --work_dir="/tmp/Endpoint_SlaveEndpointTest_NoAuthorizer_2_HeCDI2"
I0725 05:14:27.864660 30006 credentials.hpp:86] Loading credential for authentication from
'/tmp/Endpoint_SlaveEndpointTest_NoAuthorizer_2_pQGxQR/credential'
I0725 05:14:27.864842 30006 slave.cpp:283] Agent using credential for: test-principal
I0725 05:14:27.864869 30006 credentials.hpp:37] Loading credentials for authentication from
'/tmp/Endpoint_SlaveEndpointTest_NoAuthorizer_2_pQGxQR/http_credentials'
I0725 05:14:27.865180 30006 http.cpp:993] Creating default 'basic' HTTP authenticator for
realm 'mesos-agent-executor'
I0725 05:14:27.865309 30006 http.cpp:1014] Creating default 'jwt' HTTP authenticator for realm
'mesos-agent-executor'
I0725 05:14:27.865491 30006 http.cpp:993] Creating default 'basic' HTTP authenticator for
realm 'mesos-agent-readonly'
I0725 05:14:27.865586 30006 http.cpp:1014] Creating default 'jwt' HTTP authenticator for realm
'mesos-agent-readonly'
I0725 05:14:27.865751 30006 http.cpp:993] Creating default 'basic' HTTP authenticator for
realm 'mesos-agent-readwrite'
I0725 05:14:27.865845 30006 http.cpp:1014] Creating default 'jwt' HTTP authenticator for realm
'mesos-agent-readwrite'
I0725 05:14:27.867262 30006 slave.cpp:565] Agent resources: [{"name":"cpus","scalar":{"value":2.0},"type":"SCALAR"},{"name":"mem","scalar":{"value":1024.0},"type":"SCALAR"},{"name":"disk","scalar":{"value":1024.0},"type":"SCALAR"},{"name":"ports","ranges":{"range":[{"begin":31000,"end":32000}]},"type":"RANGES"}]
I0725 05:14:27.867516 30006 slave.cpp:573] Agent attributes: [  ]
I0725 05:14:27.867535 30006 slave.cpp:582] Agent hostname: 3cbb5ca770bf
I0725 05:14:27.867720 30011 status_update_manager.cpp:177] Pausing sending status updates
I0725 05:14:27.869277 30029 state.cpp:64] Recovering state from '/tmp/Endpoint_SlaveEndpointTest_NoAuthorizer_2_HeCDI2/meta'
I0725 05:14:27.869616 30010 status_update_manager.cpp:203] Recovering status update manager
I0725 05:14:27.869854 30027 containerizer.cpp:582] Recovering containerizer
I0725 05:14:27.871316 30021 provisioner.cpp:416] Provisioner recovery complete
I0725 05:14:27.871695 30017 slave.cpp:6207] Finished recovery
I0725 05:14:27.872231 30017 slave.cpp:6389] Querying resource estimator for oversubscribable
resources
I0725 05:14:27.872494 30020 slave.cpp:6403] Received oversubscribable resources {} from the
resource estimator
I0725 05:14:27.874938 30014 process.cpp:3837] Handling HTTP event for process 'slave(801)'
with path: '/slave(801)/containers'
I0725 05:14:27.876758 30029 http.cpp:1133] HTTP GET for /slave(801)/containers from 172.17.0.6:48188
I0725 05:14:27.876845 30029 http.cpp:957] Authorizing principal 'test-principal' to GET the
'/containers' endpoint
I0725 05:14:27.880558 30014 slave.cpp:843] Agent terminating
[       OK ] Endpoint/SlaveEndpointTest.NoAuthorizer/2 (31 ms)
[----------] 9 tests from Endpoint/SlaveEndpointTest (276 ms total)

[----------] Global test environment tear-down
[==========] 1642 tests from 181 test cases ran. (652169 ms total)
[  PASSED  ] 1637 tests.
[  FAILED  ] 5 tests, listed below:
[  FAILED  ] CommandExecutorCheckTest.CommandCheckDeliveredAndReconciled
[  FAILED  ] DefaultExecutorCheckTest.CommandCheckDeliveredAndReconciled
[  FAILED  ] DefaultExecutorCheckTest.CommandCheckStatusChange
[  FAILED  ] DefaultExecutorCheckTest.CommandCheckSeesParentsEnv
[  FAILED  ] DefaultExecutorCheckTest.CommandCheckSharesWorkDirWithTask

 5 FAILED TESTS
  YOU HAVE 20 DISABLED TESTS

I0725 05:14:27.949182 30030 process.cpp:1006] Failed to accept socket: future discarded
make[4]: *** [check-local] Error 1
make[4]: Leaving directory `/mesos/mesos-1.4.0/_build/src'
make[3]: *** [check-am] Error 2
make[3]: Leaving directory `/mesos/mesos-1.4.0/_build/src'
make[2]: *** [check] Error 2
make[2]: Leaving directory `/mesos/mesos-1.4.0/_build/src'
make[1]: *** [check-recursive] Error 1
make[1]: Leaving directory `/mesos/mesos-1.4.0/_build'
make: *** [distcheck] Error 1
+ docker rmi mesos-1500956922-14098
Untagged: mesos-1500956922-14098:latest
Deleted: sha256:92108643615597d140efd4c0e67c90a084d0c80c9b83a6947912c60c766c572e
Deleted: sha256:2d3baba5f98b5280a033544da32a85a53b57e0d20e27d1528eae58903a773169
Deleted: sha256:b101222b508bebaa48de90f23bf84a58234ff9e80ed6403307b15d082cc04644
Deleted: sha256:2ea6fd5e98f90692cd8d821970529d31ec5fee61bc1bcc7177b28ed3e73b5066
Deleted: sha256:bdf43df5cfadd60c5fc3408c2ab7dfea2ecb1501db39553d95a8fecaac7da4d8
Deleted: sha256:a11a32a6f395177bb306b758070a17932a23d160103155585690cbd6135c9c99
Deleted: sha256:29fb59af8ba67c303548ad2d09ba5f145089deeb57597a37f129d01a5f0645a0
Deleted: sha256:2ece3ab857360d5b90674c0fa3050572839e8e754aed8584e1de9845bd023c1e
Deleted: sha256:5cb88f995e54b13b94b8df9d53d7209d7f26a61c277e717cbdd9a3391749b16b
Deleted: sha256:fdbc31807568cfd8462adbbd37952e168b2cda2e143db7412a49a8b3d795ff92
Deleted: sha256:6b5760a4f7aa08357e72b91d1da0006f19eb8181ac8e32e0222ed2bc16893921
Deleted: sha256:f2d7879ecdfa4a25b72c2cab5d4ae0dad318d1aa510a307450fce16259c10062
Deleted: sha256:bd4ade01879598c572240fdfe84347eea23f0b65c51ed44d88b6ca7cd54ceb76
Deleted: sha256:50f2efecb54a2651d3f0444bcb3bac487cef8e714f04270f5e8847d8f3cb9a26
Deleted: sha256:fa31ddd63e4bc4d8fad3b42c0490b08631debdb10a4ecc48c625f04147016886
Deleted: sha256:c1315f9e29b4713afea08e189f9fe5eacee61ca49d7b0631e2bbed6f9956983b
Deleted: sha256:daa93ca3001c6bd4f535212a8de3ca6365e32234552f507ca665076b78ac6b7d
Deleted: sha256:366eaed810b257be5856dc96af7d777d6abba0c3f6aa585a2a41221ef43bc148
Deleted: sha256:c66c5f2a2c04736e885dc9cb7d5433f02e4033f828f8369a7152a94fabde705f
Deleted: sha256:f85e33d0e195affc830553e9aba5e95459974286b57656aaa2fe5973e0233fd7
Deleted: sha256:af11e1f5a26995d6b074019d0d89ac35b246c0a388139802aa227ba841f03454
Deleted: sha256:460c9944124b70d24e9c58c75ff284743dab4eeaa0e6a8d9b77e09dc3d0cd496
Deleted: sha256:c73f300e38ed57c178c0202a5e2a4e81f546d7a51961ea2a6e3dfd843b935f47
Deleted: sha256:a8dbf1d4dee4a0848d05b0b24dddd089a461816beef7e10f856213babeffac04
Deleted: sha256:78f660ade8f6bbe60edfac10c15ef0028b263781f798e65a7b0b460218b365a7
Build step 'Execute shell' marked build as failure
Not sending mail to unregistered user yujie.jay@gmail.com

Mime
View raw message