mesos-builds mailing list archives

Site index · List index
Message view « Date » · « Thread »
Top « Date » · « Thread »
From Apache Jenkins Server <jenk...@builds.apache.org>
Subject Build failed in Jenkins: Mesos-Reviewbot #18574
Date Sat, 22 Jul 2017 07:58:27 GMT
See <https://builds.apache.org/job/Mesos-Reviewbot/18574/display/redirect>

------------------------------------------
[...truncated 30.14 MB...]
I0722 07:58:20.087226  5026 containerizer.cpp:230] Using isolation: posix/cpu,posix/mem,filesystem/posix,network/cni,environment_secret
W0722 07:58:20.087996  5026 backend.cpp:76] Failed to create 'overlay' backend: OverlayBackend
requires root privileges
W0722 07:58:20.088155  5026 backend.cpp:76] Failed to create 'bind' backend: BindBackend requires
root privileges
I0722 07:58:20.088197  5026 provisioner.cpp:255] Using default backend 'copy'
I0722 07:58:20.093291  5045 slave.cpp:250] Mesos agent started on (792)@172.17.0.2:37297
I0722 07:58:20.093333  5045 slave.cpp:251] Flags at startup: --acls="" --appc_simple_discovery_uri_prefix="http://"
--appc_store_dir="/tmp/Endpoint_SlaveEndpointTest_AuthorizedRequest_2_xgjURi/store/appc" --authenticate_http_readonly="true"
--authenticate_http_readwrite="true" --authenticatee="crammd5" --authentication_backoff_factor="1secs"
--authorizer="local" --cgroups_cpu_enable_pids_and_tids_count="false" --cgroups_enable_cfs="false"
--cgroups_hierarchy="/sys/fs/cgroup" --cgroups_limit_swap="false" --cgroups_root="mesos" --container_disk_watch_interval="15secs"
--containerizers="mesos" --credential="/tmp/Endpoint_SlaveEndpointTest_AuthorizedRequest_2_xgjURi/credential"
--default_role="*" --disk_watch_interval="1mins" --docker="docker" --docker_kill_orphans="true"
--docker_registry="https://registry-1.docker.io" --docker_remove_delay="6hrs" --docker_socket="/var/run/docker.sock"
--docker_stop_timeout="0ns" --docker_store_dir="/tmp/Endpoint_SlaveEndpointTest_AuthorizedRequest_2_xgjURi/store/docker"
--docker_volume_checkpoint_dir="/var/run/mesos/isolators/docker/volume" --enforce_container_disk_quota="false"
--executor_registration_timeout="1mins" --executor_reregistration_timeout="2secs" --executor_shutdown_grace_period="5secs"
--fetcher_cache_dir="/tmp/Endpoint_SlaveEndpointTest_AuthorizedRequest_2_xgjURi/fetch" --fetcher_cache_size="2GB"
--frameworks_home="" --gc_delay="1weeks" --gc_disk_headroom="0.1" --hadoop_home="" --help="false"
--hostname_lookup="true" --http_command_executor="false" --http_credentials="/tmp/Endpoint_SlaveEndpointTest_AuthorizedRequest_2_xgjURi/http_credentials"
--http_heartbeat_interval="30secs" --initialize_driver_logging="true" --isolation="posix/cpu,posix/mem"
--launcher="posix" --launcher_dir="/mesos/mesos-1.4.0/_build/src" --logbufsecs="0" --logging_level="INFO"
--max_completed_executors_per_framework="150" --oversubscribed_resources_interval="15secs"
--perf_duration="10secs" --perf_interval="1mins" --port="5051" --qos_correction_interval_min="0ns"
--quiet="false" --recover="reconnect" --recovery_timeout="15mins" --registration_backoff_factor="10ms"
--resources="cpus:2;gpus:0;mem:1024;disk:1024;ports:[31000-32000]" --revocable_cpu_low_priority="true"
--runtime_dir="/tmp/Endpoint_SlaveEndpointTest_AuthorizedRequest_2_xgjURi" --sandbox_directory="/mnt/mesos/sandbox"
--strict="true" --switch_user="true" --systemd_enable_support="true" --systemd_runtime_directory="/run/systemd/system"
--version="false" --work_dir="/tmp/Endpoint_SlaveEndpointTest_AuthorizedRequest_2_JfF3nj"
I0722 07:58:20.094130  5045 credentials.hpp:86] Loading credential for authentication from
'/tmp/Endpoint_SlaveEndpointTest_AuthorizedRequest_2_xgjURi/credential'
I0722 07:58:20.094403  5045 slave.cpp:283] Agent using credential for: test-principal
I0722 07:58:20.094426  5045 credentials.hpp:37] Loading credentials for authentication from
'/tmp/Endpoint_SlaveEndpointTest_AuthorizedRequest_2_xgjURi/http_credentials'
I0722 07:58:20.094846  5045 http.cpp:993] Creating default 'basic' HTTP authenticator for
realm 'mesos-agent-readonly'
I0722 07:58:20.095098  5045 http.cpp:993] Creating default 'basic' HTTP authenticator for
realm 'mesos-agent-readwrite'
I0722 07:58:20.097220  5045 slave.cpp:565] Agent resources: [{"name":"cpus","scalar":{"value":2.0},"type":"SCALAR"},{"name":"mem","scalar":{"value":1024.0},"type":"SCALAR"},{"name":"disk","scalar":{"value":1024.0},"type":"SCALAR"},{"name":"ports","ranges":{"range":[{"begin":31000,"end":32000}]},"type":"RANGES"}]
I0722 07:58:20.097647  5045 slave.cpp:573] Agent attributes: [  ]
I0722 07:58:20.097669  5045 slave.cpp:582] Agent hostname: 043a47e3a3e5
I0722 07:58:20.097904  5051 status_update_manager.cpp:177] Pausing sending status updates
I0722 07:58:20.099889  5049 state.cpp:64] Recovering state from '/tmp/Endpoint_SlaveEndpointTest_AuthorizedRequest_2_JfF3nj/meta'
I0722 07:58:20.100400  5052 status_update_manager.cpp:203] Recovering status update manager
I0722 07:58:20.100666  5046 containerizer.cpp:582] Recovering containerizer
I0722 07:58:20.102767  5046 provisioner.cpp:416] Provisioner recovery complete
I0722 07:58:20.103355  5051 slave.cpp:6207] Finished recovery
I0722 07:58:20.104053  5051 slave.cpp:6389] Querying resource estimator for oversubscribable
resources
I0722 07:58:20.104398  5047 slave.cpp:6403] Received oversubscribable resources {} from the
resource estimator
I0722 07:58:20.108971  5048 process.cpp:3837] Handling HTTP event for process 'slave(792)'
with path: '/slave(792)/containers'
I0722 07:58:20.111006  5050 http.cpp:1133] HTTP GET for /slave(792)/containers from 172.17.0.2:46444
I0722 07:58:20.111136  5050 http.cpp:957] Authorizing principal 'test-principal' to GET the
'/containers' endpoint
I0722 07:58:20.117722  5049 slave.cpp:843] Agent terminating
[       OK ] Endpoint/SlaveEndpointTest.AuthorizedRequest/2 (46 ms)
[ RUN      ] Endpoint/SlaveEndpointTest.UnauthorizedRequest/0
I0722 07:58:20.134186  5026 containerizer.cpp:230] Using isolation: posix/cpu,posix/mem,filesystem/posix,network/cni,environment_secret
W0722 07:58:20.134977  5026 backend.cpp:76] Failed to create 'overlay' backend: OverlayBackend
requires root privileges
W0722 07:58:20.135160  5026 backend.cpp:76] Failed to create 'bind' backend: BindBackend requires
root privileges
I0722 07:58:20.135202  5026 provisioner.cpp:255] Using default backend 'copy'
I0722 07:58:20.140244  5049 slave.cpp:250] Mesos agent started on (793)@172.17.0.2:37297
I0722 07:58:20.140282  5049 slave.cpp:251] Flags at startup: --acls="" --appc_simple_discovery_uri_prefix="http://"
--appc_store_dir="/tmp/Endpoint_SlaveEndpointTest_UnauthorizedRequest_0_tOXYch/store/appc"
--authenticate_http_readonly="true" --authenticate_http_readwrite="true" --authenticatee="crammd5"
--authentication_backoff_factor="1secs" --authorizer="local" --cgroups_cpu_enable_pids_and_tids_count="false"
--cgroups_enable_cfs="false" --cgroups_hierarchy="/sys/fs/cgroup" --cgroups_limit_swap="false"
--cgroups_root="mesos" --container_disk_watch_interval="15secs" --containerizers="mesos" --credential="/tmp/Endpoint_SlaveEndpointTest_UnauthorizedRequest_0_tOXYch/credential"
--default_role="*" --disk_watch_interval="1mins" --docker="docker" --docker_kill_orphans="true"
--docker_registry="https://registry-1.docker.io" --docker_remove_delay="6hrs" --docker_socket="/var/run/docker.sock"
--docker_stop_timeout="0ns" --docker_store_dir="/tmp/Endpoint_SlaveEndpointTest_UnauthorizedRequest_0_tOXYch/store/docker"
--docker_volume_checkpoint_dir="/var/run/mesos/isolators/docker/volume" --enforce_container_disk_quota="false"
--executor_registration_timeout="1mins" --executor_reregistration_timeout="2secs" --executor_shutdown_grace_period="5secs"
--fetcher_cache_dir="/tmp/Endpoint_SlaveEndpointTest_UnauthorizedRequest_0_tOXYch/fetch" --fetcher_cache_size="2GB"
--frameworks_home="" --gc_delay="1weeks" --gc_disk_headroom="0.1" --hadoop_home="" --help="false"
--hostname_lookup="true" --http_command_executor="false" --http_credentials="/tmp/Endpoint_SlaveEndpointTest_UnauthorizedRequest_0_tOXYch/http_credentials"
--http_heartbeat_interval="30secs" --initialize_driver_logging="true" --isolation="posix/cpu,posix/mem"
--launcher="posix" --launcher_dir="/mesos/mesos-1.4.0/_build/src" --logbufsecs="0" --logging_level="INFO"
--max_completed_executors_per_framework="150" --oversubscribed_resources_interval="15secs"
--perf_duration="10secs" --perf_interval="1mins" --port="5051" --qos_correction_interval_min="0ns"
--quiet="false" --recover="reconnect" --recovery_timeout="15mins" --registration_backoff_factor="10ms"
--resources="cpus:2;gpus:0;mem:1024;disk:1024;ports:[31000-32000]" --revocable_cpu_low_priority="true"
--runtime_dir="/tmp/Endpoint_SlaveEndpointTest_UnauthorizedRequest_0_tOXYch" --sandbox_directory="/mnt/mesos/sandbox"
--strict="true" --switch_user="true" --systemd_enable_support="true" --systemd_runtime_directory="/run/systemd/system"
--version="false" --work_dir="/tmp/Endpoint_SlaveEndpointTest_UnauthorizedRequest_0_zSdxBh"
I0722 07:58:20.140995  5049 credentials.hpp:86] Loading credential for authentication from
'/tmp/Endpoint_SlaveEndpointTest_UnauthorizedRequest_0_tOXYch/credential'
I0722 07:58:20.141237  5049 slave.cpp:283] Agent using credential for: test-principal
I0722 07:58:20.141258  5049 credentials.hpp:37] Loading credentials for authentication from
'/tmp/Endpoint_SlaveEndpointTest_UnauthorizedRequest_0_tOXYch/http_credentials'
I0722 07:58:20.141599  5049 http.cpp:993] Creating default 'basic' HTTP authenticator for
realm 'mesos-agent-readonly'
I0722 07:58:20.141836  5049 http.cpp:993] Creating default 'basic' HTTP authenticator for
realm 'mesos-agent-readwrite'
I0722 07:58:20.143970  5049 slave.cpp:565] Agent resources: [{"name":"cpus","scalar":{"value":2.0},"type":"SCALAR"},{"name":"mem","scalar":{"value":1024.0},"type":"SCALAR"},{"name":"disk","scalar":{"value":1024.0},"type":"SCALAR"},{"name":"ports","ranges":{"range":[{"begin":31000,"end":32000}]},"type":"RANGES"}]
I0722 07:58:20.144402  5049 slave.cpp:573] Agent attributes: [  ]
I0722 07:58:20.144425  5049 slave.cpp:582] Agent hostname: 043a47e3a3e5
I0722 07:58:20.144639  5046 status_update_manager.cpp:177] Pausing sending status updates
I0722 07:58:20.146507  5052 state.cpp:64] Recovering state from '/tmp/Endpoint_SlaveEndpointTest_UnauthorizedRequest_0_zSdxBh/meta'
I0722 07:58:20.146946  5052 status_update_manager.cpp:203] Recovering status update manager
I0722 07:58:20.147176  5052 containerizer.cpp:582] Recovering containerizer
I0722 07:58:20.149416  5052 provisioner.cpp:416] Provisioner recovery complete
I0722 07:58:20.149957  5047 slave.cpp:6207] Finished recovery
I0722 07:58:20.150717  5047 slave.cpp:6389] Querying resource estimator for oversubscribable
resources
I0722 07:58:20.151248  5051 slave.cpp:6403] Received oversubscribable resources {} from the
resource estimator
I0722 07:58:20.155289  5048 process.cpp:3837] Handling HTTP event for process 'slave(793)'
with path: '/slave(793)/monitor/statistics'
I0722 07:58:20.157436  5049 http.cpp:1133] HTTP GET for /slave(793)/monitor/statistics from
172.17.0.2:46446
I0722 07:58:20.157563  5049 http.cpp:957] Authorizing principal 'test-principal' to GET the
'/monitor/statistics' endpoint
I0722 07:58:20.161633  5026 slave.cpp:843] Agent terminating
[       OK ] Endpoint/SlaveEndpointTest.UnauthorizedRequest/0 (42 ms)
[ RUN      ] Endpoint/SlaveEndpointTest.UnauthorizedRequest/1
I0722 07:58:20.177145  5026 containerizer.cpp:230] Using isolation: posix/cpu,posix/mem,filesystem/posix,network/cni,environment_secret
W0722 07:58:20.177949  5026 backend.cpp:76] Failed to create 'overlay' backend: OverlayBackend
requires root privileges
W0722 07:58:20.178144  5026 backend.cpp:76] Failed to create 'bind' backend: BindBackend requires
root privileges
I0722 07:58:20.178191  5026 provisioner.cpp:255] Using default backend 'copy'
I0722 07:58:20.183248  5050 slave.cpp:250] Mesos agent started on (794)@172.17.0.2:37297
I0722 07:58:20.183284  5050 slave.cpp:251] Flags at startup: --acls="" --appc_simple_discovery_uri_prefix="http://"
--appc_store_dir="/tmp/Endpoint_SlaveEndpointTest_UnauthorizedRequest_1_Dtgv0f/store/appc"
--authenticate_http_readonly="true" --authenticate_http_readwrite="true" --authenticatee="crammd5"
--authentication_backoff_factor="1secs" --authorizer="local" --cgroups_cpu_enable_pids_and_tids_count="false"
--cgroups_enable_cfs="false" --cgroups_hierarchy="/sys/fs/cgroup" --cgroups_limit_swap="false"
--cgroups_root="mesos" --container_disk_watch_interval="15secs" --containerizers="mesos" --credential="/tmp/Endpoint_SlaveEndpointTest_UnauthorizedRequest_1_Dtgv0f/credential"
--default_role="*" --disk_watch_interval="1mins" --docker="docker" --docker_kill_orphans="true"
--docker_registry="https://registry-1.docker.io" --docker_remove_delay="6hrs" --docker_socket="/var/run/docker.sock"
--docker_stop_timeout="0ns" --docker_store_dir="/tmp/Endpoint_SlaveEndpointTest_UnauthorizedRequest_1_Dtgv0f/store/docker"
--docker_volume_checkpoint_dir="/var/run/mesos/isolators/docker/volume" --enforce_container_disk_quota="false"
--executor_registration_timeout="1mins" --executor_reregistration_timeout="2secs" --executor_shutdown_grace_period="5secs"
--fetcher_cache_dir="/tmp/Endpoint_SlaveEndpointTest_UnauthorizedRequest_1_Dtgv0f/fetch" --fetcher_cache_size="2GB"
--frameworks_home="" --gc_delay="1weeks" --gc_disk_headroom="0.1" --hadoop_home="" --help="false"
--hostname_lookup="true" --http_command_executor="false" --http_credentials="/tmp/Endpoint_SlaveEndpointTest_UnauthorizedRequest_1_Dtgv0f/http_credentials"
--http_heartbeat_interval="30secs" --initialize_driver_logging="true" --isolation="posix/cpu,posix/mem"
--launcher="posix" --launcher_dir="/mesos/mesos-1.4.0/_build/src" --logbufsecs="0" --logging_level="INFO"
--max_completed_executors_per_framework="150" --oversubscribed_resources_interval="15secs"
--perf_duration="10secs" --perf_interval="1mins" --port="5051" --qos_correction_interval_min="0ns"
--quiet="false" --recover="reconnect" --recovery_timeout="15mins" --registration_backoff_factor="10ms"
--resources="cpus:2;gpus:0;mem:1024;disk:1024;ports:[31000-32000]" --revocable_cpu_low_priority="true"
--runtime_dir="/tmp/Endpoint_SlaveEndpointTest_UnauthorizedRequest_1_Dtgv0f" --sandbox_directory="/mnt/mesos/sandbox"
--strict="true" --switch_user="true" --systemd_enable_support="true" --systemd_runtime_directory="/run/systemd/system"
--version="false" --work_dir="/tmp/Endpoint_SlaveEndpointTest_UnauthorizedRequest_1_dLV5hg"
I0722 07:58:20.184047  5050 credentials.hpp:86] Loading credential for authentication from
'/tmp/Endpoint_SlaveEndpointTest_UnauthorizedRequest_1_Dtgv0f/credential'
I0722 07:58:20.184312  5050 slave.cpp:283] Agent using credential for: test-principal
I0722 07:58:20.184334  5050 credentials.hpp:37] Loading credentials for authentication from
'/tmp/Endpoint_SlaveEndpointTest_UnauthorizedRequest_1_Dtgv0f/http_credentials'
I0722 07:58:20.184680  5050 http.cpp:993] Creating default 'basic' HTTP authenticator for
realm 'mesos-agent-readonly'
I0722 07:58:20.184906  5050 http.cpp:993] Creating default 'basic' HTTP authenticator for
realm 'mesos-agent-readwrite'
I0722 07:58:20.187068  5050 slave.cpp:565] Agent resources: [{"name":"cpus","scalar":{"value":2.0},"type":"SCALAR"},{"name":"mem","scalar":{"value":1024.0},"type":"SCALAR"},{"name":"disk","scalar":{"value":1024.0},"type":"SCALAR"},{"name":"ports","ranges":{"range":[{"begin":31000,"end":32000}]},"type":"RANGES"}]
I0722 07:58:20.187492  5050 slave.cpp:573] Agent attributes: [  ]
I0722 07:58:20.187512  5050 slave.cpp:582] Agent hostname: 043a47e3a3e5
I0722 07:58:20.187824  5046 status_update_manager.cpp:177] Pausing sending status updates
I0722 07:58:20.189736  5052 state.cpp:64] Recovering state from '/tmp/Endpoint_SlaveEndpointTest_UnauthorizedRequest_1_dLV5hg/meta'
I0722 07:58:20.190351  5049 status_update_manager.cpp:203] Recovering status update manager
I0722 07:58:20.190718  5051 containerizer.cpp:582] Recovering containerizer
I0722 07:58:20.193003  5046 provisioner.cpp:416] Provisioner recovery complete
I0722 07:58:20.193388  5049 slave.cpp:6207] Finished recovery
I0722 07:58:20.194051  5049 slave.cpp:6389] Querying resource estimator for oversubscribable
resources
I0722 07:58:20.194416  5048 slave.cpp:6403] Received oversubscribable resources {} from the
resource estimator
I0722 07:58:20.198344  5052 process.cpp:3837] Handling HTTP event for process 'slave(794)'
with path: '/slave(794)/monitor/statistics.json'
I0722 07:58:20.200536  5045 http.cpp:1133] HTTP GET for /slave(794)/monitor/statistics.json
from 172.17.0.2:46448
I0722 07:58:20.201042  5045 http.cpp:957] Authorizing principal 'test-principal' to GET the
'/monitor/statistics.json' endpoint
I0722 07:58:20.204839  5026 slave.cpp:843] Agent terminating
[       OK ] Endpoint/SlaveEndpointTest.UnauthorizedRequest/1 (43 ms)
[ RUN      ] Endpoint/SlaveEndpointTest.UnauthorizedRequest/2
I0722 07:58:20.220808  5026 containerizer.cpp:230] Using isolation: posix/cpu,posix/mem,filesystem/posix,network/cni,environment_secret
W0722 07:58:20.221601  5026 backend.cpp:76] Failed to create 'overlay' backend: OverlayBackend
requires root privileges
W0722 07:58:20.221781  5026 backend.cpp:76] Failed to create 'bind' backend: BindBackend requires
root privileges
I0722 07:58:20.221827  5026 provisioner.cpp:255] Using default backend 'copy'
I0722 07:58:20.227035  5052 slave.cpp:250] Mesos agent started on (795)@172.17.0.2:37297
I0722 07:58:20.227082  5052 slave.cpp:251] Flags at startup: --acls="" --appc_simple_discovery_uri_prefix="http://"
--appc_store_dir="/tmp/Endpoint_SlaveEndpointTest_UnauthorizedRequest_2_9HV8ff/store/appc"
--authenticate_http_readonly="true" --authenticate_http_readwrite="true" --authenticatee="crammd5"
--authentication_backoff_factor="1secs" --authorizer="local" --cgroups_cpu_enable_pids_and_tids_count="false"
--cgroups_enable_cfs="false" --cgroups_hierarchy="/sys/fs/cgroup" --cgroups_limit_swap="false"
--cgroups_root="mesos" --container_disk_watch_interval="15secs" --containerizers="mesos" --credential="/tmp/Endpoint_SlaveEndpointTest_UnauthorizedRequest_2_9HV8ff/credential"
--default_role="*" --disk_watch_interval="1mins" --docker="docker" --docker_kill_orphans="true"
--docker_registry="https://registry-1.docker.io" --docker_remove_delay="6hrs" --docker_socket="/var/run/docker.sock"
--docker_stop_timeout="0ns" --docker_store_dir="/tmp/Endpoint_SlaveEndpointTest_UnauthorizedRequest_2_9HV8ff/store/docker"
--docker_volume_checkpoint_dir="/var/run/mesos/isolators/docker/volume" --enforce_container_disk_quota="false"
--executor_registration_timeout="1mins" --executor_reregistration_timeout="2secs" --executor_shutdown_grace_period="5secs"
--fetcher_cache_dir="/tmp/Endpoint_SlaveEndpointTest_UnauthorizedRequest_2_9HV8ff/fetch" --fetcher_cache_size="2GB"
--frameworks_home="" --gc_delay="1weeks" --gc_disk_headroom="0.1" --hadoop_home="" --help="false"
--hostname_lookup="true" --http_command_executor="false" --http_credentials="/tmp/Endpoint_SlaveEndpointTest_UnauthorizedRequest_2_9HV8ff/http_credentials"
--http_heartbeat_interval="30secs" --initialize_driver_logging="true" --isolation="posix/cpu,posix/mem"
--launcher="posix" --launcher_dir="/mesos/mesos-1.4.0/_build/src" --logbufsecs="0" --logging_level="INFO"
--max_completed_executors_per_framework="150" --oversubscribed_resources_interval="15secs"
--perf_duration="10secs" --perf_interval="1mins" --port="5051" --qos_correction_interval_min="0ns"
--quiet="false" --recover="reconnect" --recovery_timeout="15mins" --registration_backoff_factor="10ms"
--resources="cpus:2;gpus:0;mem:1024;disk:1024;ports:[31000-32000]" --revocable_cpu_low_priority="true"
--runtime_dir="/tmp/Endpoint_SlaveEndpointTest_UnauthorizedRequest_2_9HV8ff" --sandbox_directory="/mnt/mesos/sandbox"
--strict="true" --switch_user="true" --systemd_enable_support="true" --systemd_runtime_directory="/run/systemd/system"
--version="false" --work_dir="/tmp/Endpoint_SlaveEndpointTest_UnauthorizedRequest_2_LA9Gqf"
I0722 07:58:20.227805  5052 credentials.hpp:86] Loading credential for authentication from
'/tmp/Endpoint_SlaveEndpointTest_UnauthorizedRequest_2_9HV8ff/credential'
I0722 07:58:20.228062  5052 slave.cpp:283] Agent using credential for: test-principal
I0722 07:58:20.228085  5052 credentials.hpp:37] Loading credentials for authentication from
'/tmp/Endpoint_SlaveEndpointTest_UnauthorizedRequest_2_9HV8ff/http_credentials'
I0722 07:58:20.228423  5052 http.cpp:993] Creating default 'basic' HTTP authenticator for
realm 'mesos-agent-readonly'
I0722 07:58:20.228646  5052 http.cpp:993] Creating default 'basic' HTTP authenticator for
realm 'mesos-agent-readwrite'
I0722 07:58:20.230765  5052 slave.cpp:565] Agent resources: [{"name":"cpus","scalar":{"value":2.0},"type":"SCALAR"},{"name":"mem","scalar":{"value":1024.0},"type":"SCALAR"},{"name":"disk","scalar":{"value":1024.0},"type":"SCALAR"},{"name":"ports","ranges":{"range":[{"begin":31000,"end":32000}]},"type":"RANGES"}]
I0722 07:58:20.231185  5052 slave.cpp:573] Agent attributes: [  ]
I0722 07:58:20.231205  5052 slave.cpp:582] Agent hostname: 043a47e3a3e5
I0722 07:58:20.231416  5046 status_update_manager.cpp:177] Pausing sending status updates
I0722 07:58:20.233186  5049 state.cpp:64] Recovering state from '/tmp/Endpoint_SlaveEndpointTest_UnauthorizedRequest_2_LA9Gqf/meta'
I0722 07:58:20.233644  5048 status_update_manager.cpp:203] Recovering status update manager
I0722 07:58:20.234499  5050 containerizer.cpp:582] Recovering containerizer
I0722 07:58:20.236696  5047 provisioner.cpp:416] Provisioner recovery complete
I0722 07:58:20.237277  5052 slave.cpp:6207] Finished recovery
I0722 07:58:20.237872  5052 slave.cpp:6389] Querying resource estimator for oversubscribable
resources
I0722 07:58:20.238189  5045 slave.cpp:6403] Received oversubscribable resources {} from the
resource estimator
I0722 07:58:20.242135  5045 process.cpp:3837] Handling HTTP event for process 'slave(795)'
with path: '/slave(795)/containers'
I0722 07:58:20.244374  5046 http.cpp:1133] HTTP GET for /slave(795)/containers from 172.17.0.2:46450
I0722 07:58:20.244503  5046 http.cpp:957] Authorizing principal 'test-principal' to GET the
'/containers' endpoint
I0722 07:58:20.248064  5047 slave.cpp:843] Agent terminating
[       OK ] Endpoint/SlaveEndpointTest.UnauthorizedRequest/2 (48 ms)
[ RUN      ] Endpoint/SlaveEndpointTest.NoAuthorizer/0
I0722 07:58:20.268874  5026 containerizer.cpp:230] Using isolation: posix/cpu,posix/mem,filesystem/posix,network/cni,environment_secret
W0722 07:58:20.269778  5026 backend.cpp:76] Failed to create 'overlay' backend: OverlayBackend
requires root privileges
W0722 07:58:20.270045  5026 backend.cpp:76] Failed to create 'bind' backend: BindBackend requires
root privileges
I0722 07:58:20.270174  5026 provisioner.cpp:255] Using default backend 'copy'
I0722 07:58:20.272704  5026 cluster.cpp:448] Creating default 'local' authorizer
I0722 07:58:20.275563  5047 slave.cpp:250] Mesos agent started on (796)@172.17.0.2:37297
I0722 07:58:20.275605  5047 slave.cpp:251] Flags at startup: --acls="" --appc_simple_discovery_uri_prefix="http://"
--appc_store_dir="/tmp/Endpoint_SlaveEndpointTest_NoAuthorizer_0_1bBb0e/store/appc" --authenticate_http_readonly="true"
--authenticate_http_readwrite="true" --authenticatee="crammd5" --authentication_backoff_factor="1secs"
--authorizer="local" --cgroups_cpu_enable_pids_and_tids_count="false" --cgroups_enable_cfs="false"
--cgroups_hierarchy="/sys/fs/cgroup" --cgroups_limit_swap="false" --cgroups_root="mesos" --container_disk_watch_interval="15secs"
--containerizers="mesos" --credential="/tmp/Endpoint_SlaveEndpointTest_NoAuthorizer_0_1bBb0e/credential"
--default_role="*" --disk_watch_interval="1mins" --docker="docker" --docker_kill_orphans="true"
--docker_registry="https://registry-1.docker.io" --docker_remove_delay="6hrs" --docker_socket="/var/run/docker.sock"
--docker_stop_timeout="0ns" --docker_store_dir="/tmp/Endpoint_SlaveEndpointTest_NoAuthorizer_0_1bBb0e/store/docker"
--docker_volume_checkpoint_dir="/var/run/mesos/isolators/docker/volume" --enforce_container_disk_quota="false"
--executor_registration_timeout="1mins" --executor_reregistration_timeout="2secs" --executor_shutdown_grace_period="5secs"
--fetcher_cache_dir="/tmp/Endpoint_SlaveEndpointTest_NoAuthorizer_0_1bBb0e/fetch" --fetcher_cache_size="2GB"
--frameworks_home="" --gc_delay="1weeks" --gc_disk_headroom="0.1" --hadoop_home="" --help="false"
--hostname_lookup="true" --http_command_executor="false" --http_credentials="/tmp/Endpoint_SlaveEndpointTest_NoAuthorizer_0_1bBb0e/http_credentials"
--http_heartbeat_interval="30secs" --initialize_driver_logging="true" --isolation="posix/cpu,posix/mem"
--launcher="posix" --launcher_dir="/mesos/mesos-1.4.0/_build/src" --logbufsecs="0" --logging_level="INFO"
--max_completed_executors_per_framework="150" --oversubscribed_resources_interval="15secs"
--perf_duration="10secs" --perf_interval="1mins" --port="5051" --qos_correction_interval_min="0ns"
--quiet="false" --recover="reconnect" --recovery_timeout="15mins" --registration_backoff_factor="10ms"
--resources="cpus:2;gpus:0;mem:1024;disk:1024;ports:[31000-32000]" --revocable_cpu_low_priority="true"
--runtime_dir="/tmp/Endpoint_SlaveEndpointTest_NoAuthorizer_0_1bBb0e" --sandbox_directory="/mnt/mesos/sandbox"
--strict="true" --switch_user="true" --systemd_enable_support="true" --systemd_runtime_directory="/run/systemd/system"
--version="false" --work_dir="/tmp/Endpoint_SlaveEndpointTest_NoAuthorizer_0_Xo2Y2e"
I0722 07:58:20.276450  5047 credentials.hpp:86] Loading credential for authentication from
'/tmp/Endpoint_SlaveEndpointTest_NoAuthorizer_0_1bBb0e/credential'
I0722 07:58:20.276885  5047 slave.cpp:283] Agent using credential for: test-principal
I0722 07:58:20.276917  5047 credentials.hpp:37] Loading credentials for authentication from
'/tmp/Endpoint_SlaveEndpointTest_NoAuthorizer_0_1bBb0e/http_credentials'
I0722 07:58:20.277441  5047 http.cpp:993] Creating default 'basic' HTTP authenticator for
realm 'mesos-agent-readonly'
I0722 07:58:20.277802  5047 http.cpp:993] Creating default 'basic' HTTP authenticator for
realm 'mesos-agent-readwrite'
I0722 07:58:20.280061  5047 slave.cpp:565] Agent resources: [{"name":"cpus","scalar":{"value":2.0},"type":"SCALAR"},{"name":"mem","scalar":{"value":1024.0},"type":"SCALAR"},{"name":"disk","scalar":{"value":1024.0},"type":"SCALAR"},{"name":"ports","ranges":{"range":[{"begin":31000,"end":32000}]},"type":"RANGES"}]
I0722 07:58:20.280493  5047 slave.cpp:573] Agent attributes: [  ]
I0722 07:58:20.280514  5047 slave.cpp:582] Agent hostname: 043a47e3a3e5
I0722 07:58:20.280900  5046 status_update_manager.cpp:177] Pausing sending status updates
I0722 07:58:20.283638  5045 state.cpp:64] Recovering state from '/tmp/Endpoint_SlaveEndpointTest_NoAuthorizer_0_Xo2Y2e/meta'
I0722 07:58:20.284080  5048 status_update_manager.cpp:203] Recovering status update manager
I0722 07:58:20.284502  5052 containerizer.cpp:582] Recovering containerizer
I0722 07:58:20.286597  5051 provisioner.cpp:416] Provisioner recovery complete
I0722 07:58:20.287137  5048 slave.cpp:6207] Finished recovery
I0722 07:58:20.287747  5048 slave.cpp:6389] Querying resource estimator for oversubscribable
resources
I0722 07:58:20.288132  5050 slave.cpp:6403] Received oversubscribable resources {} from the
resource estimator
I0722 07:58:20.292141  5050 process.cpp:3837] Handling HTTP event for process 'slave(796)'
with path: '/slave(796)/monitor/statistics'
I0722 07:58:20.294168  5047 http.cpp:1133] HTTP GET for /slave(796)/monitor/statistics from
172.17.0.2:46452
I0722 07:58:20.294301  5047 http.cpp:957] Authorizing principal 'test-principal' to GET the
'/monitor/statistics' endpoint
I0722 07:58:20.299665  5026 slave.cpp:843] Agent terminating
[       OK ] Endpoint/SlaveEndpointTest.NoAuthorizer/0 (46 ms)
[ RUN      ] Endpoint/SlaveEndpointTest.NoAuthorizer/1
I0722 07:58:20.315513  5026 containerizer.cpp:230] Using isolation: posix/cpu,posix/mem,filesystem/posix,network/cni,environment_secret
W0722 07:58:20.316493  5026 backend.cpp:76] Failed to create 'overlay' backend: OverlayBackend
requires root privileges
W0722 07:58:20.316833  5026 backend.cpp:76] Failed to create 'bind' backend: BindBackend requires
root privileges
I0722 07:58:20.316953  5026 provisioner.cpp:255] Using default backend 'copy'
I0722 07:58:20.319495  5026 cluster.cpp:448] Creating default 'local' authorizer
I0722 07:58:20.322376  5050 slave.cpp:250] Mesos agent started on (797)@172.17.0.2:37297
I0722 07:58:20.322415  5050 slave.cpp:251] Flags at startup: --acls="" --appc_simple_discovery_uri_prefix="http://"
--appc_store_dir="/tmp/Endpoint_SlaveEndpointTest_NoAuthorizer_1_lkYWef/store/appc" --authenticate_http_readonly="true"
--authenticate_http_readwrite="true" --authenticatee="crammd5" --authentication_backoff_factor="1secs"
--authorizer="local" --cgroups_cpu_enable_pids_and_tids_count="false" --cgroups_enable_cfs="false"
--cgroups_hierarchy="/sys/fs/cgroup" --cgroups_limit_swap="false" --cgroups_root="mesos" --container_disk_watch_interval="15secs"
--containerizers="mesos" --credential="/tmp/Endpoint_SlaveEndpointTest_NoAuthorizer_1_lkYWef/credential"
--default_role="*" --disk_watch_interval="1mins" --docker="docker" --docker_kill_orphans="true"
--docker_registry="https://registry-1.docker.io" --docker_remove_delay="6hrs" --docker_socket="/var/run/docker.sock"
--docker_stop_timeout="0ns" --docker_store_dir="/tmp/Endpoint_SlaveEndpointTest_NoAuthorizer_1_lkYWef/store/docker"
--docker_volume_checkpoint_dir="/var/run/mesos/isolators/docker/volume" --enforce_container_disk_quota="false"
--executor_registration_timeout="1mins" --executor_reregistration_timeout="2secs" --executor_shutdown_grace_period="5secs"
--fetcher_cache_dir="/tmp/Endpoint_SlaveEndpointTest_NoAuthorizer_1_lkYWef/fetch" --fetcher_cache_size="2GB"
--frameworks_home="" --gc_delay="1weeks" --gc_disk_headroom="0.1" --hadoop_home="" --help="false"
--hostname_lookup="true" --http_command_executor="false" --http_credentials="/tmp/Endpoint_SlaveEndpointTest_NoAuthorizer_1_lkYWef/http_credentials"
--http_heartbeat_interval="30secs" --initialize_driver_logging="true" --isolation="posix/cpu,posix/mem"
--launcher="posix" --launcher_dir="/mesos/mesos-1.4.0/_build/src" --logbufsecs="0" --logging_level="INFO"
--max_completed_executors_per_framework="150" --oversubscribed_resources_interval="15secs"
--perf_duration="10secs" --perf_interval="1mins" --port="5051" --qos_correction_interval_min="0ns"
--quiet="false" --recover="reconnect" --recovery_timeout="15mins" --registration_backoff_factor="10ms"
--resources="cpus:2;gpus:0;mem:1024;disk:1024;ports:[31000-32000]" --revocable_cpu_low_priority="true"
--runtime_dir="/tmp/Endpoint_SlaveEndpointTest_NoAuthorizer_1_lkYWef" --sandbox_directory="/mnt/mesos/sandbox"
--strict="true" --switch_user="true" --systemd_enable_support="true" --systemd_runtime_directory="/run/systemd/system"
--version="false" --work_dir="/tmp/Endpoint_SlaveEndpointTest_NoAuthorizer_1_runcaf"
I0722 07:58:20.323148  5050 credentials.hpp:86] Loading credential for authentication from
'/tmp/Endpoint_SlaveEndpointTest_NoAuthorizer_1_lkYWef/credential'
I0722 07:58:20.323422  5050 slave.cpp:283] Agent using credential for: test-principal
I0722 07:58:20.323456  5050 credentials.hpp:37] Loading credentials for authentication from
'/tmp/Endpoint_SlaveEndpointTest_NoAuthorizer_1_lkYWef/http_credentials'
I0722 07:58:20.323874  5050 http.cpp:993] Creating default 'basic' HTTP authenticator for
realm 'mesos-agent-readonly'
I0722 07:58:20.324106  5050 http.cpp:993] Creating default 'basic' HTTP authenticator for
realm 'mesos-agent-readwrite'
I0722 07:58:20.326231  5050 slave.cpp:565] Agent resources: [{"name":"cpus","scalar":{"value":2.0},"type":"SCALAR"},{"name":"mem","scalar":{"value":1024.0},"type":"SCALAR"},{"name":"disk","scalar":{"value":1024.0},"type":"SCALAR"},{"name":"ports","ranges":{"range":[{"begin":31000,"end":32000}]},"type":"RANGES"}]
I0722 07:58:20.326658  5050 slave.cpp:573] Agent attributes: [  ]
I0722 07:58:20.326679  5050 slave.cpp:582] Agent hostname: 043a47e3a3e5
I0722 07:58:20.326884  5048 status_update_manager.cpp:177] Pausing sending status updates
I0722 07:58:20.328819  5051 state.cpp:64] Recovering state from '/tmp/Endpoint_SlaveEndpointTest_NoAuthorizer_1_runcaf/meta'
I0722 07:58:20.329641  5052 status_update_manager.cpp:203] Recovering status update manager
I0722 07:58:20.329913  5049 containerizer.cpp:582] Recovering containerizer
I0722 07:58:20.331938  5045 provisioner.cpp:416] Provisioner recovery complete
I0722 07:58:20.332499  5052 slave.cpp:6207] Finished recovery
I0722 07:58:20.333113  5052 slave.cpp:6389] Querying resource estimator for oversubscribable
resources
I0722 07:58:20.333453  5048 slave.cpp:6403] Received oversubscribable resources {} from the
resource estimator
I0722 07:58:20.337811  5048 process.cpp:3837] Handling HTTP event for process 'slave(797)'
with path: '/slave(797)/monitor/statistics.json'
I0722 07:58:20.339995  5046 http.cpp:1133] HTTP GET for /slave(797)/monitor/statistics.json
from 172.17.0.2:46454
I0722 07:58:20.340214  5046 http.cpp:957] Authorizing principal 'test-principal' to GET the
'/monitor/statistics.json' endpoint
I0722 07:58:20.345850  5026 slave.cpp:843] Agent terminating
[       OK ] Endpoint/SlaveEndpointTest.NoAuthorizer/1 (45 ms)
[ RUN      ] Endpoint/SlaveEndpointTest.NoAuthorizer/2
I0722 07:58:20.361709  5026 containerizer.cpp:230] Using isolation: posix/cpu,posix/mem,filesystem/posix,network/cni,environment_secret
W0722 07:58:20.362601  5026 backend.cpp:76] Failed to create 'overlay' backend: OverlayBackend
requires root privileges
W0722 07:58:20.362879  5026 backend.cpp:76] Failed to create 'bind' backend: BindBackend requires
root privileges
I0722 07:58:20.362987  5026 provisioner.cpp:255] Using default backend 'copy'
I0722 07:58:20.365464  5026 cluster.cpp:448] Creating default 'local' authorizer
I0722 07:58:20.368326  5049 slave.cpp:250] Mesos agent started on (798)@172.17.0.2:37297
I0722 07:58:20.368369  5049 slave.cpp:251] Flags at startup: --acls="" --appc_simple_discovery_uri_prefix="http://"
--appc_store_dir="/tmp/Endpoint_SlaveEndpointTest_NoAuthorizer_2_B8VxXf/store/appc" --authenticate_http_readonly="true"
--authenticate_http_readwrite="true" --authenticatee="crammd5" --authentication_backoff_factor="1secs"
--authorizer="local" --cgroups_cpu_enable_pids_and_tids_count="false" --cgroups_enable_cfs="false"
--cgroups_hierarchy="/sys/fs/cgroup" --cgroups_limit_swap="false" --cgroups_root="mesos" --container_disk_watch_interval="15secs"
--containerizers="mesos" --credential="/tmp/Endpoint_SlaveEndpointTest_NoAuthorizer_2_B8VxXf/credential"
--default_role="*" --disk_watch_interval="1mins" --docker="docker" --docker_kill_orphans="true"
--docker_registry="https://registry-1.docker.io" --docker_remove_delay="6hrs" --docker_socket="/var/run/docker.sock"
--docker_stop_timeout="0ns" --docker_store_dir="/tmp/Endpoint_SlaveEndpointTest_NoAuthorizer_2_B8VxXf/store/docker"
--docker_volume_checkpoint_dir="/var/run/mesos/isolators/docker/volume" --enforce_container_disk_quota="false"
--executor_registration_timeout="1mins" --executor_reregistration_timeout="2secs" --executor_shutdown_grace_period="5secs"
--fetcher_cache_dir="/tmp/Endpoint_SlaveEndpointTest_NoAuthorizer_2_B8VxXf/fetch" --fetcher_cache_size="2GB"
--frameworks_home="" --gc_delay="1weeks" --gc_disk_headroom="0.1" --hadoop_home="" --help="false"
--hostname_lookup="true" --http_command_executor="false" --http_credentials="/tmp/Endpoint_SlaveEndpointTest_NoAuthorizer_2_B8VxXf/http_credentials"
--http_heartbeat_interval="30secs" --initialize_driver_logging="true" --isolation="posix/cpu,posix/mem"
--launcher="posix" --launcher_dir="/mesos/mesos-1.4.0/_build/src" --logbufsecs="0" --logging_level="INFO"
--max_completed_executors_per_framework="150" --oversubscribed_resources_interval="15secs"
--perf_duration="10secs" --perf_interval="1mins" --port="5051" --qos_correction_interval_min="0ns"
--quiet="false" --recover="reconnect" --recovery_timeout="15mins" --registration_backoff_factor="10ms"
--resources="cpus:2;gpus:0;mem:1024;disk:1024;ports:[31000-32000]" --revocable_cpu_low_priority="true"
--runtime_dir="/tmp/Endpoint_SlaveEndpointTest_NoAuthorizer_2_B8VxXf" --sandbox_directory="/mnt/mesos/sandbox"
--strict="true" --switch_user="true" --systemd_enable_support="true" --systemd_runtime_directory="/run/systemd/system"
--version="false" --work_dir="/tmp/Endpoint_SlaveEndpointTest_NoAuthorizer_2_hLIiLf"
I0722 07:58:20.369101  5049 credentials.hpp:86] Loading credential for authentication from
'/tmp/Endpoint_SlaveEndpointTest_NoAuthorizer_2_B8VxXf/credential'
I0722 07:58:20.369359  5049 slave.cpp:283] Agent using credential for: test-principal
I0722 07:58:20.369397  5049 credentials.hpp:37] Loading credentials for authentication from
'/tmp/Endpoint_SlaveEndpointTest_NoAuthorizer_2_B8VxXf/http_credentials'
I0722 07:58:20.369779  5049 http.cpp:993] Creating default 'basic' HTTP authenticator for
realm 'mesos-agent-readonly'
I0722 07:58:20.369993  5049 http.cpp:993] Creating default 'basic' HTTP authenticator for
realm 'mesos-agent-readwrite'
I0722 07:58:20.372097  5049 slave.cpp:565] Agent resources: [{"name":"cpus","scalar":{"value":2.0},"type":"SCALAR"},{"name":"mem","scalar":{"value":1024.0},"type":"SCALAR"},{"name":"disk","scalar":{"value":1024.0},"type":"SCALAR"},{"name":"ports","ranges":{"range":[{"begin":31000,"end":32000}]},"type":"RANGES"}]
I0722 07:58:20.372524  5049 slave.cpp:573] Agent attributes: [  ]
I0722 07:58:20.372546  5049 slave.cpp:582] Agent hostname: 043a47e3a3e5
I0722 07:58:20.372774  5050 status_update_manager.cpp:177] Pausing sending status updates
I0722 07:58:20.374691  5048 state.cpp:64] Recovering state from '/tmp/Endpoint_SlaveEndpointTest_NoAuthorizer_2_hLIiLf/meta'
I0722 07:58:20.375197  5048 status_update_manager.cpp:203] Recovering status update manager
I0722 07:58:20.375514  5051 containerizer.cpp:582] Recovering containerizer
I0722 07:58:20.377774  5050 provisioner.cpp:416] Provisioner recovery complete
I0722 07:58:20.378444  5045 slave.cpp:6207] Finished recovery
I0722 07:58:20.379112  5045 slave.cpp:6389] Querying resource estimator for oversubscribable
resources
I0722 07:58:20.379504  5045 slave.cpp:6403] Received oversubscribable resources {} from the
resource estimator
I0722 07:58:20.384023  5046 process.cpp:3837] Handling HTTP event for process 'slave(798)'
with path: '/slave(798)/containers'
I0722 07:58:20.386461  5045 http.cpp:1133] HTTP GET for /slave(798)/containers from 172.17.0.2:46456
I0722 07:58:20.386589  5045 http.cpp:957] Authorizing principal 'test-principal' to GET the
'/containers' endpoint
I0722 07:58:20.393496  5026 slave.cpp:843] Agent terminating
[       OK ] Endpoint/SlaveEndpointTest.NoAuthorizer/2 (47 ms)
[----------] 9 tests from Endpoint/SlaveEndpointTest (431 ms total)

[----------] Global test environment tear-down
[==========] 1637 tests from 179 test cases ran. (717084 ms total)
[  PASSED  ] 1633 tests.
[  FAILED  ] 4 tests, listed below:
[  FAILED  ] DefaultExecutorCheckTest.CommandCheckDeliveredAndReconciled
[  FAILED  ] DefaultExecutorCheckTest.CommandCheckStatusChange
[  FAILED  ] DefaultExecutorCheckTest.CommandCheckSeesParentsEnv
[  FAILED  ] DefaultExecutorCheckTest.CommandCheckSharesWorkDirWithTask

 4 FAILED TESTS
  YOU HAVE 20 DISABLED TESTS

I0722 07:58:20.534317  5053 process.cpp:1006] Failed to accept socket: future discarded
make[4]: *** [check-local] Error 1
make[4]: Leaving directory `/mesos/mesos-1.4.0/_build/src'
make[3]: *** [check-am] Error 2
make[3]: Leaving directory `/mesos/mesos-1.4.0/_build/src'
make[2]: *** [check] Error 2
make[2]: Leaving directory `/mesos/mesos-1.4.0/_build/src'
make[1]: *** [check-recursive] Error 1
make[1]: Leaving directory `/mesos/mesos-1.4.0/_build'
make: *** [distcheck] Error 1
+ docker rmi mesos-1500704676-22768
Untagged: mesos-1500704676-22768:latest
Deleted: sha256:1a409c676a820473a72170b1102c01d649594e9358fc6b23cce72056d24a271d
Deleted: sha256:239ba904d93a5cbfdd6c81c8e8e6ddbf6a624a6a4d726b89affe585f7e63a92e
Deleted: sha256:177eb9f4bdf82b99706f9afe1de0d530d06a2b7948c3095b3143c3045a4c95bf
Deleted: sha256:e5be2709b30bf3355a7f7f2f521abbabe077f95a3a15a137a99a336aa06b3959
Deleted: sha256:db852fd5c36d92ea33c7ea6e0fc84ccf603ff2fc1d4b3dac985d439531eb52bc
Deleted: sha256:c239f16d1dbd92758e608a60b07694482a3c8d4a9220a4762cc2740faf7a955e
Deleted: sha256:5e800990fe40311cff213b4dfd39c834f77a395bb78e7df46e91aa3f8da81aa7
Deleted: sha256:25534f54afe53df0e1fc9599ac8986ad216764227e7b6ee9121a989111747f37
Deleted: sha256:6c22e0aca4a487a41eac02f34767c1579a9184c0966be673b4ab827a5d393644
Deleted: sha256:d5fa16b539f48e142ccf23673629c438d9da76537fd5693fcbca0298998cfe01
Deleted: sha256:e928105a3f0686406d02d78cae3465a58087362d6afc5ed3a20a4be6919ff76f
Deleted: sha256:3aa68946ba2ae1c0ce56dd5976620a8a3c615749eda459755010abd1126d1663
Deleted: sha256:82accba6b158c26916c907fcbbb19b987f11bd3fe96e998c719ed0d7d034e4da
Deleted: sha256:31f872997cb529edb82586f0c2e10d2bdaa3057525bfa96289601b0190a069df
Deleted: sha256:1cf2e170fe58dc33943b3e3cfd9c157e6fad3687c0344d4f6dbc92ceffbf45e0
Deleted: sha256:ab91687d9e033d76f460d412d0a7ba184bba2f1cf1dced3e05249403a04baf48
Deleted: sha256:ea3925be013b835f354db44ccb77213bd6eb5fe414e28ff7c503dd3664d95298
Deleted: sha256:fce582458922a1da52381cc229332fd68c2a1350fc8bd8cfe8e2a4d809813071
Deleted: sha256:4cc427029956f89f5dd35581965bf5a85ecbb5b42f876577760149ad598a2eb4
Deleted: sha256:10257fb097c4066e3e93318cb65f1c2e87dc86a73a37da31600fd9718ed06078
Deleted: sha256:fe7b2ce0bcfd1c641acd3b98f58a21e6e643759ac3d95fb8b0175f7ea02a0756
Deleted: sha256:3ffbb081c1031042fd1f55d3ee03eb4f6fe806fc15796a197ea2f1ee75c04f89
Deleted: sha256:1a5fd69a2a993708f036ba2193b06855ea7f58e6d952ac2eca14fb497e8c5c47
Deleted: sha256:6421fee3e6abfc42d7b02b0b3cdc38a45d9fc1b3fbcf31a2b850a3ca5ce412ce
Build step 'Execute shell' marked build as failure

Mime
View raw message