mesos-builds mailing list archives

Site index · List index
Message view « Date » · « Thread »
Top « Date » · « Thread »
From Apache Jenkins Server <jenk...@builds.apache.org>
Subject Build failed in Jenkins: Mesos-Reviewbot #18568
Date Fri, 21 Jul 2017 19:57:50 GMT
See <https://builds.apache.org/job/Mesos-Reviewbot/18568/display/redirect?page=changes>

Changes:

[xujyan] Minor fix to use the more idiomatic `send` method.

------------------------------------------
[...truncated 30.16 MB...]
I0721 19:57:43.114866  5022 containerizer.cpp:230] Using isolation: posix/cpu,posix/mem,filesystem/posix,network/cni,environment_secret
W0721 19:57:43.115628  5022 backend.cpp:76] Failed to create 'overlay' backend: OverlayBackend
requires root privileges
W0721 19:57:43.115788  5022 backend.cpp:76] Failed to create 'bind' backend: BindBackend requires
root privileges
I0721 19:57:43.115831  5022 provisioner.cpp:255] Using default backend 'copy'
I0721 19:57:43.120755  5042 slave.cpp:250] Mesos agent started on (792)@172.17.0.3:39115
I0721 19:57:43.120885  5042 slave.cpp:251] Flags at startup: --acls="" --appc_simple_discovery_uri_prefix="http://"
--appc_store_dir="/tmp/Endpoint_SlaveEndpointTest_AuthorizedRequest_2_7aTf2Y/store/appc" --authenticate_http_readonly="true"
--authenticate_http_readwrite="true" --authenticatee="crammd5" --authentication_backoff_factor="1secs"
--authorizer="local" --cgroups_cpu_enable_pids_and_tids_count="false" --cgroups_enable_cfs="false"
--cgroups_hierarchy="/sys/fs/cgroup" --cgroups_limit_swap="false" --cgroups_root="mesos" --container_disk_watch_interval="15secs"
--containerizers="mesos" --credential="/tmp/Endpoint_SlaveEndpointTest_AuthorizedRequest_2_7aTf2Y/credential"
--default_role="*" --disk_watch_interval="1mins" --docker="docker" --docker_kill_orphans="true"
--docker_registry="https://registry-1.docker.io" --docker_remove_delay="6hrs" --docker_socket="/var/run/docker.sock"
--docker_stop_timeout="0ns" --docker_store_dir="/tmp/Endpoint_SlaveEndpointTest_AuthorizedRequest_2_7aTf2Y/store/docker"
--docker_volume_checkpoint_dir="/var/run/mesos/isolators/docker/volume" --enforce_container_disk_quota="false"
--executor_registration_timeout="1mins" --executor_reregistration_timeout="2secs" --executor_shutdown_grace_period="5secs"
--fetcher_cache_dir="/tmp/Endpoint_SlaveEndpointTest_AuthorizedRequest_2_7aTf2Y/fetch" --fetcher_cache_size="2GB"
--frameworks_home="" --gc_delay="1weeks" --gc_disk_headroom="0.1" --hadoop_home="" --help="false"
--hostname_lookup="true" --http_command_executor="false" --http_credentials="/tmp/Endpoint_SlaveEndpointTest_AuthorizedRequest_2_7aTf2Y/http_credentials"
--http_heartbeat_interval="30secs" --initialize_driver_logging="true" --isolation="posix/cpu,posix/mem"
--launcher="posix" --launcher_dir="/mesos/mesos-1.4.0/_build/src" --logbufsecs="0" --logging_level="INFO"
--max_completed_executors_per_framework="150" --oversubscribed_resources_interval="15secs"
--perf_duration="10secs" --perf_interval="1mins" --port="5051" --qos_correction_interval_min="0ns"
--quiet="false" --recover="reconnect" --recovery_timeout="15mins" --registration_backoff_factor="10ms"
--resources="cpus:2;gpus:0;mem:1024;disk:1024;ports:[31000-32000]" --revocable_cpu_low_priority="true"
--runtime_dir="/tmp/Endpoint_SlaveEndpointTest_AuthorizedRequest_2_7aTf2Y" --sandbox_directory="/mnt/mesos/sandbox"
--strict="true" --switch_user="true" --systemd_enable_support="true" --systemd_runtime_directory="/run/systemd/system"
--version="false" --work_dir="/tmp/Endpoint_SlaveEndpointTest_AuthorizedRequest_2_Lq94ii"
I0721 19:57:43.121924  5042 credentials.hpp:86] Loading credential for authentication from
'/tmp/Endpoint_SlaveEndpointTest_AuthorizedRequest_2_7aTf2Y/credential'
I0721 19:57:43.122352  5042 slave.cpp:283] Agent using credential for: test-principal
I0721 19:57:43.122419  5042 credentials.hpp:37] Loading credentials for authentication from
'/tmp/Endpoint_SlaveEndpointTest_AuthorizedRequest_2_7aTf2Y/http_credentials'
I0721 19:57:43.123018  5042 http.cpp:993] Creating default 'basic' HTTP authenticator for
realm 'mesos-agent-readonly'
I0721 19:57:43.123425  5042 http.cpp:993] Creating default 'basic' HTTP authenticator for
realm 'mesos-agent-readwrite'
I0721 19:57:43.125887  5042 slave.cpp:565] Agent resources: [{"name":"cpus","scalar":{"value":2.0},"type":"SCALAR"},{"name":"mem","scalar":{"value":1024.0},"type":"SCALAR"},{"name":"disk","scalar":{"value":1024.0},"type":"SCALAR"},{"name":"ports","ranges":{"range":[{"begin":31000,"end":32000}]},"type":"RANGES"}]
I0721 19:57:43.126551  5042 slave.cpp:573] Agent attributes: [  ]
I0721 19:57:43.126607  5042 slave.cpp:582] Agent hostname: 097ade6e6ad2
I0721 19:57:43.127089  5041 status_update_manager.cpp:177] Pausing sending status updates
I0721 19:57:43.129235  5045 state.cpp:64] Recovering state from '/tmp/Endpoint_SlaveEndpointTest_AuthorizedRequest_2_Lq94ii/meta'
I0721 19:57:43.129768  5048 status_update_manager.cpp:203] Recovering status update manager
I0721 19:57:43.130061  5047 containerizer.cpp:582] Recovering containerizer
I0721 19:57:43.132144  5043 provisioner.cpp:416] Provisioner recovery complete
I0721 19:57:43.132947  5044 slave.cpp:6207] Finished recovery
I0721 19:57:43.133883  5044 slave.cpp:6389] Querying resource estimator for oversubscribable
resources
I0721 19:57:43.134358  5044 slave.cpp:6403] Received oversubscribable resources {} from the
resource estimator
I0721 19:57:43.138715  5041 process.cpp:3837] Handling HTTP event for process 'slave(792)'
with path: '/slave(792)/containers'
I0721 19:57:43.140827  5047 http.cpp:1133] HTTP GET for /slave(792)/containers from 172.17.0.3:57852
I0721 19:57:43.140952  5047 http.cpp:957] Authorizing principal 'test-principal' to GET the
'/containers' endpoint
I0721 19:57:43.147258  5048 slave.cpp:843] Agent terminating
[       OK ] Endpoint/SlaveEndpointTest.AuthorizedRequest/2 (49 ms)
[ RUN      ] Endpoint/SlaveEndpointTest.UnauthorizedRequest/0
I0721 19:57:43.165052  5022 containerizer.cpp:230] Using isolation: posix/cpu,posix/mem,filesystem/posix,network/cni,environment_secret
W0721 19:57:43.165835  5022 backend.cpp:76] Failed to create 'overlay' backend: OverlayBackend
requires root privileges
W0721 19:57:43.166000  5022 backend.cpp:76] Failed to create 'bind' backend: BindBackend requires
root privileges
I0721 19:57:43.166041  5022 provisioner.cpp:255] Using default backend 'copy'
I0721 19:57:43.170913  5043 slave.cpp:250] Mesos agent started on (793)@172.17.0.3:39115
I0721 19:57:43.170951  5043 slave.cpp:251] Flags at startup: --acls="" --appc_simple_discovery_uri_prefix="http://"
--appc_store_dir="/tmp/Endpoint_SlaveEndpointTest_UnauthorizedRequest_0_1nbxoK/store/appc"
--authenticate_http_readonly="true" --authenticate_http_readwrite="true" --authenticatee="crammd5"
--authentication_backoff_factor="1secs" --authorizer="local" --cgroups_cpu_enable_pids_and_tids_count="false"
--cgroups_enable_cfs="false" --cgroups_hierarchy="/sys/fs/cgroup" --cgroups_limit_swap="false"
--cgroups_root="mesos" --container_disk_watch_interval="15secs" --containerizers="mesos" --credential="/tmp/Endpoint_SlaveEndpointTest_UnauthorizedRequest_0_1nbxoK/credential"
--default_role="*" --disk_watch_interval="1mins" --docker="docker" --docker_kill_orphans="true"
--docker_registry="https://registry-1.docker.io" --docker_remove_delay="6hrs" --docker_socket="/var/run/docker.sock"
--docker_stop_timeout="0ns" --docker_store_dir="/tmp/Endpoint_SlaveEndpointTest_UnauthorizedRequest_0_1nbxoK/store/docker"
--docker_volume_checkpoint_dir="/var/run/mesos/isolators/docker/volume" --enforce_container_disk_quota="false"
--executor_registration_timeout="1mins" --executor_reregistration_timeout="2secs" --executor_shutdown_grace_period="5secs"
--fetcher_cache_dir="/tmp/Endpoint_SlaveEndpointTest_UnauthorizedRequest_0_1nbxoK/fetch" --fetcher_cache_size="2GB"
--frameworks_home="" --gc_delay="1weeks" --gc_disk_headroom="0.1" --hadoop_home="" --help="false"
--hostname_lookup="true" --http_command_executor="false" --http_credentials="/tmp/Endpoint_SlaveEndpointTest_UnauthorizedRequest_0_1nbxoK/http_credentials"
--http_heartbeat_interval="30secs" --initialize_driver_logging="true" --isolation="posix/cpu,posix/mem"
--launcher="posix" --launcher_dir="/mesos/mesos-1.4.0/_build/src" --logbufsecs="0" --logging_level="INFO"
--max_completed_executors_per_framework="150" --oversubscribed_resources_interval="15secs"
--perf_duration="10secs" --perf_interval="1mins" --port="5051" --qos_correction_interval_min="0ns"
--quiet="false" --recover="reconnect" --recovery_timeout="15mins" --registration_backoff_factor="10ms"
--resources="cpus:2;gpus:0;mem:1024;disk:1024;ports:[31000-32000]" --revocable_cpu_low_priority="true"
--runtime_dir="/tmp/Endpoint_SlaveEndpointTest_UnauthorizedRequest_0_1nbxoK" --sandbox_directory="/mnt/mesos/sandbox"
--strict="true" --switch_user="true" --systemd_enable_support="true" --systemd_runtime_directory="/run/systemd/system"
--version="false" --work_dir="/tmp/Endpoint_SlaveEndpointTest_UnauthorizedRequest_0_Frpex3"
I0721 19:57:43.171783  5043 credentials.hpp:86] Loading credential for authentication from
'/tmp/Endpoint_SlaveEndpointTest_UnauthorizedRequest_0_1nbxoK/credential'
I0721 19:57:43.172256  5043 slave.cpp:283] Agent using credential for: test-principal
I0721 19:57:43.172291  5043 credentials.hpp:37] Loading credentials for authentication from
'/tmp/Endpoint_SlaveEndpointTest_UnauthorizedRequest_0_1nbxoK/http_credentials'
I0721 19:57:43.172757  5043 http.cpp:993] Creating default 'basic' HTTP authenticator for
realm 'mesos-agent-readonly'
I0721 19:57:43.173097  5043 http.cpp:993] Creating default 'basic' HTTP authenticator for
realm 'mesos-agent-readwrite'
I0721 19:57:43.175446  5043 slave.cpp:565] Agent resources: [{"name":"cpus","scalar":{"value":2.0},"type":"SCALAR"},{"name":"mem","scalar":{"value":1024.0},"type":"SCALAR"},{"name":"disk","scalar":{"value":1024.0},"type":"SCALAR"},{"name":"ports","ranges":{"range":[{"begin":31000,"end":32000}]},"type":"RANGES"}]
I0721 19:57:43.175878  5043 slave.cpp:573] Agent attributes: [  ]
I0721 19:57:43.175899  5043 slave.cpp:582] Agent hostname: 097ade6e6ad2
I0721 19:57:43.176265  5042 status_update_manager.cpp:177] Pausing sending status updates
I0721 19:57:43.178460  5046 state.cpp:64] Recovering state from '/tmp/Endpoint_SlaveEndpointTest_UnauthorizedRequest_0_Frpex3/meta'
I0721 19:57:43.178933  5042 status_update_manager.cpp:203] Recovering status update manager
I0721 19:57:43.179371  5041 containerizer.cpp:582] Recovering containerizer
I0721 19:57:43.181427  5043 provisioner.cpp:416] Provisioner recovery complete
I0721 19:57:43.182078  5044 slave.cpp:6207] Finished recovery
I0721 19:57:43.182919  5044 slave.cpp:6389] Querying resource estimator for oversubscribable
resources
I0721 19:57:43.183359  5044 slave.cpp:6403] Received oversubscribable resources {} from the
resource estimator
I0721 19:57:43.188112  5044 process.cpp:3837] Handling HTTP event for process 'slave(793)'
with path: '/slave(793)/monitor/statistics'
I0721 19:57:43.190387  5041 http.cpp:1133] HTTP GET for /slave(793)/monitor/statistics from
172.17.0.3:57854
I0721 19:57:43.190572  5041 http.cpp:957] Authorizing principal 'test-principal' to GET the
'/monitor/statistics' endpoint
I0721 19:57:43.194111  5045 slave.cpp:843] Agent terminating
[       OK ] Endpoint/SlaveEndpointTest.UnauthorizedRequest/0 (44 ms)
[ RUN      ] Endpoint/SlaveEndpointTest.UnauthorizedRequest/1
I0721 19:57:43.209295  5022 containerizer.cpp:230] Using isolation: posix/cpu,posix/mem,filesystem/posix,network/cni,environment_secret
W0721 19:57:43.210062  5022 backend.cpp:76] Failed to create 'overlay' backend: OverlayBackend
requires root privileges
W0721 19:57:43.210229  5022 backend.cpp:76] Failed to create 'bind' backend: BindBackend requires
root privileges
I0721 19:57:43.210271  5022 provisioner.cpp:255] Using default backend 'copy'
I0721 19:57:43.215188  5048 slave.cpp:250] Mesos agent started on (794)@172.17.0.3:39115
I0721 19:57:43.215230  5048 slave.cpp:251] Flags at startup: --acls="" --appc_simple_discovery_uri_prefix="http://"
--appc_store_dir="/tmp/Endpoint_SlaveEndpointTest_UnauthorizedRequest_1_vFQlew/store/appc"
--authenticate_http_readonly="true" --authenticate_http_readwrite="true" --authenticatee="crammd5"
--authentication_backoff_factor="1secs" --authorizer="local" --cgroups_cpu_enable_pids_and_tids_count="false"
--cgroups_enable_cfs="false" --cgroups_hierarchy="/sys/fs/cgroup" --cgroups_limit_swap="false"
--cgroups_root="mesos" --container_disk_watch_interval="15secs" --containerizers="mesos" --credential="/tmp/Endpoint_SlaveEndpointTest_UnauthorizedRequest_1_vFQlew/credential"
--default_role="*" --disk_watch_interval="1mins" --docker="docker" --docker_kill_orphans="true"
--docker_registry="https://registry-1.docker.io" --docker_remove_delay="6hrs" --docker_socket="/var/run/docker.sock"
--docker_stop_timeout="0ns" --docker_store_dir="/tmp/Endpoint_SlaveEndpointTest_UnauthorizedRequest_1_vFQlew/store/docker"
--docker_volume_checkpoint_dir="/var/run/mesos/isolators/docker/volume" --enforce_container_disk_quota="false"
--executor_registration_timeout="1mins" --executor_reregistration_timeout="2secs" --executor_shutdown_grace_period="5secs"
--fetcher_cache_dir="/tmp/Endpoint_SlaveEndpointTest_UnauthorizedRequest_1_vFQlew/fetch" --fetcher_cache_size="2GB"
--frameworks_home="" --gc_delay="1weeks" --gc_disk_headroom="0.1" --hadoop_home="" --help="false"
--hostname_lookup="true" --http_command_executor="false" --http_credentials="/tmp/Endpoint_SlaveEndpointTest_UnauthorizedRequest_1_vFQlew/http_credentials"
--http_heartbeat_interval="30secs" --initialize_driver_logging="true" --isolation="posix/cpu,posix/mem"
--launcher="posix" --launcher_dir="/mesos/mesos-1.4.0/_build/src" --logbufsecs="0" --logging_level="INFO"
--max_completed_executors_per_framework="150" --oversubscribed_resources_interval="15secs"
--perf_duration="10secs" --perf_interval="1mins" --port="5051" --qos_correction_interval_min="0ns"
--quiet="false" --recover="reconnect" --recovery_timeout="15mins" --registration_backoff_factor="10ms"
--resources="cpus:2;gpus:0;mem:1024;disk:1024;ports:[31000-32000]" --revocable_cpu_low_priority="true"
--runtime_dir="/tmp/Endpoint_SlaveEndpointTest_UnauthorizedRequest_1_vFQlew" --sandbox_directory="/mnt/mesos/sandbox"
--strict="true" --switch_user="true" --systemd_enable_support="true" --systemd_runtime_directory="/run/systemd/system"
--version="false" --work_dir="/tmp/Endpoint_SlaveEndpointTest_UnauthorizedRequest_1_r6tRfP"
I0721 19:57:43.216143  5048 credentials.hpp:86] Loading credential for authentication from
'/tmp/Endpoint_SlaveEndpointTest_UnauthorizedRequest_1_vFQlew/credential'
I0721 19:57:43.216660  5048 slave.cpp:283] Agent using credential for: test-principal
I0721 19:57:43.216701  5048 credentials.hpp:37] Loading credentials for authentication from
'/tmp/Endpoint_SlaveEndpointTest_UnauthorizedRequest_1_vFQlew/http_credentials'
I0721 19:57:43.217277  5048 http.cpp:993] Creating default 'basic' HTTP authenticator for
realm 'mesos-agent-readonly'
I0721 19:57:43.217607  5048 http.cpp:993] Creating default 'basic' HTTP authenticator for
realm 'mesos-agent-readwrite'
I0721 19:57:43.219826  5048 slave.cpp:565] Agent resources: [{"name":"cpus","scalar":{"value":2.0},"type":"SCALAR"},{"name":"mem","scalar":{"value":1024.0},"type":"SCALAR"},{"name":"disk","scalar":{"value":1024.0},"type":"SCALAR"},{"name":"ports","ranges":{"range":[{"begin":31000,"end":32000}]},"type":"RANGES"}]
I0721 19:57:43.220257  5048 slave.cpp:573] Agent attributes: [  ]
I0721 19:57:43.220278  5048 slave.cpp:582] Agent hostname: 097ade6e6ad2
I0721 19:57:43.220602  5046 status_update_manager.cpp:177] Pausing sending status updates
I0721 19:57:43.222530  5047 state.cpp:64] Recovering state from '/tmp/Endpoint_SlaveEndpointTest_UnauthorizedRequest_1_r6tRfP/meta'
I0721 19:57:43.223053  5044 status_update_manager.cpp:203] Recovering status update manager
I0721 19:57:43.223543  5048 containerizer.cpp:582] Recovering containerizer
I0721 19:57:43.225594  5046 provisioner.cpp:416] Provisioner recovery complete
I0721 19:57:43.226207  5045 slave.cpp:6207] Finished recovery
I0721 19:57:43.226861  5045 slave.cpp:6389] Querying resource estimator for oversubscribable
resources
I0721 19:57:43.227295  5048 slave.cpp:6403] Received oversubscribable resources {} from the
resource estimator
I0721 19:57:43.231837  5048 process.cpp:3837] Handling HTTP event for process 'slave(794)'
with path: '/slave(794)/monitor/statistics.json'
I0721 19:57:43.233909  5041 http.cpp:1133] HTTP GET for /slave(794)/monitor/statistics.json
from 172.17.0.3:57856
I0721 19:57:43.234040  5041 http.cpp:957] Authorizing principal 'test-principal' to GET the
'/monitor/statistics.json' endpoint
I0721 19:57:43.237629  5048 slave.cpp:843] Agent terminating
[       OK ] Endpoint/SlaveEndpointTest.UnauthorizedRequest/1 (43 ms)
[ RUN      ] Endpoint/SlaveEndpointTest.UnauthorizedRequest/2
I0721 19:57:43.253090  5022 containerizer.cpp:230] Using isolation: posix/cpu,posix/mem,filesystem/posix,network/cni,environment_secret
W0721 19:57:43.253926  5022 backend.cpp:76] Failed to create 'overlay' backend: OverlayBackend
requires root privileges
W0721 19:57:43.254102  5022 backend.cpp:76] Failed to create 'bind' backend: BindBackend requires
root privileges
I0721 19:57:43.254143  5022 provisioner.cpp:255] Using default backend 'copy'
I0721 19:57:43.259135  5044 slave.cpp:250] Mesos agent started on (795)@172.17.0.3:39115
I0721 19:57:43.259176  5044 slave.cpp:251] Flags at startup: --acls="" --appc_simple_discovery_uri_prefix="http://"
--appc_store_dir="/tmp/Endpoint_SlaveEndpointTest_UnauthorizedRequest_2_1pUAwi/store/appc"
--authenticate_http_readonly="true" --authenticate_http_readwrite="true" --authenticatee="crammd5"
--authentication_backoff_factor="1secs" --authorizer="local" --cgroups_cpu_enable_pids_and_tids_count="false"
--cgroups_enable_cfs="false" --cgroups_hierarchy="/sys/fs/cgroup" --cgroups_limit_swap="false"
--cgroups_root="mesos" --container_disk_watch_interval="15secs" --containerizers="mesos" --credential="/tmp/Endpoint_SlaveEndpointTest_UnauthorizedRequest_2_1pUAwi/credential"
--default_role="*" --disk_watch_interval="1mins" --docker="docker" --docker_kill_orphans="true"
--docker_registry="https://registry-1.docker.io" --docker_remove_delay="6hrs" --docker_socket="/var/run/docker.sock"
--docker_stop_timeout="0ns" --docker_store_dir="/tmp/Endpoint_SlaveEndpointTest_UnauthorizedRequest_2_1pUAwi/store/docker"
--docker_volume_checkpoint_dir="/var/run/mesos/isolators/docker/volume" --enforce_container_disk_quota="false"
--executor_registration_timeout="1mins" --executor_reregistration_timeout="2secs" --executor_shutdown_grace_period="5secs"
--fetcher_cache_dir="/tmp/Endpoint_SlaveEndpointTest_UnauthorizedRequest_2_1pUAwi/fetch" --fetcher_cache_size="2GB"
--frameworks_home="" --gc_delay="1weeks" --gc_disk_headroom="0.1" --hadoop_home="" --help="false"
--hostname_lookup="true" --http_command_executor="false" --http_credentials="/tmp/Endpoint_SlaveEndpointTest_UnauthorizedRequest_2_1pUAwi/http_credentials"
--http_heartbeat_interval="30secs" --initialize_driver_logging="true" --isolation="posix/cpu,posix/mem"
--launcher="posix" --launcher_dir="/mesos/mesos-1.4.0/_build/src" --logbufsecs="0" --logging_level="INFO"
--max_completed_executors_per_framework="150" --oversubscribed_resources_interval="15secs"
--perf_duration="10secs" --perf_interval="1mins" --port="5051" --qos_correction_interval_min="0ns"
--quiet="false" --recover="reconnect" --recovery_timeout="15mins" --registration_backoff_factor="10ms"
--resources="cpus:2;gpus:0;mem:1024;disk:1024;ports:[31000-32000]" --revocable_cpu_low_priority="true"
--runtime_dir="/tmp/Endpoint_SlaveEndpointTest_UnauthorizedRequest_2_1pUAwi" --sandbox_directory="/mnt/mesos/sandbox"
--strict="true" --switch_user="true" --systemd_enable_support="true" --systemd_runtime_directory="/run/systemd/system"
--version="false" --work_dir="/tmp/Endpoint_SlaveEndpointTest_UnauthorizedRequest_2_TwI0qB"
I0721 19:57:43.260026  5044 credentials.hpp:86] Loading credential for authentication from
'/tmp/Endpoint_SlaveEndpointTest_UnauthorizedRequest_2_1pUAwi/credential'
I0721 19:57:43.260455  5044 slave.cpp:283] Agent using credential for: test-principal
I0721 19:57:43.260489  5044 credentials.hpp:37] Loading credentials for authentication from
'/tmp/Endpoint_SlaveEndpointTest_UnauthorizedRequest_2_1pUAwi/http_credentials'
I0721 19:57:43.261011  5044 http.cpp:993] Creating default 'basic' HTTP authenticator for
realm 'mesos-agent-readonly'
I0721 19:57:43.261348  5044 http.cpp:993] Creating default 'basic' HTTP authenticator for
realm 'mesos-agent-readwrite'
I0721 19:57:43.263587  5044 slave.cpp:565] Agent resources: [{"name":"cpus","scalar":{"value":2.0},"type":"SCALAR"},{"name":"mem","scalar":{"value":1024.0},"type":"SCALAR"},{"name":"disk","scalar":{"value":1024.0},"type":"SCALAR"},{"name":"ports","ranges":{"range":[{"begin":31000,"end":32000}]},"type":"RANGES"}]
I0721 19:57:43.264040  5044 slave.cpp:573] Agent attributes: [  ]
I0721 19:57:43.264062  5044 slave.cpp:582] Agent hostname: 097ade6e6ad2
I0721 19:57:43.264422  5048 status_update_manager.cpp:177] Pausing sending status updates
I0721 19:57:43.266528  5047 state.cpp:64] Recovering state from '/tmp/Endpoint_SlaveEndpointTest_UnauthorizedRequest_2_TwI0qB/meta'
I0721 19:57:43.266996  5042 status_update_manager.cpp:203] Recovering status update manager
I0721 19:57:43.267518  5046 containerizer.cpp:582] Recovering containerizer
I0721 19:57:43.269654  5043 provisioner.cpp:416] Provisioner recovery complete
I0721 19:57:43.270269  5044 slave.cpp:6207] Finished recovery
I0721 19:57:43.271008  5044 slave.cpp:6389] Querying resource estimator for oversubscribable
resources
I0721 19:57:43.271502  5043 slave.cpp:6403] Received oversubscribable resources {} from the
resource estimator
I0721 19:57:43.275811  5043 process.cpp:3837] Handling HTTP event for process 'slave(795)'
with path: '/slave(795)/containers'
I0721 19:57:43.277927  5047 http.cpp:1133] HTTP GET for /slave(795)/containers from 172.17.0.3:57858
I0721 19:57:43.278055  5047 http.cpp:957] Authorizing principal 'test-principal' to GET the
'/containers' endpoint
I0721 19:57:43.281070  5048 slave.cpp:843] Agent terminating
[       OK ] Endpoint/SlaveEndpointTest.UnauthorizedRequest/2 (43 ms)
[ RUN      ] Endpoint/SlaveEndpointTest.NoAuthorizer/0
I0721 19:57:43.297169  5022 containerizer.cpp:230] Using isolation: posix/cpu,posix/mem,filesystem/posix,network/cni,environment_secret
W0721 19:57:43.297950  5022 backend.cpp:76] Failed to create 'overlay' backend: OverlayBackend
requires root privileges
W0721 19:57:43.298116  5022 backend.cpp:76] Failed to create 'bind' backend: BindBackend requires
root privileges
I0721 19:57:43.298157  5022 provisioner.cpp:255] Using default backend 'copy'
I0721 19:57:43.300478  5022 cluster.cpp:448] Creating default 'local' authorizer
I0721 19:57:43.303164  5042 slave.cpp:250] Mesos agent started on (796)@172.17.0.3:39115
I0721 19:57:43.303203  5042 slave.cpp:251] Flags at startup: --acls="" --appc_simple_discovery_uri_prefix="http://"
--appc_store_dir="/tmp/Endpoint_SlaveEndpointTest_NoAuthorizer_0_tMi8g5/store/appc" --authenticate_http_readonly="true"
--authenticate_http_readwrite="true" --authenticatee="crammd5" --authentication_backoff_factor="1secs"
--authorizer="local" --cgroups_cpu_enable_pids_and_tids_count="false" --cgroups_enable_cfs="false"
--cgroups_hierarchy="/sys/fs/cgroup" --cgroups_limit_swap="false" --cgroups_root="mesos" --container_disk_watch_interval="15secs"
--containerizers="mesos" --credential="/tmp/Endpoint_SlaveEndpointTest_NoAuthorizer_0_tMi8g5/credential"
--default_role="*" --disk_watch_interval="1mins" --docker="docker" --docker_kill_orphans="true"
--docker_registry="https://registry-1.docker.io" --docker_remove_delay="6hrs" --docker_socket="/var/run/docker.sock"
--docker_stop_timeout="0ns" --docker_store_dir="/tmp/Endpoint_SlaveEndpointTest_NoAuthorizer_0_tMi8g5/store/docker"
--docker_volume_checkpoint_dir="/var/run/mesos/isolators/docker/volume" --enforce_container_disk_quota="false"
--executor_registration_timeout="1mins" --executor_reregistration_timeout="2secs" --executor_shutdown_grace_period="5secs"
--fetcher_cache_dir="/tmp/Endpoint_SlaveEndpointTest_NoAuthorizer_0_tMi8g5/fetch" --fetcher_cache_size="2GB"
--frameworks_home="" --gc_delay="1weeks" --gc_disk_headroom="0.1" --hadoop_home="" --help="false"
--hostname_lookup="true" --http_command_executor="false" --http_credentials="/tmp/Endpoint_SlaveEndpointTest_NoAuthorizer_0_tMi8g5/http_credentials"
--http_heartbeat_interval="30secs" --initialize_driver_logging="true" --isolation="posix/cpu,posix/mem"
--launcher="posix" --launcher_dir="/mesos/mesos-1.4.0/_build/src" --logbufsecs="0" --logging_level="INFO"
--max_completed_executors_per_framework="150" --oversubscribed_resources_interval="15secs"
--perf_duration="10secs" --perf_interval="1mins" --port="5051" --qos_correction_interval_min="0ns"
--quiet="false" --recover="reconnect" --recovery_timeout="15mins" --registration_backoff_factor="10ms"
--resources="cpus:2;gpus:0;mem:1024;disk:1024;ports:[31000-32000]" --revocable_cpu_low_priority="true"
--runtime_dir="/tmp/Endpoint_SlaveEndpointTest_NoAuthorizer_0_tMi8g5" --sandbox_directory="/mnt/mesos/sandbox"
--strict="true" --switch_user="true" --systemd_enable_support="true" --systemd_runtime_directory="/run/systemd/system"
--version="false" --work_dir="/tmp/Endpoint_SlaveEndpointTest_NoAuthorizer_0_hfdv4n"
I0721 19:57:43.304036  5042 credentials.hpp:86] Loading credential for authentication from
'/tmp/Endpoint_SlaveEndpointTest_NoAuthorizer_0_tMi8g5/credential'
I0721 19:57:43.304469  5042 slave.cpp:283] Agent using credential for: test-principal
I0721 19:57:43.304499  5042 credentials.hpp:37] Loading credentials for authentication from
'/tmp/Endpoint_SlaveEndpointTest_NoAuthorizer_0_tMi8g5/http_credentials'
I0721 19:57:43.304953  5042 http.cpp:993] Creating default 'basic' HTTP authenticator for
realm 'mesos-agent-readonly'
I0721 19:57:43.305263  5042 http.cpp:993] Creating default 'basic' HTTP authenticator for
realm 'mesos-agent-readwrite'
I0721 19:57:43.307548  5042 slave.cpp:565] Agent resources: [{"name":"cpus","scalar":{"value":2.0},"type":"SCALAR"},{"name":"mem","scalar":{"value":1024.0},"type":"SCALAR"},{"name":"disk","scalar":{"value":1024.0},"type":"SCALAR"},{"name":"ports","ranges":{"range":[{"begin":31000,"end":32000}]},"type":"RANGES"}]
I0721 19:57:43.307977  5042 slave.cpp:573] Agent attributes: [  ]
I0721 19:57:43.307999  5042 slave.cpp:582] Agent hostname: 097ade6e6ad2
I0721 19:57:43.308254  5047 status_update_manager.cpp:177] Pausing sending status updates
I0721 19:57:43.310436  5048 state.cpp:64] Recovering state from '/tmp/Endpoint_SlaveEndpointTest_NoAuthorizer_0_hfdv4n/meta'
I0721 19:57:43.310993  5043 status_update_manager.cpp:203] Recovering status update manager
I0721 19:57:43.311326  5046 containerizer.cpp:582] Recovering containerizer
I0721 19:57:43.313552  5045 provisioner.cpp:416] Provisioner recovery complete
I0721 19:57:43.314174  5047 slave.cpp:6207] Finished recovery
I0721 19:57:43.314867  5047 slave.cpp:6389] Querying resource estimator for oversubscribable
resources
I0721 19:57:43.315289  5048 slave.cpp:6403] Received oversubscribable resources {} from the
resource estimator
I0721 19:57:43.319571  5043 process.cpp:3837] Handling HTTP event for process 'slave(796)'
with path: '/slave(796)/monitor/statistics'
I0721 19:57:43.321681  5046 http.cpp:1133] HTTP GET for /slave(796)/monitor/statistics from
172.17.0.3:57860
I0721 19:57:43.321808  5046 http.cpp:957] Authorizing principal 'test-principal' to GET the
'/monitor/statistics' endpoint
I0721 19:57:43.326632  5044 slave.cpp:843] Agent terminating
[       OK ] Endpoint/SlaveEndpointTest.NoAuthorizer/0 (44 ms)
[ RUN      ] Endpoint/SlaveEndpointTest.NoAuthorizer/1
I0721 19:57:43.342700  5022 containerizer.cpp:230] Using isolation: posix/cpu,posix/mem,filesystem/posix,network/cni,environment_secret
W0721 19:57:43.343472  5022 backend.cpp:76] Failed to create 'overlay' backend: OverlayBackend
requires root privileges
W0721 19:57:43.343633  5022 backend.cpp:76] Failed to create 'bind' backend: BindBackend requires
root privileges
I0721 19:57:43.343678  5022 provisioner.cpp:255] Using default backend 'copy'
I0721 19:57:43.346048  5022 cluster.cpp:448] Creating default 'local' authorizer
I0721 19:57:43.348773  5042 slave.cpp:250] Mesos agent started on (797)@172.17.0.3:39115
I0721 19:57:43.348811  5042 slave.cpp:251] Flags at startup: --acls="" --appc_simple_discovery_uri_prefix="http://"
--appc_store_dir="/tmp/Endpoint_SlaveEndpointTest_NoAuthorizer_1_NkjMuS/store/appc" --authenticate_http_readonly="true"
--authenticate_http_readwrite="true" --authenticatee="crammd5" --authentication_backoff_factor="1secs"
--authorizer="local" --cgroups_cpu_enable_pids_and_tids_count="false" --cgroups_enable_cfs="false"
--cgroups_hierarchy="/sys/fs/cgroup" --cgroups_limit_swap="false" --cgroups_root="mesos" --container_disk_watch_interval="15secs"
--containerizers="mesos" --credential="/tmp/Endpoint_SlaveEndpointTest_NoAuthorizer_1_NkjMuS/credential"
--default_role="*" --disk_watch_interval="1mins" --docker="docker" --docker_kill_orphans="true"
--docker_registry="https://registry-1.docker.io" --docker_remove_delay="6hrs" --docker_socket="/var/run/docker.sock"
--docker_stop_timeout="0ns" --docker_store_dir="/tmp/Endpoint_SlaveEndpointTest_NoAuthorizer_1_NkjMuS/store/docker"
--docker_volume_checkpoint_dir="/var/run/mesos/isolators/docker/volume" --enforce_container_disk_quota="false"
--executor_registration_timeout="1mins" --executor_reregistration_timeout="2secs" --executor_shutdown_grace_period="5secs"
--fetcher_cache_dir="/tmp/Endpoint_SlaveEndpointTest_NoAuthorizer_1_NkjMuS/fetch" --fetcher_cache_size="2GB"
--frameworks_home="" --gc_delay="1weeks" --gc_disk_headroom="0.1" --hadoop_home="" --help="false"
--hostname_lookup="true" --http_command_executor="false" --http_credentials="/tmp/Endpoint_SlaveEndpointTest_NoAuthorizer_1_NkjMuS/http_credentials"
--http_heartbeat_interval="30secs" --initialize_driver_logging="true" --isolation="posix/cpu,posix/mem"
--launcher="posix" --launcher_dir="/mesos/mesos-1.4.0/_build/src" --logbufsecs="0" --logging_level="INFO"
--max_completed_executors_per_framework="150" --oversubscribed_resources_interval="15secs"
--perf_duration="10secs" --perf_interval="1mins" --port="5051" --qos_correction_interval_min="0ns"
--quiet="false" --recover="reconnect" --recovery_timeout="15mins" --registration_backoff_factor="10ms"
--resources="cpus:2;gpus:0;mem:1024;disk:1024;ports:[31000-32000]" --revocable_cpu_low_priority="true"
--runtime_dir="/tmp/Endpoint_SlaveEndpointTest_NoAuthorizer_1_NkjMuS" --sandbox_directory="/mnt/mesos/sandbox"
--strict="true" --switch_user="true" --systemd_enable_support="true" --systemd_runtime_directory="/run/systemd/system"
--version="false" --work_dir="/tmp/Endpoint_SlaveEndpointTest_NoAuthorizer_1_1mrOab"
I0721 19:57:43.349526  5042 credentials.hpp:86] Loading credential for authentication from
'/tmp/Endpoint_SlaveEndpointTest_NoAuthorizer_1_NkjMuS/credential'
I0721 19:57:43.349774  5042 slave.cpp:283] Agent using credential for: test-principal
I0721 19:57:43.349797  5042 credentials.hpp:37] Loading credentials for authentication from
'/tmp/Endpoint_SlaveEndpointTest_NoAuthorizer_1_NkjMuS/http_credentials'
I0721 19:57:43.350142  5042 http.cpp:993] Creating default 'basic' HTTP authenticator for
realm 'mesos-agent-readonly'
I0721 19:57:43.350364  5042 http.cpp:993] Creating default 'basic' HTTP authenticator for
realm 'mesos-agent-readwrite'
I0721 19:57:43.352491  5042 slave.cpp:565] Agent resources: [{"name":"cpus","scalar":{"value":2.0},"type":"SCALAR"},{"name":"mem","scalar":{"value":1024.0},"type":"SCALAR"},{"name":"disk","scalar":{"value":1024.0},"type":"SCALAR"},{"name":"ports","ranges":{"range":[{"begin":31000,"end":32000}]},"type":"RANGES"}]
I0721 19:57:43.352916  5042 slave.cpp:573] Agent attributes: [  ]
I0721 19:57:43.352936  5042 slave.cpp:582] Agent hostname: 097ade6e6ad2
I0721 19:57:43.353164  5045 status_update_manager.cpp:177] Pausing sending status updates
I0721 19:57:43.355089  5047 state.cpp:64] Recovering state from '/tmp/Endpoint_SlaveEndpointTest_NoAuthorizer_1_1mrOab/meta'
I0721 19:57:43.355767  5045 status_update_manager.cpp:203] Recovering status update manager
I0721 19:57:43.356282  5044 containerizer.cpp:582] Recovering containerizer
I0721 19:57:43.358609  5048 provisioner.cpp:416] Provisioner recovery complete
I0721 19:57:43.359307  5042 slave.cpp:6207] Finished recovery
I0721 19:57:43.360002  5042 slave.cpp:6389] Querying resource estimator for oversubscribable
resources
I0721 19:57:43.360474  5043 slave.cpp:6403] Received oversubscribable resources {} from the
resource estimator
I0721 19:57:43.364679  5043 process.cpp:3837] Handling HTTP event for process 'slave(797)'
with path: '/slave(797)/monitor/statistics.json'
I0721 19:57:43.366561  5041 http.cpp:1133] HTTP GET for /slave(797)/monitor/statistics.json
from 172.17.0.3:57862
I0721 19:57:43.366693  5041 http.cpp:957] Authorizing principal 'test-principal' to GET the
'/monitor/statistics.json' endpoint
I0721 19:57:43.372094  5022 slave.cpp:843] Agent terminating
[       OK ] Endpoint/SlaveEndpointTest.NoAuthorizer/1 (45 ms)
[ RUN      ] Endpoint/SlaveEndpointTest.NoAuthorizer/2
I0721 19:57:43.387784  5022 containerizer.cpp:230] Using isolation: posix/cpu,posix/mem,filesystem/posix,network/cni,environment_secret
W0721 19:57:43.388553  5022 backend.cpp:76] Failed to create 'overlay' backend: OverlayBackend
requires root privileges
W0721 19:57:43.388717  5022 backend.cpp:76] Failed to create 'bind' backend: BindBackend requires
root privileges
I0721 19:57:43.388758  5022 provisioner.cpp:255] Using default backend 'copy'
I0721 19:57:43.391547  5022 cluster.cpp:448] Creating default 'local' authorizer
I0721 19:57:43.394251  5047 slave.cpp:250] Mesos agent started on (798)@172.17.0.3:39115
I0721 19:57:43.394356  5047 slave.cpp:251] Flags at startup: --acls="" --appc_simple_discovery_uri_prefix="http://"
--appc_store_dir="/tmp/Endpoint_SlaveEndpointTest_NoAuthorizer_2_v11HbG/store/appc" --authenticate_http_readonly="true"
--authenticate_http_readwrite="true" --authenticatee="crammd5" --authentication_backoff_factor="1secs"
--authorizer="local" --cgroups_cpu_enable_pids_and_tids_count="false" --cgroups_enable_cfs="false"
--cgroups_hierarchy="/sys/fs/cgroup" --cgroups_limit_swap="false" --cgroups_root="mesos" --container_disk_watch_interval="15secs"
--containerizers="mesos" --credential="/tmp/Endpoint_SlaveEndpointTest_NoAuthorizer_2_v11HbG/credential"
--default_role="*" --disk_watch_interval="1mins" --docker="docker" --docker_kill_orphans="true"
--docker_registry="https://registry-1.docker.io" --docker_remove_delay="6hrs" --docker_socket="/var/run/docker.sock"
--docker_stop_timeout="0ns" --docker_store_dir="/tmp/Endpoint_SlaveEndpointTest_NoAuthorizer_2_v11HbG/store/docker"
--docker_volume_checkpoint_dir="/var/run/mesos/isolators/docker/volume" --enforce_container_disk_quota="false"
--executor_registration_timeout="1mins" --executor_reregistration_timeout="2secs" --executor_shutdown_grace_period="5secs"
--fetcher_cache_dir="/tmp/Endpoint_SlaveEndpointTest_NoAuthorizer_2_v11HbG/fetch" --fetcher_cache_size="2GB"
--frameworks_home="" --gc_delay="1weeks" --gc_disk_headroom="0.1" --hadoop_home="" --help="false"
--hostname_lookup="true" --http_command_executor="false" --http_credentials="/tmp/Endpoint_SlaveEndpointTest_NoAuthorizer_2_v11HbG/http_credentials"
--http_heartbeat_interval="30secs" --initialize_driver_logging="true" --isolation="posix/cpu,posix/mem"
--launcher="posix" --launcher_dir="/mesos/mesos-1.4.0/_build/src" --logbufsecs="0" --logging_level="INFO"
--max_completed_executors_per_framework="150" --oversubscribed_resources_interval="15secs"
--perf_duration="10secs" --perf_interval="1mins" --port="5051" --qos_correction_interval_min="0ns"
--quiet="false" --recover="reconnect" --recovery_timeout="15mins" --registration_backoff_factor="10ms"
--resources="cpus:2;gpus:0;mem:1024;disk:1024;ports:[31000-32000]" --revocable_cpu_low_priority="true"
--runtime_dir="/tmp/Endpoint_SlaveEndpointTest_NoAuthorizer_2_v11HbG" --sandbox_directory="/mnt/mesos/sandbox"
--strict="true" --switch_user="true" --systemd_enable_support="true" --systemd_runtime_directory="/run/systemd/system"
--version="false" --work_dir="/tmp/Endpoint_SlaveEndpointTest_NoAuthorizer_2_pB4pKY"
I0721 19:57:43.395175  5047 credentials.hpp:86] Loading credential for authentication from
'/tmp/Endpoint_SlaveEndpointTest_NoAuthorizer_2_v11HbG/credential'
I0721 19:57:43.395787  5047 slave.cpp:283] Agent using credential for: test-principal
I0721 19:57:43.395828  5047 credentials.hpp:37] Loading credentials for authentication from
'/tmp/Endpoint_SlaveEndpointTest_NoAuthorizer_2_v11HbG/http_credentials'
I0721 19:57:43.396384  5047 http.cpp:993] Creating default 'basic' HTTP authenticator for
realm 'mesos-agent-readonly'
I0721 19:57:43.396780  5047 http.cpp:993] Creating default 'basic' HTTP authenticator for
realm 'mesos-agent-readwrite'
I0721 19:57:43.399132  5047 slave.cpp:565] Agent resources: [{"name":"cpus","scalar":{"value":2.0},"type":"SCALAR"},{"name":"mem","scalar":{"value":1024.0},"type":"SCALAR"},{"name":"disk","scalar":{"value":1024.0},"type":"SCALAR"},{"name":"ports","ranges":{"range":[{"begin":31000,"end":32000}]},"type":"RANGES"}]
I0721 19:57:43.399632  5047 slave.cpp:573] Agent attributes: [  ]
I0721 19:57:43.399698  5047 slave.cpp:582] Agent hostname: 097ade6e6ad2
I0721 19:57:43.400254  5041 status_update_manager.cpp:177] Pausing sending status updates
I0721 19:57:43.402245  5046 state.cpp:64] Recovering state from '/tmp/Endpoint_SlaveEndpointTest_NoAuthorizer_2_pB4pKY/meta'
I0721 19:57:43.402824  5041 status_update_manager.cpp:203] Recovering status update manager
I0721 19:57:43.403126  5047 containerizer.cpp:582] Recovering containerizer
I0721 19:57:43.405298  5045 provisioner.cpp:416] Provisioner recovery complete
I0721 19:57:43.406086  5043 slave.cpp:6207] Finished recovery
I0721 19:57:43.406777  5043 slave.cpp:6389] Querying resource estimator for oversubscribable
resources
I0721 19:57:43.407233  5047 slave.cpp:6403] Received oversubscribable resources {} from the
resource estimator
I0721 19:57:43.411509  5047 process.cpp:3837] Handling HTTP event for process 'slave(798)'
with path: '/slave(798)/containers'
I0721 19:57:43.413662  5044 http.cpp:1133] HTTP GET for /slave(798)/containers from 172.17.0.3:57864
I0721 19:57:43.413789  5044 http.cpp:957] Authorizing principal 'test-principal' to GET the
'/containers' endpoint
I0721 19:57:43.419833  5022 slave.cpp:843] Agent terminating
[       OK ] Endpoint/SlaveEndpointTest.NoAuthorizer/2 (47 ms)
[----------] 9 tests from Endpoint/SlaveEndpointTest (411 ms total)

[----------] Global test environment tear-down
[==========] 1637 tests from 179 test cases ran. (711835 ms total)
[  PASSED  ] 1633 tests.
[  FAILED  ] 4 tests, listed below:
[  FAILED  ] DefaultExecutorCheckTest.CommandCheckDeliveredAndReconciled
[  FAILED  ] DefaultExecutorCheckTest.CommandCheckStatusChange
[  FAILED  ] DefaultExecutorCheckTest.CommandCheckSeesParentsEnv
[  FAILED  ] DefaultExecutorCheckTest.CommandCheckSharesWorkDirWithTask

 4 FAILED TESTS
  YOU HAVE 20 DISABLED TESTS

I0721 19:57:43.563591  5049 process.cpp:1006] Failed to accept socket: future discarded
make[4]: *** [check-local] Error 1
make[4]: Leaving directory `/mesos/mesos-1.4.0/_build/src'
make[3]: *** [check-am] Error 2
make[3]: Leaving directory `/mesos/mesos-1.4.0/_build/src'
make[2]: *** [check] Error 2
make[2]: Leaving directory `/mesos/mesos-1.4.0/_build/src'
make[1]: *** [check-recursive] Error 1
make[1]: Leaving directory `/mesos/mesos-1.4.0/_build'
make: *** [distcheck] Error 1
+ docker rmi mesos-1500661186-6887
Untagged: mesos-1500661186-6887:latest
Deleted: sha256:5dbd4be9377a2dac5925d313c806fe620ec1b169be20a0837ef5beedc085a3e3
Deleted: sha256:4feb7c1d2e90539fa76994290c51d1851dc67376b93c79fd0486aad411ee3df8
Deleted: sha256:10e956ab0e9a73d5331d2ff3b1645c7d3122eb37d2147c9cecd22a982ddffd0b
Deleted: sha256:33053ab8bf49e1a5d920879f669f4750778b39e0c0f96072dbdb6fb97443bbd7
Deleted: sha256:9a2a2d507719a122512dc197b00af4f4a5863f275a3b38199fd23de7d78b4e4b
Deleted: sha256:0e81af6904e0536dbbfb6cdd42d8e9592939d99494e9ebd00db3fff017e0e0ce
Deleted: sha256:15a7e906a972352bd2852076b563c6d441316bf06a6d30d2319d6914d8e338b9
Deleted: sha256:5d588308956f246abeb221f7530bd52dafafbdf9f3d0ac29546f6ebed34b339c
Deleted: sha256:2bcc71afce3699e7762afd95a5b2ac7d8712db01c53fc8ac88c37fafec45c827
Deleted: sha256:a2cb79c201a1abf09d5124bad980770c130e9109f854353051fd0d32c33741cd
Deleted: sha256:a39e938e83c5ae00d2a442d7dd1fe2f45709c0de5d73f6876093928bd3c03d65
Deleted: sha256:4c1eb6a06970ea7a4ef35898466a378db5d07d2546220e6864591a64086a19f3
Deleted: sha256:d449dab5bb5fefe43fdc517a850b12249c6dc00852db6ba575e4502b9e89a838
Deleted: sha256:4047421940c548c31b9c2c8c83b0a0004bfe63d0ac227def4f4fe8e409ce8fa5
Deleted: sha256:9363908ef28278646899ee821da65212879895c727e36a0bd3843e7390915201
Deleted: sha256:925824a8f7ff74c8931cd0b569759f2593aad0ee056b02e3eb31b9c04154cb7d
Deleted: sha256:12cfee823d3d8f8b2bc4ac6343a43ab937afec948ee1324761cf6fd644da8fbc
Deleted: sha256:4e5af03ee8a1ca99b2ef92d1afabf9302ac976acb14e199444d2eedc2a295a9e
Deleted: sha256:aa802c346cef7e5c564723883813713486bfc4e4c22bc8e29ab75a45af97f243
Deleted: sha256:c14be0f4201a64f1c8e42ccc16071e0f607362c62c5609e8ae26753220686c10
Deleted: sha256:370f3d0164b734bb987a0b7c3f2f669478f3b31b5c34841ea6da396612b1e86e
Deleted: sha256:863118e25dd1a91bbcf342d39a6947fbb49c72dbe99b051a4c67ffcdbfa57e86
Deleted: sha256:8178bd6c6c457c63f87169098a02d2383bacb264e889c42ca8926764ba276cb8
Deleted: sha256:852270ff518f12d0471189a83ff2c7a7c8456dc7cf5e067581f7c5fc18ce35c2
Build step 'Execute shell' marked build as failure

Mime
View raw message