mesos-builds mailing list archives

Site index · List index
Message view « Date » · « Thread »
Top « Date » · « Thread »
From Apache Jenkins Server <jenk...@builds.apache.org>
Subject Build failed in Jenkins: Mesos-Buildbot » autotools,gcc,--verbose,GLOG_v=1 MESOS_VERBOSE=1,centos:7,(ubuntu)&&(!ubuntu-us1)&&(!ubuntu-eu2) #3916
Date Sat, 15 Jul 2017 04:42:43 GMT
See <https://builds.apache.org/job/Mesos-Buildbot/BUILDTOOL=autotools,COMPILER=gcc,CONFIGURATION=--verbose,ENVIRONMENT=GLOG_v=1%20MESOS_VERBOSE=1,OS=centos%3A7,label_exp=(ubuntu)&&(!ubuntu-us1)&&(!ubuntu-eu2)/3916/display/redirect?page=changes>

Changes:

[yujie.jay] Added MESOS-7777 to 1.3.1 CHANGELOG.

[yujie.jay] Added MESOS-7777 to 1.2.2 CHANGELOG.

[yujie.jay] Added MESOS-7777 to 1.1.3 CHANGELOG.

[bmahler] Added a method in the agent exposing a framework's allocated resources.

[josephwu] Fixed a hard-coded forward slash in agent path logic.

------------------------------------------
[...truncated 29.81 MB...]
I0715 04:42:36.128016  6311 provisioner.cpp:255] Using default backend 'copy'
I0715 04:42:36.132226  6331 slave.cpp:250] Mesos agent started on (786)@172.17.0.3:40774
I0715 04:42:36.132246  6331 slave.cpp:251] Flags at startup: --acls="" --appc_simple_discovery_uri_prefix="http://"
--appc_store_dir="/tmp/Endpoint_SlaveEndpointTest_AuthorizedRequest_2_z0vwaE/store/appc" --authenticate_http_readonly="true"
--authenticate_http_readwrite="true" --authenticatee="crammd5" --authentication_backoff_factor="1secs"
--authorizer="local" --cgroups_cpu_enable_pids_and_tids_count="false" --cgroups_enable_cfs="false"
--cgroups_hierarchy="/sys/fs/cgroup" --cgroups_limit_swap="false" --cgroups_root="mesos" --container_disk_watch_interval="15secs"
--containerizers="mesos" --credential="/tmp/Endpoint_SlaveEndpointTest_AuthorizedRequest_2_z0vwaE/credential"
--default_role="*" --disk_watch_interval="1mins" --docker="docker" --docker_kill_orphans="true"
--docker_registry="https://registry-1.docker.io" --docker_remove_delay="6hrs" --docker_socket="/var/run/docker.sock"
--docker_stop_timeout="0ns" --docker_store_dir="/tmp/Endpoint_SlaveEndpointTest_AuthorizedRequest_2_z0vwaE/store/docker"
--docker_volume_checkpoint_dir="/var/run/mesos/isolators/docker/volume" --enforce_container_disk_quota="false"
--executor_registration_timeout="1mins" --executor_reregistration_timeout="2secs" --executor_shutdown_grace_period="5secs"
--fetcher_cache_dir="/tmp/Endpoint_SlaveEndpointTest_AuthorizedRequest_2_z0vwaE/fetch" --fetcher_cache_size="2GB"
--frameworks_home="" --gc_delay="1weeks" --gc_disk_headroom="0.1" --hadoop_home="" --help="false"
--hostname_lookup="true" --http_command_executor="false" --http_credentials="/tmp/Endpoint_SlaveEndpointTest_AuthorizedRequest_2_z0vwaE/http_credentials"
--http_heartbeat_interval="30secs" --initialize_driver_logging="true" --isolation="posix/cpu,posix/mem"
--launcher="posix" --launcher_dir="/mesos/mesos-1.4.0/_build/src" --logbufsecs="0" --logging_level="INFO"
--max_completed_executors_per_framework="150" --oversubscribed_resources_interval="15secs"
--perf_duration="10secs" --perf_interval="1mins" --port="5051" --qos_correction_interval_min="0ns"
--quiet="false" --recover="reconnect" --recovery_timeout="15mins" --registration_backoff_factor="10ms"
--resources="cpus:2;gpus:0;mem:1024;disk:1024;ports:[31000-32000]" --revocable_cpu_low_priority="true"
--runtime_dir="/tmp/Endpoint_SlaveEndpointTest_AuthorizedRequest_2_z0vwaE" --sandbox_directory="/mnt/mesos/sandbox"
--strict="true" --switch_user="true" --systemd_enable_support="true" --systemd_runtime_directory="/run/systemd/system"
--version="false" --work_dir="/tmp/Endpoint_SlaveEndpointTest_AuthorizedRequest_2_U85slz"
I0715 04:42:36.132707  6331 credentials.hpp:86] Loading credential for authentication from
'/tmp/Endpoint_SlaveEndpointTest_AuthorizedRequest_2_z0vwaE/credential'
I0715 04:42:36.132885  6331 slave.cpp:283] Agent using credential for: test-principal
I0715 04:42:36.132905  6331 credentials.hpp:37] Loading credentials for authentication from
'/tmp/Endpoint_SlaveEndpointTest_AuthorizedRequest_2_z0vwaE/http_credentials'
I0715 04:42:36.133148  6331 http.cpp:993] Creating default 'basic' HTTP authenticator for
realm 'mesos-agent-readonly'
I0715 04:42:36.133316  6331 http.cpp:993] Creating default 'basic' HTTP authenticator for
realm 'mesos-agent-readwrite'
I0715 04:42:36.134713  6331 slave.cpp:565] Agent resources: [{"name":"cpus","scalar":{"value":2.0},"type":"SCALAR"},{"name":"mem","scalar":{"value":1024.0},"type":"SCALAR"},{"name":"disk","scalar":{"value":1024.0},"type":"SCALAR"},{"name":"ports","ranges":{"range":[{"begin":31000,"end":32000}]},"type":"RANGES"}]
I0715 04:42:36.134954  6331 slave.cpp:573] Agent attributes: [  ]
I0715 04:42:36.134968  6331 slave.cpp:582] Agent hostname: 8006c12083c2
I0715 04:42:36.135097  6351 status_update_manager.cpp:177] Pausing sending status updates
I0715 04:42:36.136605  6336 state.cpp:64] Recovering state from '/tmp/Endpoint_SlaveEndpointTest_AuthorizedRequest_2_U85slz/meta'
I0715 04:42:36.136885  6352 status_update_manager.cpp:203] Recovering status update manager
I0715 04:42:36.137266  6335 containerizer.cpp:582] Recovering containerizer
I0715 04:42:36.139081  6340 provisioner.cpp:416] Provisioner recovery complete
I0715 04:42:36.139485  6337 slave.cpp:6229] Finished recovery
I0715 04:42:36.139974  6337 slave.cpp:6411] Querying resource estimator for oversubscribable
resources
I0715 04:42:36.140282  6341 slave.cpp:6425] Received oversubscribable resources {} from the
resource estimator
I0715 04:42:36.142313  6348 process.cpp:3820] Handling HTTP event for process 'slave(786)'
with path: '/slave(786)/containers'
I0715 04:42:36.143668  6336 http.cpp:1133] HTTP GET for /slave(786)/containers from 172.17.0.3:46756
I0715 04:42:36.143743  6336 http.cpp:957] Authorizing principal 'test-principal' to GET the
'/containers' endpoint
I0715 04:42:36.147598  6348 slave.cpp:843] Agent terminating
[       OK ] Endpoint/SlaveEndpointTest.AuthorizedRequest/2 (31 ms)
[ RUN      ] Endpoint/SlaveEndpointTest.UnauthorizedRequest/0
I0715 04:42:36.158924  6311 containerizer.cpp:230] Using isolation: posix/cpu,posix/mem,filesystem/posix,network/cni,environment_secret
W0715 04:42:36.159420  6311 backend.cpp:76] Failed to create 'aufs' backend: AufsBackend requires
root privileges
W0715 04:42:36.159517  6311 backend.cpp:76] Failed to create 'bind' backend: BindBackend requires
root privileges
I0715 04:42:36.159548  6311 provisioner.cpp:255] Using default backend 'copy'
I0715 04:42:36.162922  6352 slave.cpp:250] Mesos agent started on (787)@172.17.0.3:40774
I0715 04:42:36.162943  6352 slave.cpp:251] Flags at startup: --acls="" --appc_simple_discovery_uri_prefix="http://"
--appc_store_dir="/tmp/Endpoint_SlaveEndpointTest_UnauthorizedRequest_0_PcLMIX/store/appc"
--authenticate_http_readonly="true" --authenticate_http_readwrite="true" --authenticatee="crammd5"
--authentication_backoff_factor="1secs" --authorizer="local" --cgroups_cpu_enable_pids_and_tids_count="false"
--cgroups_enable_cfs="false" --cgroups_hierarchy="/sys/fs/cgroup" --cgroups_limit_swap="false"
--cgroups_root="mesos" --container_disk_watch_interval="15secs" --containerizers="mesos" --credential="/tmp/Endpoint_SlaveEndpointTest_UnauthorizedRequest_0_PcLMIX/credential"
--default_role="*" --disk_watch_interval="1mins" --docker="docker" --docker_kill_orphans="true"
--docker_registry="https://registry-1.docker.io" --docker_remove_delay="6hrs" --docker_socket="/var/run/docker.sock"
--docker_stop_timeout="0ns" --docker_store_dir="/tmp/Endpoint_SlaveEndpointTest_UnauthorizedRequest_0_PcLMIX/store/docker"
--docker_volume_checkpoint_dir="/var/run/mesos/isolators/docker/volume" --enforce_container_disk_quota="false"
--executor_registration_timeout="1mins" --executor_reregistration_timeout="2secs" --executor_shutdown_grace_period="5secs"
--fetcher_cache_dir="/tmp/Endpoint_SlaveEndpointTest_UnauthorizedRequest_0_PcLMIX/fetch" --fetcher_cache_size="2GB"
--frameworks_home="" --gc_delay="1weeks" --gc_disk_headroom="0.1" --hadoop_home="" --help="false"
--hostname_lookup="true" --http_command_executor="false" --http_credentials="/tmp/Endpoint_SlaveEndpointTest_UnauthorizedRequest_0_PcLMIX/http_credentials"
--http_heartbeat_interval="30secs" --initialize_driver_logging="true" --isolation="posix/cpu,posix/mem"
--launcher="posix" --launcher_dir="/mesos/mesos-1.4.0/_build/src" --logbufsecs="0" --logging_level="INFO"
--max_completed_executors_per_framework="150" --oversubscribed_resources_interval="15secs"
--perf_duration="10secs" --perf_interval="1mins" --port="5051" --qos_correction_interval_min="0ns"
--quiet="false" --recover="reconnect" --recovery_timeout="15mins" --registration_backoff_factor="10ms"
--resources="cpus:2;gpus:0;mem:1024;disk:1024;ports:[31000-32000]" --revocable_cpu_low_priority="true"
--runtime_dir="/tmp/Endpoint_SlaveEndpointTest_UnauthorizedRequest_0_PcLMIX" --sandbox_directory="/mnt/mesos/sandbox"
--strict="true" --switch_user="true" --systemd_enable_support="true" --systemd_runtime_directory="/run/systemd/system"
--version="false" --work_dir="/tmp/Endpoint_SlaveEndpointTest_UnauthorizedRequest_0_Ek11OS"
I0715 04:42:36.163305  6352 credentials.hpp:86] Loading credential for authentication from
'/tmp/Endpoint_SlaveEndpointTest_UnauthorizedRequest_0_PcLMIX/credential'
I0715 04:42:36.163458  6352 slave.cpp:283] Agent using credential for: test-principal
I0715 04:42:36.163480  6352 credentials.hpp:37] Loading credentials for authentication from
'/tmp/Endpoint_SlaveEndpointTest_UnauthorizedRequest_0_PcLMIX/http_credentials'
I0715 04:42:36.163743  6352 http.cpp:993] Creating default 'basic' HTTP authenticator for
realm 'mesos-agent-readonly'
I0715 04:42:36.163982  6352 http.cpp:993] Creating default 'basic' HTTP authenticator for
realm 'mesos-agent-readwrite'
I0715 04:42:36.165458  6352 slave.cpp:565] Agent resources: [{"name":"cpus","scalar":{"value":2.0},"type":"SCALAR"},{"name":"mem","scalar":{"value":1024.0},"type":"SCALAR"},{"name":"disk","scalar":{"value":1024.0},"type":"SCALAR"},{"name":"ports","ranges":{"range":[{"begin":31000,"end":32000}]},"type":"RANGES"}]
I0715 04:42:36.165690  6352 slave.cpp:573] Agent attributes: [  ]
I0715 04:42:36.165704  6352 slave.cpp:582] Agent hostname: 8006c12083c2
I0715 04:42:36.165877  6346 status_update_manager.cpp:177] Pausing sending status updates
I0715 04:42:36.167958  6342 state.cpp:64] Recovering state from '/tmp/Endpoint_SlaveEndpointTest_UnauthorizedRequest_0_Ek11OS/meta'
I0715 04:42:36.168287  6348 status_update_manager.cpp:203] Recovering status update manager
I0715 04:42:36.168558  6342 containerizer.cpp:582] Recovering containerizer
I0715 04:42:36.170043  6339 provisioner.cpp:416] Provisioner recovery complete
I0715 04:42:36.170524  6350 slave.cpp:6229] Finished recovery
I0715 04:42:36.170943  6350 slave.cpp:6411] Querying resource estimator for oversubscribable
resources
I0715 04:42:36.171277  6344 slave.cpp:6425] Received oversubscribable resources {} from the
resource estimator
I0715 04:42:36.173595  6339 process.cpp:3820] Handling HTTP event for process 'slave(787)'
with path: '/slave(787)/monitor/statistics'
I0715 04:42:36.174979  6335 http.cpp:1133] HTTP GET for /slave(787)/monitor/statistics from
172.17.0.3:46758
I0715 04:42:36.175060  6335 http.cpp:957] Authorizing principal 'test-principal' to GET the
'/monitor/statistics' endpoint
I0715 04:42:36.177414  6353 slave.cpp:843] Agent terminating
[       OK ] Endpoint/SlaveEndpointTest.UnauthorizedRequest/0 (29 ms)
[ RUN      ] Endpoint/SlaveEndpointTest.UnauthorizedRequest/1
I0715 04:42:36.189307  6311 containerizer.cpp:230] Using isolation: posix/cpu,posix/mem,filesystem/posix,network/cni,environment_secret
W0715 04:42:36.189815  6311 backend.cpp:76] Failed to create 'aufs' backend: AufsBackend requires
root privileges
W0715 04:42:36.189923  6311 backend.cpp:76] Failed to create 'bind' backend: BindBackend requires
root privileges
I0715 04:42:36.189963  6311 provisioner.cpp:255] Using default backend 'copy'
I0715 04:42:36.193876  6348 slave.cpp:250] Mesos agent started on (788)@172.17.0.3:40774
I0715 04:42:36.193904  6348 slave.cpp:251] Flags at startup: --acls="" --appc_simple_discovery_uri_prefix="http://"
--appc_store_dir="/tmp/Endpoint_SlaveEndpointTest_UnauthorizedRequest_1_3kRbzh/store/appc"
--authenticate_http_readonly="true" --authenticate_http_readwrite="true" --authenticatee="crammd5"
--authentication_backoff_factor="1secs" --authorizer="local" --cgroups_cpu_enable_pids_and_tids_count="false"
--cgroups_enable_cfs="false" --cgroups_hierarchy="/sys/fs/cgroup" --cgroups_limit_swap="false"
--cgroups_root="mesos" --container_disk_watch_interval="15secs" --containerizers="mesos" --credential="/tmp/Endpoint_SlaveEndpointTest_UnauthorizedRequest_1_3kRbzh/credential"
--default_role="*" --disk_watch_interval="1mins" --docker="docker" --docker_kill_orphans="true"
--docker_registry="https://registry-1.docker.io" --docker_remove_delay="6hrs" --docker_socket="/var/run/docker.sock"
--docker_stop_timeout="0ns" --docker_store_dir="/tmp/Endpoint_SlaveEndpointTest_UnauthorizedRequest_1_3kRbzh/store/docker"
--docker_volume_checkpoint_dir="/var/run/mesos/isolators/docker/volume" --enforce_container_disk_quota="false"
--executor_registration_timeout="1mins" --executor_reregistration_timeout="2secs" --executor_shutdown_grace_period="5secs"
--fetcher_cache_dir="/tmp/Endpoint_SlaveEndpointTest_UnauthorizedRequest_1_3kRbzh/fetch" --fetcher_cache_size="2GB"
--frameworks_home="" --gc_delay="1weeks" --gc_disk_headroom="0.1" --hadoop_home="" --help="false"
--hostname_lookup="true" --http_command_executor="false" --http_credentials="/tmp/Endpoint_SlaveEndpointTest_UnauthorizedRequest_1_3kRbzh/http_credentials"
--http_heartbeat_interval="30secs" --initialize_driver_logging="true" --isolation="posix/cpu,posix/mem"
--launcher="posix" --launcher_dir="/mesos/mesos-1.4.0/_build/src" --logbufsecs="0" --logging_level="INFO"
--max_completed_executors_per_framework="150" --oversubscribed_resources_interval="15secs"
--perf_duration="10secs" --perf_interval="1mins" --port="5051" --qos_correction_interval_min="0ns"
--quiet="false" --recover="reconnect" --recovery_timeout="15mins" --registration_backoff_factor="10ms"
--resources="cpus:2;gpus:0;mem:1024;disk:1024;ports:[31000-32000]" --revocable_cpu_low_priority="true"
--runtime_dir="/tmp/Endpoint_SlaveEndpointTest_UnauthorizedRequest_1_3kRbzh" --sandbox_directory="/mnt/mesos/sandbox"
--strict="true" --switch_user="true" --systemd_enable_support="true" --systemd_runtime_directory="/run/systemd/system"
--version="false" --work_dir="/tmp/Endpoint_SlaveEndpointTest_UnauthorizedRequest_1_uvTUAc"
I0715 04:42:36.194406  6348 credentials.hpp:86] Loading credential for authentication from
'/tmp/Endpoint_SlaveEndpointTest_UnauthorizedRequest_1_3kRbzh/credential'
I0715 04:42:36.194564  6348 slave.cpp:283] Agent using credential for: test-principal
I0715 04:42:36.194587  6348 credentials.hpp:37] Loading credentials for authentication from
'/tmp/Endpoint_SlaveEndpointTest_UnauthorizedRequest_1_3kRbzh/http_credentials'
I0715 04:42:36.194847  6348 http.cpp:993] Creating default 'basic' HTTP authenticator for
realm 'mesos-agent-readonly'
I0715 04:42:36.195071  6348 http.cpp:993] Creating default 'basic' HTTP authenticator for
realm 'mesos-agent-readwrite'
I0715 04:42:36.196561  6348 slave.cpp:565] Agent resources: [{"name":"cpus","scalar":{"value":2.0},"type":"SCALAR"},{"name":"mem","scalar":{"value":1024.0},"type":"SCALAR"},{"name":"disk","scalar":{"value":1024.0},"type":"SCALAR"},{"name":"ports","ranges":{"range":[{"begin":31000,"end":32000}]},"type":"RANGES"}]
I0715 04:42:36.196795  6348 slave.cpp:573] Agent attributes: [  ]
I0715 04:42:36.196810  6348 slave.cpp:582] Agent hostname: 8006c12083c2
I0715 04:42:36.196943  6337 status_update_manager.cpp:177] Pausing sending status updates
I0715 04:42:36.198909  6333 state.cpp:64] Recovering state from '/tmp/Endpoint_SlaveEndpointTest_UnauthorizedRequest_1_uvTUAc/meta'
I0715 04:42:36.199362  6332 status_update_manager.cpp:203] Recovering status update manager
I0715 04:42:36.199791  6352 containerizer.cpp:582] Recovering containerizer
I0715 04:42:36.201491  6352 provisioner.cpp:416] Provisioner recovery complete
I0715 04:42:36.202072  6343 slave.cpp:6229] Finished recovery
I0715 04:42:36.202682  6343 slave.cpp:6411] Querying resource estimator for oversubscribable
resources
I0715 04:42:36.203001  6345 slave.cpp:6425] Received oversubscribable resources {} from the
resource estimator
I0715 04:42:36.205962  6342 process.cpp:3820] Handling HTTP event for process 'slave(788)'
with path: '/slave(788)/monitor/statistics.json'
I0715 04:42:36.207433  6338 http.cpp:1133] HTTP GET for /slave(788)/monitor/statistics.json
from 172.17.0.3:46760
I0715 04:42:36.207516  6338 http.cpp:957] Authorizing principal 'test-principal' to GET the
'/monitor/statistics.json' endpoint
I0715 04:42:36.210100  6348 slave.cpp:843] Agent terminating
[       OK ] Endpoint/SlaveEndpointTest.UnauthorizedRequest/1 (32 ms)
[ RUN      ] Endpoint/SlaveEndpointTest.UnauthorizedRequest/2
I0715 04:42:36.222009  6311 containerizer.cpp:230] Using isolation: posix/cpu,posix/mem,filesystem/posix,network/cni,environment_secret
W0715 04:42:36.222488  6311 backend.cpp:76] Failed to create 'aufs' backend: AufsBackend requires
root privileges
W0715 04:42:36.222589  6311 backend.cpp:76] Failed to create 'bind' backend: BindBackend requires
root privileges
I0715 04:42:36.222621  6311 provisioner.cpp:255] Using default backend 'copy'
I0715 04:42:36.226188  6335 slave.cpp:250] Mesos agent started on (789)@172.17.0.3:40774
I0715 04:42:36.226212  6335 slave.cpp:251] Flags at startup: --acls="" --appc_simple_discovery_uri_prefix="http://"
--appc_store_dir="/tmp/Endpoint_SlaveEndpointTest_UnauthorizedRequest_2_ZTJWIB/store/appc"
--authenticate_http_readonly="true" --authenticate_http_readwrite="true" --authenticatee="crammd5"
--authentication_backoff_factor="1secs" --authorizer="local" --cgroups_cpu_enable_pids_and_tids_count="false"
--cgroups_enable_cfs="false" --cgroups_hierarchy="/sys/fs/cgroup" --cgroups_limit_swap="false"
--cgroups_root="mesos" --container_disk_watch_interval="15secs" --containerizers="mesos" --credential="/tmp/Endpoint_SlaveEndpointTest_UnauthorizedRequest_2_ZTJWIB/credential"
--default_role="*" --disk_watch_interval="1mins" --docker="docker" --docker_kill_orphans="true"
--docker_registry="https://registry-1.docker.io" --docker_remove_delay="6hrs" --docker_socket="/var/run/docker.sock"
--docker_stop_timeout="0ns" --docker_store_dir="/tmp/Endpoint_SlaveEndpointTest_UnauthorizedRequest_2_ZTJWIB/store/docker"
--docker_volume_checkpoint_dir="/var/run/mesos/isolators/docker/volume" --enforce_container_disk_quota="false"
--executor_registration_timeout="1mins" --executor_reregistration_timeout="2secs" --executor_shutdown_grace_period="5secs"
--fetcher_cache_dir="/tmp/Endpoint_SlaveEndpointTest_UnauthorizedRequest_2_ZTJWIB/fetch" --fetcher_cache_size="2GB"
--frameworks_home="" --gc_delay="1weeks" --gc_disk_headroom="0.1" --hadoop_home="" --help="false"
--hostname_lookup="true" --http_command_executor="false" --http_credentials="/tmp/Endpoint_SlaveEndpointTest_UnauthorizedRequest_2_ZTJWIB/http_credentials"
--http_heartbeat_interval="30secs" --initialize_driver_logging="true" --isolation="posix/cpu,posix/mem"
--launcher="posix" --launcher_dir="/mesos/mesos-1.4.0/_build/src" --logbufsecs="0" --logging_level="INFO"
--max_completed_executors_per_framework="150" --oversubscribed_resources_interval="15secs"
--perf_duration="10secs" --perf_interval="1mins" --port="5051" --qos_correction_interval_min="0ns"
--quiet="false" --recover="reconnect" --recovery_timeout="15mins" --registration_backoff_factor="10ms"
--resources="cpus:2;gpus:0;mem:1024;disk:1024;ports:[31000-32000]" --revocable_cpu_low_priority="true"
--runtime_dir="/tmp/Endpoint_SlaveEndpointTest_UnauthorizedRequest_2_ZTJWIB" --sandbox_directory="/mnt/mesos/sandbox"
--strict="true" --switch_user="true" --systemd_enable_support="true" --systemd_runtime_directory="/run/systemd/system"
--version="false" --work_dir="/tmp/Endpoint_SlaveEndpointTest_UnauthorizedRequest_2_W21NFw"
I0715 04:42:36.226645  6335 credentials.hpp:86] Loading credential for authentication from
'/tmp/Endpoint_SlaveEndpointTest_UnauthorizedRequest_2_ZTJWIB/credential'
I0715 04:42:36.226816  6335 slave.cpp:283] Agent using credential for: test-principal
I0715 04:42:36.226838  6335 credentials.hpp:37] Loading credentials for authentication from
'/tmp/Endpoint_SlaveEndpointTest_UnauthorizedRequest_2_ZTJWIB/http_credentials'
I0715 04:42:36.227097  6335 http.cpp:993] Creating default 'basic' HTTP authenticator for
realm 'mesos-agent-readonly'
I0715 04:42:36.227284  6335 http.cpp:993] Creating default 'basic' HTTP authenticator for
realm 'mesos-agent-readwrite'
I0715 04:42:36.228770  6335 slave.cpp:565] Agent resources: [{"name":"cpus","scalar":{"value":2.0},"type":"SCALAR"},{"name":"mem","scalar":{"value":1024.0},"type":"SCALAR"},{"name":"disk","scalar":{"value":1024.0},"type":"SCALAR"},{"name":"ports","ranges":{"range":[{"begin":31000,"end":32000}]},"type":"RANGES"}]
I0715 04:42:36.229001  6335 slave.cpp:573] Agent attributes: [  ]
I0715 04:42:36.229014  6335 slave.cpp:582] Agent hostname: 8006c12083c2
I0715 04:42:36.229161  6333 status_update_manager.cpp:177] Pausing sending status updates
I0715 04:42:36.230649  6332 state.cpp:64] Recovering state from '/tmp/Endpoint_SlaveEndpointTest_UnauthorizedRequest_2_W21NFw/meta'
I0715 04:42:36.230998  6352 status_update_manager.cpp:203] Recovering status update manager
I0715 04:42:36.231297  6330 containerizer.cpp:582] Recovering containerizer
I0715 04:42:36.233049  6346 provisioner.cpp:416] Provisioner recovery complete
I0715 04:42:36.233525  6344 slave.cpp:6229] Finished recovery
I0715 04:42:36.234200  6344 slave.cpp:6411] Querying resource estimator for oversubscribable
resources
I0715 04:42:36.234580  6343 slave.cpp:6425] Received oversubscribable resources {} from the
resource estimator
I0715 04:42:36.237540  6334 process.cpp:3820] Handling HTTP event for process 'slave(789)'
with path: '/slave(789)/containers'
I0715 04:42:36.238878  6353 http.cpp:1133] HTTP GET for /slave(789)/containers from 172.17.0.3:46762
I0715 04:42:36.238975  6353 http.cpp:957] Authorizing principal 'test-principal' to GET the
'/containers' endpoint
I0715 04:42:36.241690  6351 slave.cpp:843] Agent terminating
[       OK ] Endpoint/SlaveEndpointTest.UnauthorizedRequest/2 (30 ms)
[ RUN      ] Endpoint/SlaveEndpointTest.NoAuthorizer/0
I0715 04:42:36.253190  6311 containerizer.cpp:230] Using isolation: posix/cpu,posix/mem,filesystem/posix,network/cni,environment_secret
W0715 04:42:36.253703  6311 backend.cpp:76] Failed to create 'aufs' backend: AufsBackend requires
root privileges
W0715 04:42:36.253808  6311 backend.cpp:76] Failed to create 'bind' backend: BindBackend requires
root privileges
I0715 04:42:36.253846  6311 provisioner.cpp:255] Using default backend 'copy'
I0715 04:42:36.255895  6311 cluster.cpp:448] Creating default 'local' authorizer
I0715 04:42:36.257927  6340 slave.cpp:250] Mesos agent started on (790)@172.17.0.3:40774
I0715 04:42:36.257954  6340 slave.cpp:251] Flags at startup: --acls="" --appc_simple_discovery_uri_prefix="http://"
--appc_store_dir="/tmp/Endpoint_SlaveEndpointTest_NoAuthorizer_0_DrsdbW/store/appc" --authenticate_http_readonly="true"
--authenticate_http_readwrite="true" --authenticatee="crammd5" --authentication_backoff_factor="1secs"
--authorizer="local" --cgroups_cpu_enable_pids_and_tids_count="false" --cgroups_enable_cfs="false"
--cgroups_hierarchy="/sys/fs/cgroup" --cgroups_limit_swap="false" --cgroups_root="mesos" --container_disk_watch_interval="15secs"
--containerizers="mesos" --credential="/tmp/Endpoint_SlaveEndpointTest_NoAuthorizer_0_DrsdbW/credential"
--default_role="*" --disk_watch_interval="1mins" --docker="docker" --docker_kill_orphans="true"
--docker_registry="https://registry-1.docker.io" --docker_remove_delay="6hrs" --docker_socket="/var/run/docker.sock"
--docker_stop_timeout="0ns" --docker_store_dir="/tmp/Endpoint_SlaveEndpointTest_NoAuthorizer_0_DrsdbW/store/docker"
--docker_volume_checkpoint_dir="/var/run/mesos/isolators/docker/volume" --enforce_container_disk_quota="false"
--executor_registration_timeout="1mins" --executor_reregistration_timeout="2secs" --executor_shutdown_grace_period="5secs"
--fetcher_cache_dir="/tmp/Endpoint_SlaveEndpointTest_NoAuthorizer_0_DrsdbW/fetch" --fetcher_cache_size="2GB"
--frameworks_home="" --gc_delay="1weeks" --gc_disk_headroom="0.1" --hadoop_home="" --help="false"
--hostname_lookup="true" --http_command_executor="false" --http_credentials="/tmp/Endpoint_SlaveEndpointTest_NoAuthorizer_0_DrsdbW/http_credentials"
--http_heartbeat_interval="30secs" --initialize_driver_logging="true" --isolation="posix/cpu,posix/mem"
--launcher="posix" --launcher_dir="/mesos/mesos-1.4.0/_build/src" --logbufsecs="0" --logging_level="INFO"
--max_completed_executors_per_framework="150" --oversubscribed_resources_interval="15secs"
--perf_duration="10secs" --perf_interval="1mins" --port="5051" --qos_correction_interval_min="0ns"
--quiet="false" --recover="reconnect" --recovery_timeout="15mins" --registration_backoff_factor="10ms"
--resources="cpus:2;gpus:0;mem:1024;disk:1024;ports:[31000-32000]" --revocable_cpu_low_priority="true"
--runtime_dir="/tmp/Endpoint_SlaveEndpointTest_NoAuthorizer_0_DrsdbW" --sandbox_directory="/mnt/mesos/sandbox"
--strict="true" --switch_user="true" --systemd_enable_support="true" --systemd_runtime_directory="/run/systemd/system"
--version="false" --work_dir="/tmp/Endpoint_SlaveEndpointTest_NoAuthorizer_0_glNs3Q"
I0715 04:42:36.258436  6340 credentials.hpp:86] Loading credential for authentication from
'/tmp/Endpoint_SlaveEndpointTest_NoAuthorizer_0_DrsdbW/credential'
I0715 04:42:36.258602  6340 slave.cpp:283] Agent using credential for: test-principal
I0715 04:42:36.258623  6340 credentials.hpp:37] Loading credentials for authentication from
'/tmp/Endpoint_SlaveEndpointTest_NoAuthorizer_0_DrsdbW/http_credentials'
I0715 04:42:36.258869  6340 http.cpp:993] Creating default 'basic' HTTP authenticator for
realm 'mesos-agent-readonly'
I0715 04:42:36.259040  6340 http.cpp:993] Creating default 'basic' HTTP authenticator for
realm 'mesos-agent-readwrite'
I0715 04:42:36.260352  6340 slave.cpp:565] Agent resources: [{"name":"cpus","scalar":{"value":2.0},"type":"SCALAR"},{"name":"mem","scalar":{"value":1024.0},"type":"SCALAR"},{"name":"disk","scalar":{"value":1024.0},"type":"SCALAR"},{"name":"ports","ranges":{"range":[{"begin":31000,"end":32000}]},"type":"RANGES"}]
I0715 04:42:36.260578  6340 slave.cpp:573] Agent attributes: [  ]
I0715 04:42:36.260596  6340 slave.cpp:582] Agent hostname: 8006c12083c2
I0715 04:42:36.260737  6336 status_update_manager.cpp:177] Pausing sending status updates
I0715 04:42:36.262389  6342 state.cpp:64] Recovering state from '/tmp/Endpoint_SlaveEndpointTest_NoAuthorizer_0_glNs3Q/meta'
I0715 04:42:36.262655  6341 status_update_manager.cpp:203] Recovering status update manager
I0715 04:42:36.262853  6349 containerizer.cpp:582] Recovering containerizer
I0715 04:42:36.264523  6353 provisioner.cpp:416] Provisioner recovery complete
I0715 04:42:36.264932  6337 slave.cpp:6229] Finished recovery
I0715 04:42:36.265478  6337 slave.cpp:6411] Querying resource estimator for oversubscribable
resources
I0715 04:42:36.265734  6349 slave.cpp:6425] Received oversubscribable resources {} from the
resource estimator
I0715 04:42:36.268179  6337 process.cpp:3820] Handling HTTP event for process 'slave(790)'
with path: '/slave(790)/monitor/statistics'
I0715 04:42:36.269484  6344 http.cpp:1133] HTTP GET for /slave(790)/monitor/statistics from
172.17.0.3:46764
I0715 04:42:36.269562  6344 http.cpp:957] Authorizing principal 'test-principal' to GET the
'/monitor/statistics' endpoint
I0715 04:42:36.273308  6335 slave.cpp:843] Agent terminating
[       OK ] Endpoint/SlaveEndpointTest.NoAuthorizer/0 (31 ms)
[ RUN      ] Endpoint/SlaveEndpointTest.NoAuthorizer/1
I0715 04:42:36.285524  6311 containerizer.cpp:230] Using isolation: posix/cpu,posix/mem,filesystem/posix,network/cni,environment_secret
W0715 04:42:36.286027  6311 backend.cpp:76] Failed to create 'aufs' backend: AufsBackend requires
root privileges
W0715 04:42:36.286134  6311 backend.cpp:76] Failed to create 'bind' backend: BindBackend requires
root privileges
I0715 04:42:36.286167  6311 provisioner.cpp:255] Using default backend 'copy'
I0715 04:42:36.287926  6311 cluster.cpp:448] Creating default 'local' authorizer
I0715 04:42:36.289584  6346 slave.cpp:250] Mesos agent started on (791)@172.17.0.3:40774
I0715 04:42:36.289608  6346 slave.cpp:251] Flags at startup: --acls="" --appc_simple_discovery_uri_prefix="http://"
--appc_store_dir="/tmp/Endpoint_SlaveEndpointTest_NoAuthorizer_1_3kjCWg/store/appc" --authenticate_http_readonly="true"
--authenticate_http_readwrite="true" --authenticatee="crammd5" --authentication_backoff_factor="1secs"
--authorizer="local" --cgroups_cpu_enable_pids_and_tids_count="false" --cgroups_enable_cfs="false"
--cgroups_hierarchy="/sys/fs/cgroup" --cgroups_limit_swap="false" --cgroups_root="mesos" --container_disk_watch_interval="15secs"
--containerizers="mesos" --credential="/tmp/Endpoint_SlaveEndpointTest_NoAuthorizer_1_3kjCWg/credential"
--default_role="*" --disk_watch_interval="1mins" --docker="docker" --docker_kill_orphans="true"
--docker_registry="https://registry-1.docker.io" --docker_remove_delay="6hrs" --docker_socket="/var/run/docker.sock"
--docker_stop_timeout="0ns" --docker_store_dir="/tmp/Endpoint_SlaveEndpointTest_NoAuthorizer_1_3kjCWg/store/docker"
--docker_volume_checkpoint_dir="/var/run/mesos/isolators/docker/volume" --enforce_container_disk_quota="false"
--executor_registration_timeout="1mins" --executor_reregistration_timeout="2secs" --executor_shutdown_grace_period="5secs"
--fetcher_cache_dir="/tmp/Endpoint_SlaveEndpointTest_NoAuthorizer_1_3kjCWg/fetch" --fetcher_cache_size="2GB"
--frameworks_home="" --gc_delay="1weeks" --gc_disk_headroom="0.1" --hadoop_home="" --help="false"
--hostname_lookup="true" --http_command_executor="false" --http_credentials="/tmp/Endpoint_SlaveEndpointTest_NoAuthorizer_1_3kjCWg/http_credentials"
--http_heartbeat_interval="30secs" --initialize_driver_logging="true" --isolation="posix/cpu,posix/mem"
--launcher="posix" --launcher_dir="/mesos/mesos-1.4.0/_build/src" --logbufsecs="0" --logging_level="INFO"
--max_completed_executors_per_framework="150" --oversubscribed_resources_interval="15secs"
--perf_duration="10secs" --perf_interval="1mins" --port="5051" --qos_correction_interval_min="0ns"
--quiet="false" --recover="reconnect" --recovery_timeout="15mins" --registration_backoff_factor="10ms"
--resources="cpus:2;gpus:0;mem:1024;disk:1024;ports:[31000-32000]" --revocable_cpu_low_priority="true"
--runtime_dir="/tmp/Endpoint_SlaveEndpointTest_NoAuthorizer_1_3kjCWg" --sandbox_directory="/mnt/mesos/sandbox"
--strict="true" --switch_user="true" --systemd_enable_support="true" --systemd_runtime_directory="/run/systemd/system"
--version="false" --work_dir="/tmp/Endpoint_SlaveEndpointTest_NoAuthorizer_1_cqJ2Jb"
I0715 04:42:36.290043  6346 credentials.hpp:86] Loading credential for authentication from
'/tmp/Endpoint_SlaveEndpointTest_NoAuthorizer_1_3kjCWg/credential'
I0715 04:42:36.290191  6346 slave.cpp:283] Agent using credential for: test-principal
I0715 04:42:36.290212  6346 credentials.hpp:37] Loading credentials for authentication from
'/tmp/Endpoint_SlaveEndpointTest_NoAuthorizer_1_3kjCWg/http_credentials'
I0715 04:42:36.290437  6346 http.cpp:993] Creating default 'basic' HTTP authenticator for
realm 'mesos-agent-readonly'
I0715 04:42:36.290585  6346 http.cpp:993] Creating default 'basic' HTTP authenticator for
realm 'mesos-agent-readwrite'
I0715 04:42:36.291921  6346 slave.cpp:565] Agent resources: [{"name":"cpus","scalar":{"value":2.0},"type":"SCALAR"},{"name":"mem","scalar":{"value":1024.0},"type":"SCALAR"},{"name":"disk","scalar":{"value":1024.0},"type":"SCALAR"},{"name":"ports","ranges":{"range":[{"begin":31000,"end":32000}]},"type":"RANGES"}]
I0715 04:42:36.292325  6346 slave.cpp:573] Agent attributes: [  ]
I0715 04:42:36.292361  6346 slave.cpp:582] Agent hostname: 8006c12083c2
I0715 04:42:36.292487  6336 status_update_manager.cpp:177] Pausing sending status updates
I0715 04:42:36.293773  6353 state.cpp:64] Recovering state from '/tmp/Endpoint_SlaveEndpointTest_NoAuthorizer_1_cqJ2Jb/meta'
I0715 04:42:36.294049  6342 status_update_manager.cpp:203] Recovering status update manager
I0715 04:42:36.294358  6341 containerizer.cpp:582] Recovering containerizer
I0715 04:42:36.296006  6334 provisioner.cpp:416] Provisioner recovery complete
I0715 04:42:36.296398  6338 slave.cpp:6229] Finished recovery
I0715 04:42:36.296838  6338 slave.cpp:6411] Querying resource estimator for oversubscribable
resources
I0715 04:42:36.297149  6350 slave.cpp:6425] Received oversubscribable resources {} from the
resource estimator
I0715 04:42:36.299613  6339 process.cpp:3820] Handling HTTP event for process 'slave(791)'
with path: '/slave(791)/monitor/statistics.json'
I0715 04:42:36.301007  6335 http.cpp:1133] HTTP GET for /slave(791)/monitor/statistics.json
from 172.17.0.3:46766
I0715 04:42:36.301084  6335 http.cpp:957] Authorizing principal 'test-principal' to GET the
'/monitor/statistics.json' endpoint
I0715 04:42:36.304555  6349 slave.cpp:843] Agent terminating
[       OK ] Endpoint/SlaveEndpointTest.NoAuthorizer/1 (30 ms)
[ RUN      ] Endpoint/SlaveEndpointTest.NoAuthorizer/2
I0715 04:42:36.316484  6311 containerizer.cpp:230] Using isolation: posix/cpu,posix/mem,filesystem/posix,network/cni,environment_secret
W0715 04:42:36.316968  6311 backend.cpp:76] Failed to create 'aufs' backend: AufsBackend requires
root privileges
W0715 04:42:36.317066  6311 backend.cpp:76] Failed to create 'bind' backend: BindBackend requires
root privileges
I0715 04:42:36.317096  6311 provisioner.cpp:255] Using default backend 'copy'
I0715 04:42:36.319541  6311 cluster.cpp:448] Creating default 'local' authorizer
I0715 04:42:36.321576  6344 slave.cpp:250] Mesos agent started on (792)@172.17.0.3:40774
I0715 04:42:36.321605  6344 slave.cpp:251] Flags at startup: --acls="" --appc_simple_discovery_uri_prefix="http://"
--appc_store_dir="/tmp/Endpoint_SlaveEndpointTest_NoAuthorizer_2_bMww0B/store/appc" --authenticate_http_readonly="true"
--authenticate_http_readwrite="true" --authenticatee="crammd5" --authentication_backoff_factor="1secs"
--authorizer="local" --cgroups_cpu_enable_pids_and_tids_count="false" --cgroups_enable_cfs="false"
--cgroups_hierarchy="/sys/fs/cgroup" --cgroups_limit_swap="false" --cgroups_root="mesos" --container_disk_watch_interval="15secs"
--containerizers="mesos" --credential="/tmp/Endpoint_SlaveEndpointTest_NoAuthorizer_2_bMww0B/credential"
--default_role="*" --disk_watch_interval="1mins" --docker="docker" --docker_kill_orphans="true"
--docker_registry="https://registry-1.docker.io" --docker_remove_delay="6hrs" --docker_socket="/var/run/docker.sock"
--docker_stop_timeout="0ns" --docker_store_dir="/tmp/Endpoint_SlaveEndpointTest_NoAuthorizer_2_bMww0B/store/docker"
--docker_volume_checkpoint_dir="/var/run/mesos/isolators/docker/volume" --enforce_container_disk_quota="false"
--executor_registration_timeout="1mins" --executor_reregistration_timeout="2secs" --executor_shutdown_grace_period="5secs"
--fetcher_cache_dir="/tmp/Endpoint_SlaveEndpointTest_NoAuthorizer_2_bMww0B/fetch" --fetcher_cache_size="2GB"
--frameworks_home="" --gc_delay="1weeks" --gc_disk_headroom="0.1" --hadoop_home="" --help="false"
--hostname_lookup="true" --http_command_executor="false" --http_credentials="/tmp/Endpoint_SlaveEndpointTest_NoAuthorizer_2_bMww0B/http_credentials"
--http_heartbeat_interval="30secs" --initialize_driver_logging="true" --isolation="posix/cpu,posix/mem"
--launcher="posix" --launcher_dir="/mesos/mesos-1.4.0/_build/src" --logbufsecs="0" --logging_level="INFO"
--max_completed_executors_per_framework="150" --oversubscribed_resources_interval="15secs"
--perf_duration="10secs" --perf_interval="1mins" --port="5051" --qos_correction_interval_min="0ns"
--quiet="false" --recover="reconnect" --recovery_timeout="15mins" --registration_backoff_factor="10ms"
--resources="cpus:2;gpus:0;mem:1024;disk:1024;ports:[31000-32000]" --revocable_cpu_low_priority="true"
--runtime_dir="/tmp/Endpoint_SlaveEndpointTest_NoAuthorizer_2_bMww0B" --sandbox_directory="/mnt/mesos/sandbox"
--strict="true" --switch_user="true" --systemd_enable_support="true" --systemd_runtime_directory="/run/systemd/system"
--version="false" --work_dir="/tmp/Endpoint_SlaveEndpointTest_NoAuthorizer_2_qwvlJw"
I0715 04:42:36.322006  6344 credentials.hpp:86] Loading credential for authentication from
'/tmp/Endpoint_SlaveEndpointTest_NoAuthorizer_2_bMww0B/credential'
I0715 04:42:36.322168  6344 slave.cpp:283] Agent using credential for: test-principal
I0715 04:42:36.322188  6344 credentials.hpp:37] Loading credentials for authentication from
'/tmp/Endpoint_SlaveEndpointTest_NoAuthorizer_2_bMww0B/http_credentials'
I0715 04:42:36.322418  6344 http.cpp:993] Creating default 'basic' HTTP authenticator for
realm 'mesos-agent-readonly'
I0715 04:42:36.322569  6344 http.cpp:993] Creating default 'basic' HTTP authenticator for
realm 'mesos-agent-readwrite'
I0715 04:42:36.324023  6344 slave.cpp:565] Agent resources: [{"name":"cpus","scalar":{"value":2.0},"type":"SCALAR"},{"name":"mem","scalar":{"value":1024.0},"type":"SCALAR"},{"name":"disk","scalar":{"value":1024.0},"type":"SCALAR"},{"name":"ports","ranges":{"range":[{"begin":31000,"end":32000}]},"type":"RANGES"}]
I0715 04:42:36.324254  6344 slave.cpp:573] Agent attributes: [  ]
I0715 04:42:36.324268  6344 slave.cpp:582] Agent hostname: 8006c12083c2
I0715 04:42:36.324405  6346 status_update_manager.cpp:177] Pausing sending status updates
I0715 04:42:36.325975  6336 state.cpp:64] Recovering state from '/tmp/Endpoint_SlaveEndpointTest_NoAuthorizer_2_qwvlJw/meta'
I0715 04:42:36.326337  6330 status_update_manager.cpp:203] Recovering status update manager
I0715 04:42:36.326728  6333 containerizer.cpp:582] Recovering containerizer
I0715 04:42:36.328286  6351 provisioner.cpp:416] Provisioner recovery complete
I0715 04:42:36.328672  6349 slave.cpp:6229] Finished recovery
I0715 04:42:36.329206  6349 slave.cpp:6411] Querying resource estimator for oversubscribable
resources
I0715 04:42:36.329499  6347 slave.cpp:6425] Received oversubscribable resources {} from the
resource estimator
I0715 04:42:36.332108  6348 process.cpp:3820] Handling HTTP event for process 'slave(792)'
with path: '/slave(792)/containers'
I0715 04:42:36.333549  6353 http.cpp:1133] HTTP GET for /slave(792)/containers from 172.17.0.3:46768
I0715 04:42:36.333655  6353 http.cpp:957] Authorizing principal 'test-principal' to GET the
'/containers' endpoint
I0715 04:42:36.337810  6350 slave.cpp:843] Agent terminating
[       OK ] Endpoint/SlaveEndpointTest.NoAuthorizer/2 (33 ms)
[----------] 9 tests from Endpoint/SlaveEndpointTest (289 ms total)

[----------] Global test environment tear-down
[==========] 1633 tests from 179 test cases ran. (626890 ms total)
[  PASSED  ] 1628 tests.
[  FAILED  ] 5 tests, listed below:
[  FAILED  ] CommandExecutorCheckTest.CommandCheckDeliveredAndReconciled
[  FAILED  ] DefaultExecutorCheckTest.CommandCheckDeliveredAndReconciled
[  FAILED  ] DefaultExecutorCheckTest.CommandCheckStatusChange
[  FAILED  ] DefaultExecutorCheckTest.CommandCheckSeesParentsEnv
[  FAILED  ] DefaultExecutorCheckTest.CommandCheckSharesWorkDirWithTask

 5 FAILED TESTS
  YOU HAVE 20 DISABLED TESTS

I0715 04:42:36.407554  6354 process.cpp:993] Failed to accept socket: future discarded
make[4]: *** [check-local] Error 1
make[4]: Leaving directory `/mesos/mesos-1.4.0/_build/src'
make[3]: *** [check-am] Error 2
make[3]: Leaving directory `/mesos/mesos-1.4.0/_build/src'
make[2]: *** [check] Error 2
make[2]: Leaving directory `/mesos/mesos-1.4.0/_build/src'
make[1]: *** [check-recursive] Error 1
make[1]: Leaving directory `/mesos/mesos-1.4.0/_build'
make: *** [distcheck] Error 1
+ docker rmi mesos-1500091122-25855
Untagged: mesos-1500091122-25855:latest
Deleted: sha256:b89f3145f9660fe8549dbda9874345284b00820019d75cad83469cd8fa5e5cde
Deleted: sha256:9844950d417c00f4c0a7e903991ce4ab182bc4705acb3fa54a71822c60a76c2c
Deleted: sha256:4ba5df7c3e4759a9b96836f66b3463810fd0285d43af9487f9817cab610ef101
Deleted: sha256:a60608206e3ff4280fe38bfe06a4bfc8d3c12bf3daa55dd064caeed66887040f
Deleted: sha256:ab85e7cb473803cba97c75109124f91431f2310bf7b27aff54a923c33df547d6
Deleted: sha256:eea4f6fc129f1957b9c5bb582e652507a92a04cbc121ce49931892c580b92198
Deleted: sha256:81229a8f08439c8bee3e1fe2f31f114fcb9873676c741d295a485daf6e9ffe76
Deleted: sha256:95339b3629d60eac9930bd4ae2d4be4eb267838f0b7253ad4a07a406e30f4a19
Deleted: sha256:72a51dbf47c5e84f40c07ea4a128d60e6c30f98069d2ec990d991521e7dcf1f9
Deleted: sha256:822742ed89527d737959d847fa2872060a87046e55b8b4663c020b6317c0294a
Deleted: sha256:5785bcb3912ffada28b6c6f8ebfff0e5d8d55845ae7a85e388c698d1256447a2
Deleted: sha256:738ce87b2dffd0985a8cafbbc94204beb221fb21e7f2c6ec42f1a47c1c124d66
Deleted: sha256:e00c041fa3c2bd0ea72ce599fb4e192c12e990e26de4852c887b21e1b1d390b0
Deleted: sha256:6bf66b8c986d5c401b8cb7bbe04236e89a3ef3cc51fe0f0909dc790773c5b30c
Deleted: sha256:2cf7aeeea5dc421a801d7938c1ec024c224874345ed825674d18897d0064ad1a
Deleted: sha256:4f6babaece7d21506031d963f5724f9efb1adc61a1f915d66b9680d97d44919f
Deleted: sha256:19d19a1427c9fbce1aff4c34634a9d8f2ba1302a23331dc0498522f1df78344a
Deleted: sha256:844d1713ffa235d2e1b0463538ca62f2f827e13bb217182bec5648b7c64436e6
Deleted: sha256:0995fcdff8a9eaa5b09c3e4e52cac9e8f3476fd9411a73652e438c0f00a65866
Deleted: sha256:69740b0a0355b4d49b3309ae9d9a8685b597829646c81e7aa8704f4fa8f4221d
Deleted: sha256:697b2a9d3280cad873433d650601c5aea778903a642077d075f20f1d3addbc0a
Deleted: sha256:4ffbd1f38c2880e2068cac36c862518f48a8c0deb4065ff3a532ddfbc36ef52f
Deleted: sha256:27d80d75818d9544014a26bb8dc92d56bff1f936fb7e986006d6d876c8151ce4
Deleted: sha256:5fa2ae83e500b0079d7dcc981c9864e796f495ced1a6fe442ede5454d34bbe9b
Deleted: sha256:52ddb16d615c45656da5b8b79260a4192d47c770133bd1e269938ef8cacfff00
Build step 'Execute shell' marked build as failure
Not sending mail to unregistered user yujie.jay@gmail.com

Mime
View raw message