mesos-builds mailing list archives

Site index · List index
Message view « Date » · « Thread »
Top « Date » · « Thread »
From Apache Jenkins Server <jenk...@builds.apache.org>
Subject Build failed in Jenkins: Mesos-Buildbot » autotools,gcc,--verbose,GLOG_v=1 MESOS_VERBOSE=1,centos:7,(ubuntu)&&(!ubuntu-us1)&&(!ubuntu-eu2) #3900
Date Tue, 11 Jul 2017 21:59:10 GMT
See <https://builds.apache.org/job/Mesos-Buildbot/BUILDTOOL=autotools,COMPILER=gcc,CONFIGURATION=--verbose,ENVIRONMENT=GLOG_v=1%20MESOS_VERBOSE=1,OS=centos%3A7,label_exp=(ubuntu)&&(!ubuntu-us1)&&(!ubuntu-eu2)/3900/display/redirect?page=changes>

Changes:

[neil.conway] Added protobuf definitions for fault domains.

[neil.conway] Added REGION_AWARE framework capability.

[neil.conway] Added master and agent flags to specify domain.

[neil.conway] Added domain to MasterInfo and SlaveInfo.

[neil.conway] Caused master to abort when joining a mixed-region cluster.

[neil.conway] Ignore registration attempts by agents with misconfigured domain.

[neil.conway] Changed allocator to offer remote resources to region-aware frameworks.

[neil.conway] Added agent domain to Offer message.

------------------------------------------
[...truncated 29.83 MB...]
I0711 21:59:00.497495  6298 provisioner.cpp:255] Using default backend 'copy'
I0711 21:59:00.502601  6326 slave.cpp:250] Mesos agent started on (784)@172.17.0.11:44464
I0711 21:59:00.502625  6326 slave.cpp:251] Flags at startup: --acls="" --appc_simple_discovery_uri_prefix="http://"
--appc_store_dir="/tmp/Endpoint_SlaveEndpointTest_AuthorizedRequest_2_5lBlqx/store/appc" --authenticate_http_readonly="true"
--authenticate_http_readwrite="true" --authenticatee="crammd5" --authentication_backoff_factor="1secs"
--authorizer="local" --cgroups_cpu_enable_pids_and_tids_count="false" --cgroups_enable_cfs="false"
--cgroups_hierarchy="/sys/fs/cgroup" --cgroups_limit_swap="false" --cgroups_root="mesos" --container_disk_watch_interval="15secs"
--containerizers="mesos" --credential="/tmp/Endpoint_SlaveEndpointTest_AuthorizedRequest_2_5lBlqx/credential"
--default_role="*" --disk_watch_interval="1mins" --docker="docker" --docker_kill_orphans="true"
--docker_registry="https://registry-1.docker.io" --docker_remove_delay="6hrs" --docker_socket="/var/run/docker.sock"
--docker_stop_timeout="0ns" --docker_store_dir="/tmp/Endpoint_SlaveEndpointTest_AuthorizedRequest_2_5lBlqx/store/docker"
--docker_volume_checkpoint_dir="/var/run/mesos/isolators/docker/volume" --enforce_container_disk_quota="false"
--executor_registration_timeout="1mins" --executor_reregistration_timeout="2secs" --executor_shutdown_grace_period="5secs"
--fetcher_cache_dir="/tmp/Endpoint_SlaveEndpointTest_AuthorizedRequest_2_5lBlqx/fetch" --fetcher_cache_size="2GB"
--frameworks_home="" --gc_delay="1weeks" --gc_disk_headroom="0.1" --hadoop_home="" --help="false"
--hostname_lookup="true" --http_command_executor="false" --http_credentials="/tmp/Endpoint_SlaveEndpointTest_AuthorizedRequest_2_5lBlqx/http_credentials"
--http_heartbeat_interval="30secs" --initialize_driver_logging="true" --isolation="posix/cpu,posix/mem"
--launcher="posix" --launcher_dir="/mesos/mesos-1.4.0/_build/src" --logbufsecs="0" --logging_level="INFO"
--max_completed_executors_per_framework="150" --oversubscribed_resources_interval="15secs"
--perf_duration="10secs" --perf_interval="1mins" --port="5051" --qos_correction_interval_min="0ns"
--quiet="false" --recover="reconnect" --recovery_timeout="15mins" --registration_backoff_factor="10ms"
--resources="cpus:2;gpus:0;mem:1024;disk:1024;ports:[31000-32000]" --revocable_cpu_low_priority="true"
--runtime_dir="/tmp/Endpoint_SlaveEndpointTest_AuthorizedRequest_2_5lBlqx" --sandbox_directory="/mnt/mesos/sandbox"
--strict="true" --switch_user="true" --systemd_enable_support="true" --systemd_runtime_directory="/run/systemd/system"
--version="false" --work_dir="/tmp/Endpoint_SlaveEndpointTest_AuthorizedRequest_2_p0O4kV"
I0711 21:59:00.503092  6326 credentials.hpp:86] Loading credential for authentication from
'/tmp/Endpoint_SlaveEndpointTest_AuthorizedRequest_2_5lBlqx/credential'
I0711 21:59:00.503284  6326 slave.cpp:283] Agent using credential for: test-principal
I0711 21:59:00.503307  6326 credentials.hpp:37] Loading credentials for authentication from
'/tmp/Endpoint_SlaveEndpointTest_AuthorizedRequest_2_5lBlqx/http_credentials'
I0711 21:59:00.503597  6326 http.cpp:1009] Creating default 'basic' HTTP authenticator for
realm 'mesos-agent-readonly'
I0711 21:59:00.503865  6326 http.cpp:1009] Creating default 'basic' HTTP authenticator for
realm 'mesos-agent-readwrite'
I0711 21:59:00.505584  6326 slave.cpp:565] Agent resources: [{"name":"cpus","scalar":{"value":2.0},"type":"SCALAR"},{"name":"mem","scalar":{"value":1024.0},"type":"SCALAR"},{"name":"disk","scalar":{"value":1024.0},"type":"SCALAR"},{"name":"ports","ranges":{"range":[{"begin":31000,"end":32000}]},"type":"RANGES"}]
I0711 21:59:00.505849  6326 slave.cpp:573] Agent attributes: [  ]
I0711 21:59:00.505864  6326 slave.cpp:582] Agent hostname: d13aaed9bdc3
I0711 21:59:00.505995  6333 status_update_manager.cpp:177] Pausing sending status updates
I0711 21:59:00.507697  6325 state.cpp:64] Recovering state from '/tmp/Endpoint_SlaveEndpointTest_AuthorizedRequest_2_p0O4kV/meta'
I0711 21:59:00.508080  6335 status_update_manager.cpp:203] Recovering status update manager
I0711 21:59:00.508275  6322 containerizer.cpp:582] Recovering containerizer
I0711 21:59:00.509894  6337 provisioner.cpp:416] Provisioner recovery complete
I0711 21:59:00.513324  6318 slave.cpp:6207] Finished recovery
I0711 21:59:00.513831  6318 slave.cpp:6389] Querying resource estimator for oversubscribable
resources
I0711 21:59:00.514284  6318 slave.cpp:6403] Received oversubscribable resources {} from the
resource estimator
I0711 21:59:00.517176  6325 process.cpp:3820] Handling HTTP event for process 'slave(784)'
with path: '/slave(784)/containers'
I0711 21:59:00.518535  6323 http.cpp:1149] HTTP GET for /slave(784)/containers from 172.17.0.11:32864
I0711 21:59:00.518618  6323 http.cpp:970] Authorizing principal 'test-principal' to GET the
'/containers' endpoint
I0711 21:59:00.522020  6335 slave.cpp:843] Agent terminating
[       OK ] Endpoint/SlaveEndpointTest.AuthorizedRequest/2 (36 ms)
[ RUN      ] Endpoint/SlaveEndpointTest.UnauthorizedRequest/0
I0711 21:59:00.532081  6298 containerizer.cpp:230] Using isolation: posix/cpu,posix/mem,filesystem/posix,network/cni,environment_secret
W0711 21:59:00.532558  6298 backend.cpp:76] Failed to create 'aufs' backend: AufsBackend requires
root privileges
W0711 21:59:00.532656  6298 backend.cpp:76] Failed to create 'bind' backend: BindBackend requires
root privileges
I0711 21:59:00.532703  6298 provisioner.cpp:255] Using default backend 'copy'
I0711 21:59:00.536244  6335 slave.cpp:250] Mesos agent started on (785)@172.17.0.11:44464
I0711 21:59:00.536267  6335 slave.cpp:251] Flags at startup: --acls="" --appc_simple_discovery_uri_prefix="http://"
--appc_store_dir="/tmp/Endpoint_SlaveEndpointTest_UnauthorizedRequest_0_zO1R3Z/store/appc"
--authenticate_http_readonly="true" --authenticate_http_readwrite="true" --authenticatee="crammd5"
--authentication_backoff_factor="1secs" --authorizer="local" --cgroups_cpu_enable_pids_and_tids_count="false"
--cgroups_enable_cfs="false" --cgroups_hierarchy="/sys/fs/cgroup" --cgroups_limit_swap="false"
--cgroups_root="mesos" --container_disk_watch_interval="15secs" --containerizers="mesos" --credential="/tmp/Endpoint_SlaveEndpointTest_UnauthorizedRequest_0_zO1R3Z/credential"
--default_role="*" --disk_watch_interval="1mins" --docker="docker" --docker_kill_orphans="true"
--docker_registry="https://registry-1.docker.io" --docker_remove_delay="6hrs" --docker_socket="/var/run/docker.sock"
--docker_stop_timeout="0ns" --docker_store_dir="/tmp/Endpoint_SlaveEndpointTest_UnauthorizedRequest_0_zO1R3Z/store/docker"
--docker_volume_checkpoint_dir="/var/run/mesos/isolators/docker/volume" --enforce_container_disk_quota="false"
--executor_registration_timeout="1mins" --executor_reregistration_timeout="2secs" --executor_shutdown_grace_period="5secs"
--fetcher_cache_dir="/tmp/Endpoint_SlaveEndpointTest_UnauthorizedRequest_0_zO1R3Z/fetch" --fetcher_cache_size="2GB"
--frameworks_home="" --gc_delay="1weeks" --gc_disk_headroom="0.1" --hadoop_home="" --help="false"
--hostname_lookup="true" --http_command_executor="false" --http_credentials="/tmp/Endpoint_SlaveEndpointTest_UnauthorizedRequest_0_zO1R3Z/http_credentials"
--http_heartbeat_interval="30secs" --initialize_driver_logging="true" --isolation="posix/cpu,posix/mem"
--launcher="posix" --launcher_dir="/mesos/mesos-1.4.0/_build/src" --logbufsecs="0" --logging_level="INFO"
--max_completed_executors_per_framework="150" --oversubscribed_resources_interval="15secs"
--perf_duration="10secs" --perf_interval="1mins" --port="5051" --qos_correction_interval_min="0ns"
--quiet="false" --recover="reconnect" --recovery_timeout="15mins" --registration_backoff_factor="10ms"
--resources="cpus:2;gpus:0;mem:1024;disk:1024;ports:[31000-32000]" --revocable_cpu_low_priority="true"
--runtime_dir="/tmp/Endpoint_SlaveEndpointTest_UnauthorizedRequest_0_zO1R3Z" --sandbox_directory="/mnt/mesos/sandbox"
--strict="true" --switch_user="true" --systemd_enable_support="true" --systemd_runtime_directory="/run/systemd/system"
--version="false" --work_dir="/tmp/Endpoint_SlaveEndpointTest_UnauthorizedRequest_0_Y8LjTn"
I0711 21:59:00.536656  6335 credentials.hpp:86] Loading credential for authentication from
'/tmp/Endpoint_SlaveEndpointTest_UnauthorizedRequest_0_zO1R3Z/credential'
I0711 21:59:00.536818  6335 slave.cpp:283] Agent using credential for: test-principal
I0711 21:59:00.536844  6335 credentials.hpp:37] Loading credentials for authentication from
'/tmp/Endpoint_SlaveEndpointTest_UnauthorizedRequest_0_zO1R3Z/http_credentials'
I0711 21:59:00.537084  6335 http.cpp:1009] Creating default 'basic' HTTP authenticator for
realm 'mesos-agent-readonly'
I0711 21:59:00.537258  6335 http.cpp:1009] Creating default 'basic' HTTP authenticator for
realm 'mesos-agent-readwrite'
I0711 21:59:00.538549  6335 slave.cpp:565] Agent resources: [{"name":"cpus","scalar":{"value":2.0},"type":"SCALAR"},{"name":"mem","scalar":{"value":1024.0},"type":"SCALAR"},{"name":"disk","scalar":{"value":1024.0},"type":"SCALAR"},{"name":"ports","ranges":{"range":[{"begin":31000,"end":32000}]},"type":"RANGES"}]
I0711 21:59:00.538761  6335 slave.cpp:573] Agent attributes: [  ]
I0711 21:59:00.538772  6335 slave.cpp:582] Agent hostname: d13aaed9bdc3
I0711 21:59:00.538933  6339 status_update_manager.cpp:177] Pausing sending status updates
I0711 21:59:00.540345  6326 state.cpp:64] Recovering state from '/tmp/Endpoint_SlaveEndpointTest_UnauthorizedRequest_0_Y8LjTn/meta'
I0711 21:59:00.540690  6328 status_update_manager.cpp:203] Recovering status update manager
I0711 21:59:00.540873  6331 containerizer.cpp:582] Recovering containerizer
I0711 21:59:00.542304  6318 provisioner.cpp:416] Provisioner recovery complete
I0711 21:59:00.542719  6325 slave.cpp:6207] Finished recovery
I0711 21:59:00.543169  6325 slave.cpp:6389] Querying resource estimator for oversubscribable
resources
I0711 21:59:00.543431  6328 slave.cpp:6403] Received oversubscribable resources {} from the
resource estimator
I0711 21:59:00.545825  6321 process.cpp:3820] Handling HTTP event for process 'slave(785)'
with path: '/slave(785)/monitor/statistics'
I0711 21:59:00.547294  6322 http.cpp:1149] HTTP GET for /slave(785)/monitor/statistics from
172.17.0.11:32866
I0711 21:59:00.547399  6322 http.cpp:970] Authorizing principal 'test-principal' to GET the
'/monitor/statistics' endpoint
I0711 21:59:00.549787  6317 slave.cpp:843] Agent terminating
[       OK ] Endpoint/SlaveEndpointTest.UnauthorizedRequest/0 (28 ms)
[ RUN      ] Endpoint/SlaveEndpointTest.UnauthorizedRequest/1
I0711 21:59:00.561419  6298 containerizer.cpp:230] Using isolation: posix/cpu,posix/mem,filesystem/posix,network/cni,environment_secret
W0711 21:59:00.562137  6298 backend.cpp:76] Failed to create 'aufs' backend: AufsBackend requires
root privileges
W0711 21:59:00.562252  6298 backend.cpp:76] Failed to create 'bind' backend: BindBackend requires
root privileges
I0711 21:59:00.562290  6298 provisioner.cpp:255] Using default backend 'copy'
I0711 21:59:00.565901  6331 slave.cpp:250] Mesos agent started on (786)@172.17.0.11:44464
I0711 21:59:00.565927  6331 slave.cpp:251] Flags at startup: --acls="" --appc_simple_discovery_uri_prefix="http://"
--appc_store_dir="/tmp/Endpoint_SlaveEndpointTest_UnauthorizedRequest_1_RpdHYs/store/appc"
--authenticate_http_readonly="true" --authenticate_http_readwrite="true" --authenticatee="crammd5"
--authentication_backoff_factor="1secs" --authorizer="local" --cgroups_cpu_enable_pids_and_tids_count="false"
--cgroups_enable_cfs="false" --cgroups_hierarchy="/sys/fs/cgroup" --cgroups_limit_swap="false"
--cgroups_root="mesos" --container_disk_watch_interval="15secs" --containerizers="mesos" --credential="/tmp/Endpoint_SlaveEndpointTest_UnauthorizedRequest_1_RpdHYs/credential"
--default_role="*" --disk_watch_interval="1mins" --docker="docker" --docker_kill_orphans="true"
--docker_registry="https://registry-1.docker.io" --docker_remove_delay="6hrs" --docker_socket="/var/run/docker.sock"
--docker_stop_timeout="0ns" --docker_store_dir="/tmp/Endpoint_SlaveEndpointTest_UnauthorizedRequest_1_RpdHYs/store/docker"
--docker_volume_checkpoint_dir="/var/run/mesos/isolators/docker/volume" --enforce_container_disk_quota="false"
--executor_registration_timeout="1mins" --executor_reregistration_timeout="2secs" --executor_shutdown_grace_period="5secs"
--fetcher_cache_dir="/tmp/Endpoint_SlaveEndpointTest_UnauthorizedRequest_1_RpdHYs/fetch" --fetcher_cache_size="2GB"
--frameworks_home="" --gc_delay="1weeks" --gc_disk_headroom="0.1" --hadoop_home="" --help="false"
--hostname_lookup="true" --http_command_executor="false" --http_credentials="/tmp/Endpoint_SlaveEndpointTest_UnauthorizedRequest_1_RpdHYs/http_credentials"
--http_heartbeat_interval="30secs" --initialize_driver_logging="true" --isolation="posix/cpu,posix/mem"
--launcher="posix" --launcher_dir="/mesos/mesos-1.4.0/_build/src" --logbufsecs="0" --logging_level="INFO"
--max_completed_executors_per_framework="150" --oversubscribed_resources_interval="15secs"
--perf_duration="10secs" --perf_interval="1mins" --port="5051" --qos_correction_interval_min="0ns"
--quiet="false" --recover="reconnect" --recovery_timeout="15mins" --registration_backoff_factor="10ms"
--resources="cpus:2;gpus:0;mem:1024;disk:1024;ports:[31000-32000]" --revocable_cpu_low_priority="true"
--runtime_dir="/tmp/Endpoint_SlaveEndpointTest_UnauthorizedRequest_1_RpdHYs" --sandbox_directory="/mnt/mesos/sandbox"
--strict="true" --switch_user="true" --systemd_enable_support="true" --systemd_runtime_directory="/run/systemd/system"
--version="false" --work_dir="/tmp/Endpoint_SlaveEndpointTest_UnauthorizedRequest_1_edTOJQ"
I0711 21:59:00.566396  6331 credentials.hpp:86] Loading credential for authentication from
'/tmp/Endpoint_SlaveEndpointTest_UnauthorizedRequest_1_RpdHYs/credential'
I0711 21:59:00.566603  6331 slave.cpp:283] Agent using credential for: test-principal
I0711 21:59:00.566622  6331 credentials.hpp:37] Loading credentials for authentication from
'/tmp/Endpoint_SlaveEndpointTest_UnauthorizedRequest_1_RpdHYs/http_credentials'
I0711 21:59:00.566864  6331 http.cpp:1009] Creating default 'basic' HTTP authenticator for
realm 'mesos-agent-readonly'
I0711 21:59:00.567028  6331 http.cpp:1009] Creating default 'basic' HTTP authenticator for
realm 'mesos-agent-readwrite'
I0711 21:59:00.568439  6331 slave.cpp:565] Agent resources: [{"name":"cpus","scalar":{"value":2.0},"type":"SCALAR"},{"name":"mem","scalar":{"value":1024.0},"type":"SCALAR"},{"name":"disk","scalar":{"value":1024.0},"type":"SCALAR"},{"name":"ports","ranges":{"range":[{"begin":31000,"end":32000}]},"type":"RANGES"}]
I0711 21:59:00.568716  6331 slave.cpp:573] Agent attributes: [  ]
I0711 21:59:00.568730  6331 slave.cpp:582] Agent hostname: d13aaed9bdc3
I0711 21:59:00.568863  6318 status_update_manager.cpp:177] Pausing sending status updates
I0711 21:59:00.570752  6336 state.cpp:64] Recovering state from '/tmp/Endpoint_SlaveEndpointTest_UnauthorizedRequest_1_edTOJQ/meta'
I0711 21:59:00.571266  6339 status_update_manager.cpp:203] Recovering status update manager
I0711 21:59:00.571530  6331 containerizer.cpp:582] Recovering containerizer
I0711 21:59:00.573858  6324 provisioner.cpp:416] Provisioner recovery complete
I0711 21:59:00.574427  6325 slave.cpp:6207] Finished recovery
I0711 21:59:00.575124  6325 slave.cpp:6389] Querying resource estimator for oversubscribable
resources
I0711 21:59:00.575446  6324 slave.cpp:6403] Received oversubscribable resources {} from the
resource estimator
I0711 21:59:00.579787  6328 process.cpp:3820] Handling HTTP event for process 'slave(786)'
with path: '/slave(786)/monitor/statistics.json'
I0711 21:59:00.581277  6333 http.cpp:1149] HTTP GET for /slave(786)/monitor/statistics.json
from 172.17.0.11:32870
I0711 21:59:00.581368  6333 http.cpp:970] Authorizing principal 'test-principal' to GET the
'/monitor/statistics.json' endpoint
I0711 21:59:00.584271  6320 slave.cpp:843] Agent terminating
[       OK ] Endpoint/SlaveEndpointTest.UnauthorizedRequest/1 (35 ms)
[ RUN      ] Endpoint/SlaveEndpointTest.UnauthorizedRequest/2
I0711 21:59:00.600116  6298 containerizer.cpp:230] Using isolation: posix/cpu,posix/mem,filesystem/posix,network/cni,environment_secret
W0711 21:59:00.600997  6298 backend.cpp:76] Failed to create 'aufs' backend: AufsBackend requires
root privileges
W0711 21:59:00.601166  6298 backend.cpp:76] Failed to create 'bind' backend: BindBackend requires
root privileges
I0711 21:59:00.601210  6298 provisioner.cpp:255] Using default backend 'copy'
I0711 21:59:00.605643  6327 slave.cpp:250] Mesos agent started on (787)@172.17.0.11:44464
I0711 21:59:00.605691  6327 slave.cpp:251] Flags at startup: --acls="" --appc_simple_discovery_uri_prefix="http://"
--appc_store_dir="/tmp/Endpoint_SlaveEndpointTest_UnauthorizedRequest_2_giaJeW/store/appc"
--authenticate_http_readonly="true" --authenticate_http_readwrite="true" --authenticatee="crammd5"
--authentication_backoff_factor="1secs" --authorizer="local" --cgroups_cpu_enable_pids_and_tids_count="false"
--cgroups_enable_cfs="false" --cgroups_hierarchy="/sys/fs/cgroup" --cgroups_limit_swap="false"
--cgroups_root="mesos" --container_disk_watch_interval="15secs" --containerizers="mesos" --credential="/tmp/Endpoint_SlaveEndpointTest_UnauthorizedRequest_2_giaJeW/credential"
--default_role="*" --disk_watch_interval="1mins" --docker="docker" --docker_kill_orphans="true"
--docker_registry="https://registry-1.docker.io" --docker_remove_delay="6hrs" --docker_socket="/var/run/docker.sock"
--docker_stop_timeout="0ns" --docker_store_dir="/tmp/Endpoint_SlaveEndpointTest_UnauthorizedRequest_2_giaJeW/store/docker"
--docker_volume_checkpoint_dir="/var/run/mesos/isolators/docker/volume" --enforce_container_disk_quota="false"
--executor_registration_timeout="1mins" --executor_reregistration_timeout="2secs" --executor_shutdown_grace_period="5secs"
--fetcher_cache_dir="/tmp/Endpoint_SlaveEndpointTest_UnauthorizedRequest_2_giaJeW/fetch" --fetcher_cache_size="2GB"
--frameworks_home="" --gc_delay="1weeks" --gc_disk_headroom="0.1" --hadoop_home="" --help="false"
--hostname_lookup="true" --http_command_executor="false" --http_credentials="/tmp/Endpoint_SlaveEndpointTest_UnauthorizedRequest_2_giaJeW/http_credentials"
--http_heartbeat_interval="30secs" --initialize_driver_logging="true" --isolation="posix/cpu,posix/mem"
--launcher="posix" --launcher_dir="/mesos/mesos-1.4.0/_build/src" --logbufsecs="0" --logging_level="INFO"
--max_completed_executors_per_framework="150" --oversubscribed_resources_interval="15secs"
--perf_duration="10secs" --perf_interval="1mins" --port="5051" --qos_correction_interval_min="0ns"
--quiet="false" --recover="reconnect" --recovery_timeout="15mins" --registration_backoff_factor="10ms"
--resources="cpus:2;gpus:0;mem:1024;disk:1024;ports:[31000-32000]" --revocable_cpu_low_priority="true"
--runtime_dir="/tmp/Endpoint_SlaveEndpointTest_UnauthorizedRequest_2_giaJeW" --sandbox_directory="/mnt/mesos/sandbox"
--strict="true" --switch_user="true" --systemd_enable_support="true" --systemd_runtime_directory="/run/systemd/system"
--version="false" --work_dir="/tmp/Endpoint_SlaveEndpointTest_UnauthorizedRequest_2_JEbgUj"
I0711 21:59:00.606292  6327 credentials.hpp:86] Loading credential for authentication from
'/tmp/Endpoint_SlaveEndpointTest_UnauthorizedRequest_2_giaJeW/credential'
I0711 21:59:00.606559  6327 slave.cpp:283] Agent using credential for: test-principal
I0711 21:59:00.606582  6327 credentials.hpp:37] Loading credentials for authentication from
'/tmp/Endpoint_SlaveEndpointTest_UnauthorizedRequest_2_giaJeW/http_credentials'
I0711 21:59:00.606886  6327 http.cpp:1009] Creating default 'basic' HTTP authenticator for
realm 'mesos-agent-readonly'
I0711 21:59:00.607095  6327 http.cpp:1009] Creating default 'basic' HTTP authenticator for
realm 'mesos-agent-readwrite'
I0711 21:59:00.608629  6327 slave.cpp:565] Agent resources: [{"name":"cpus","scalar":{"value":2.0},"type":"SCALAR"},{"name":"mem","scalar":{"value":1024.0},"type":"SCALAR"},{"name":"disk","scalar":{"value":1024.0},"type":"SCALAR"},{"name":"ports","ranges":{"range":[{"begin":31000,"end":32000}]},"type":"RANGES"}]
I0711 21:59:00.608883  6327 slave.cpp:573] Agent attributes: [  ]
I0711 21:59:00.608897  6327 slave.cpp:582] Agent hostname: d13aaed9bdc3
I0711 21:59:00.609073  6334 status_update_manager.cpp:177] Pausing sending status updates
I0711 21:59:00.610858  6340 state.cpp:64] Recovering state from '/tmp/Endpoint_SlaveEndpointTest_UnauthorizedRequest_2_JEbgUj/meta'
I0711 21:59:00.611336  6332 status_update_manager.cpp:203] Recovering status update manager
I0711 21:59:00.611533  6317 containerizer.cpp:582] Recovering containerizer
I0711 21:59:00.613306  6332 provisioner.cpp:416] Provisioner recovery complete
I0711 21:59:00.613750  6340 slave.cpp:6207] Finished recovery
I0711 21:59:00.614392  6340 slave.cpp:6389] Querying resource estimator for oversubscribable
resources
I0711 21:59:00.614720  6317 slave.cpp:6403] Received oversubscribable resources {} from the
resource estimator
I0711 21:59:00.617804  6328 process.cpp:3820] Handling HTTP event for process 'slave(787)'
with path: '/slave(787)/containers'
I0711 21:59:00.619251  6335 http.cpp:1149] HTTP GET for /slave(787)/containers from 172.17.0.11:32874
I0711 21:59:00.619355  6335 http.cpp:970] Authorizing principal 'test-principal' to GET the
'/containers' endpoint
I0711 21:59:00.621876  6330 slave.cpp:843] Agent terminating
[       OK ] Endpoint/SlaveEndpointTest.UnauthorizedRequest/2 (36 ms)
[ RUN      ] Endpoint/SlaveEndpointTest.NoAuthorizer/0
I0711 21:59:00.634210  6298 containerizer.cpp:230] Using isolation: posix/cpu,posix/mem,filesystem/posix,network/cni,environment_secret
W0711 21:59:00.634796  6298 backend.cpp:76] Failed to create 'aufs' backend: AufsBackend requires
root privileges
W0711 21:59:00.634907  6298 backend.cpp:76] Failed to create 'bind' backend: BindBackend requires
root privileges
I0711 21:59:00.634949  6298 provisioner.cpp:255] Using default backend 'copy'
I0711 21:59:00.637471  6298 cluster.cpp:448] Creating default 'local' authorizer
I0711 21:59:00.639447  6320 slave.cpp:250] Mesos agent started on (788)@172.17.0.11:44464
I0711 21:59:00.639473  6320 slave.cpp:251] Flags at startup: --acls="" --appc_simple_discovery_uri_prefix="http://"
--appc_store_dir="/tmp/Endpoint_SlaveEndpointTest_NoAuthorizer_0_HK0qQp/store/appc" --authenticate_http_readonly="true"
--authenticate_http_readwrite="true" --authenticatee="crammd5" --authentication_backoff_factor="1secs"
--authorizer="local" --cgroups_cpu_enable_pids_and_tids_count="false" --cgroups_enable_cfs="false"
--cgroups_hierarchy="/sys/fs/cgroup" --cgroups_limit_swap="false" --cgroups_root="mesos" --container_disk_watch_interval="15secs"
--containerizers="mesos" --credential="/tmp/Endpoint_SlaveEndpointTest_NoAuthorizer_0_HK0qQp/credential"
--default_role="*" --disk_watch_interval="1mins" --docker="docker" --docker_kill_orphans="true"
--docker_registry="https://registry-1.docker.io" --docker_remove_delay="6hrs" --docker_socket="/var/run/docker.sock"
--docker_stop_timeout="0ns" --docker_store_dir="/tmp/Endpoint_SlaveEndpointTest_NoAuthorizer_0_HK0qQp/store/docker"
--docker_volume_checkpoint_dir="/var/run/mesos/isolators/docker/volume" --enforce_container_disk_quota="false"
--executor_registration_timeout="1mins" --executor_reregistration_timeout="2secs" --executor_shutdown_grace_period="5secs"
--fetcher_cache_dir="/tmp/Endpoint_SlaveEndpointTest_NoAuthorizer_0_HK0qQp/fetch" --fetcher_cache_size="2GB"
--frameworks_home="" --gc_delay="1weeks" --gc_disk_headroom="0.1" --hadoop_home="" --help="false"
--hostname_lookup="true" --http_command_executor="false" --http_credentials="/tmp/Endpoint_SlaveEndpointTest_NoAuthorizer_0_HK0qQp/http_credentials"
--http_heartbeat_interval="30secs" --initialize_driver_logging="true" --isolation="posix/cpu,posix/mem"
--launcher="posix" --launcher_dir="/mesos/mesos-1.4.0/_build/src" --logbufsecs="0" --logging_level="INFO"
--max_completed_executors_per_framework="150" --oversubscribed_resources_interval="15secs"
--perf_duration="10secs" --perf_interval="1mins" --port="5051" --qos_correction_interval_min="0ns"
--quiet="false" --recover="reconnect" --recovery_timeout="15mins" --registration_backoff_factor="10ms"
--resources="cpus:2;gpus:0;mem:1024;disk:1024;ports:[31000-32000]" --revocable_cpu_low_priority="true"
--runtime_dir="/tmp/Endpoint_SlaveEndpointTest_NoAuthorizer_0_HK0qQp" --sandbox_directory="/mnt/mesos/sandbox"
--strict="true" --switch_user="true" --systemd_enable_support="true" --systemd_runtime_directory="/run/systemd/system"
--version="false" --work_dir="/tmp/Endpoint_SlaveEndpointTest_NoAuthorizer_0_jgjNqN"
I0711 21:59:00.640033  6320 credentials.hpp:86] Loading credential for authentication from
'/tmp/Endpoint_SlaveEndpointTest_NoAuthorizer_0_HK0qQp/credential'
I0711 21:59:00.640362  6320 slave.cpp:283] Agent using credential for: test-principal
I0711 21:59:00.640400  6320 credentials.hpp:37] Loading credentials for authentication from
'/tmp/Endpoint_SlaveEndpointTest_NoAuthorizer_0_HK0qQp/http_credentials'
I0711 21:59:00.640671  6320 http.cpp:1009] Creating default 'basic' HTTP authenticator for
realm 'mesos-agent-readonly'
I0711 21:59:00.640892  6320 http.cpp:1009] Creating default 'basic' HTTP authenticator for
realm 'mesos-agent-readwrite'
I0711 21:59:00.642516  6320 slave.cpp:565] Agent resources: [{"name":"cpus","scalar":{"value":2.0},"type":"SCALAR"},{"name":"mem","scalar":{"value":1024.0},"type":"SCALAR"},{"name":"disk","scalar":{"value":1024.0},"type":"SCALAR"},{"name":"ports","ranges":{"range":[{"begin":31000,"end":32000}]},"type":"RANGES"}]
I0711 21:59:00.642786  6320 slave.cpp:573] Agent attributes: [  ]
I0711 21:59:00.642802  6320 slave.cpp:582] Agent hostname: d13aaed9bdc3
I0711 21:59:00.642946  6338 status_update_manager.cpp:177] Pausing sending status updates
I0711 21:59:00.644784  6331 state.cpp:64] Recovering state from '/tmp/Endpoint_SlaveEndpointTest_NoAuthorizer_0_jgjNqN/meta'
I0711 21:59:00.645372  6324 status_update_manager.cpp:203] Recovering status update manager
I0711 21:59:00.645599  6332 containerizer.cpp:582] Recovering containerizer
I0711 21:59:00.647076  6330 provisioner.cpp:416] Provisioner recovery complete
I0711 21:59:00.647507  6336 slave.cpp:6207] Finished recovery
I0711 21:59:00.648156  6336 slave.cpp:6389] Querying resource estimator for oversubscribable
resources
I0711 21:59:00.648540  6332 slave.cpp:6403] Received oversubscribable resources {} from the
resource estimator
I0711 21:59:00.651752  6321 process.cpp:3820] Handling HTTP event for process 'slave(788)'
with path: '/slave(788)/monitor/statistics'
I0711 21:59:00.653205  6323 http.cpp:1149] HTTP GET for /slave(788)/monitor/statistics from
172.17.0.11:32876
I0711 21:59:00.653309  6323 http.cpp:970] Authorizing principal 'test-principal' to GET the
'/monitor/statistics' endpoint
I0711 21:59:00.657738  6325 slave.cpp:843] Agent terminating
[       OK ] Endpoint/SlaveEndpointTest.NoAuthorizer/0 (35 ms)
[ RUN      ] Endpoint/SlaveEndpointTest.NoAuthorizer/1
I0711 21:59:00.669911  6298 containerizer.cpp:230] Using isolation: posix/cpu,posix/mem,filesystem/posix,network/cni,environment_secret
W0711 21:59:00.670459  6298 backend.cpp:76] Failed to create 'aufs' backend: AufsBackend requires
root privileges
W0711 21:59:00.670567  6298 backend.cpp:76] Failed to create 'bind' backend: BindBackend requires
root privileges
I0711 21:59:00.670600  6298 provisioner.cpp:255] Using default backend 'copy'
I0711 21:59:00.672426  6298 cluster.cpp:448] Creating default 'local' authorizer
I0711 21:59:00.674283  6334 slave.cpp:250] Mesos agent started on (789)@172.17.0.11:44464
I0711 21:59:00.674321  6334 slave.cpp:251] Flags at startup: --acls="" --appc_simple_discovery_uri_prefix="http://"
--appc_store_dir="/tmp/Endpoint_SlaveEndpointTest_NoAuthorizer_1_CQRcNT/store/appc" --authenticate_http_readonly="true"
--authenticate_http_readwrite="true" --authenticatee="crammd5" --authentication_backoff_factor="1secs"
--authorizer="local" --cgroups_cpu_enable_pids_and_tids_count="false" --cgroups_enable_cfs="false"
--cgroups_hierarchy="/sys/fs/cgroup" --cgroups_limit_swap="false" --cgroups_root="mesos" --container_disk_watch_interval="15secs"
--containerizers="mesos" --credential="/tmp/Endpoint_SlaveEndpointTest_NoAuthorizer_1_CQRcNT/credential"
--default_role="*" --disk_watch_interval="1mins" --docker="docker" --docker_kill_orphans="true"
--docker_registry="https://registry-1.docker.io" --docker_remove_delay="6hrs" --docker_socket="/var/run/docker.sock"
--docker_stop_timeout="0ns" --docker_store_dir="/tmp/Endpoint_SlaveEndpointTest_NoAuthorizer_1_CQRcNT/store/docker"
--docker_volume_checkpoint_dir="/var/run/mesos/isolators/docker/volume" --enforce_container_disk_quota="false"
--executor_registration_timeout="1mins" --executor_reregistration_timeout="2secs" --executor_shutdown_grace_period="5secs"
--fetcher_cache_dir="/tmp/Endpoint_SlaveEndpointTest_NoAuthorizer_1_CQRcNT/fetch" --fetcher_cache_size="2GB"
--frameworks_home="" --gc_delay="1weeks" --gc_disk_headroom="0.1" --hadoop_home="" --help="false"
--hostname_lookup="true" --http_command_executor="false" --http_credentials="/tmp/Endpoint_SlaveEndpointTest_NoAuthorizer_1_CQRcNT/http_credentials"
--http_heartbeat_interval="30secs" --initialize_driver_logging="true" --isolation="posix/cpu,posix/mem"
--launcher="posix" --launcher_dir="/mesos/mesos-1.4.0/_build/src" --logbufsecs="0" --logging_level="INFO"
--max_completed_executors_per_framework="150" --oversubscribed_resources_interval="15secs"
--perf_duration="10secs" --perf_interval="1mins" --port="5051" --qos_correction_interval_min="0ns"
--quiet="false" --recover="reconnect" --recovery_timeout="15mins" --registration_backoff_factor="10ms"
--resources="cpus:2;gpus:0;mem:1024;disk:1024;ports:[31000-32000]" --revocable_cpu_low_priority="true"
--runtime_dir="/tmp/Endpoint_SlaveEndpointTest_NoAuthorizer_1_CQRcNT" --sandbox_directory="/mnt/mesos/sandbox"
--strict="true" --switch_user="true" --systemd_enable_support="true" --systemd_runtime_directory="/run/systemd/system"
--version="false" --work_dir="/tmp/Endpoint_SlaveEndpointTest_NoAuthorizer_1_8vudih"
I0711 21:59:00.674844  6334 credentials.hpp:86] Loading credential for authentication from
'/tmp/Endpoint_SlaveEndpointTest_NoAuthorizer_1_CQRcNT/credential'
I0711 21:59:00.675115  6334 slave.cpp:283] Agent using credential for: test-principal
I0711 21:59:00.675137  6334 credentials.hpp:37] Loading credentials for authentication from
'/tmp/Endpoint_SlaveEndpointTest_NoAuthorizer_1_CQRcNT/http_credentials'
I0711 21:59:00.675400  6334 http.cpp:1009] Creating default 'basic' HTTP authenticator for
realm 'mesos-agent-readonly'
I0711 21:59:00.675619  6334 http.cpp:1009] Creating default 'basic' HTTP authenticator for
realm 'mesos-agent-readwrite'
I0711 21:59:00.677319  6334 slave.cpp:565] Agent resources: [{"name":"cpus","scalar":{"value":2.0},"type":"SCALAR"},{"name":"mem","scalar":{"value":1024.0},"type":"SCALAR"},{"name":"disk","scalar":{"value":1024.0},"type":"SCALAR"},{"name":"ports","ranges":{"range":[{"begin":31000,"end":32000}]},"type":"RANGES"}]
I0711 21:59:00.677578  6334 slave.cpp:573] Agent attributes: [  ]
I0711 21:59:00.677593  6334 slave.cpp:582] Agent hostname: d13aaed9bdc3
I0711 21:59:00.677738  6323 status_update_manager.cpp:177] Pausing sending status updates
I0711 21:59:00.679520  6320 state.cpp:64] Recovering state from '/tmp/Endpoint_SlaveEndpointTest_NoAuthorizer_1_8vudih/meta'
I0711 21:59:00.679966  6322 status_update_manager.cpp:203] Recovering status update manager
I0711 21:59:00.680346  6340 containerizer.cpp:582] Recovering containerizer
I0711 21:59:00.682232  6337 provisioner.cpp:416] Provisioner recovery complete
I0711 21:59:00.682662  6328 slave.cpp:6207] Finished recovery
I0711 21:59:00.683327  6328 slave.cpp:6389] Querying resource estimator for oversubscribable
resources
I0711 21:59:00.683727  6325 slave.cpp:6403] Received oversubscribable resources {} from the
resource estimator
I0711 21:59:00.686971  6334 process.cpp:3820] Handling HTTP event for process 'slave(789)'
with path: '/slave(789)/monitor/statistics.json'
I0711 21:59:00.688477  6333 http.cpp:1149] HTTP GET for /slave(789)/monitor/statistics.json
from 172.17.0.11:32878
I0711 21:59:00.688582  6333 http.cpp:970] Authorizing principal 'test-principal' to GET the
'/monitor/statistics.json' endpoint
I0711 21:59:00.693415  6325 slave.cpp:843] Agent terminating
[       OK ] Endpoint/SlaveEndpointTest.NoAuthorizer/1 (35 ms)
[ RUN      ] Endpoint/SlaveEndpointTest.NoAuthorizer/2
I0711 21:59:00.707473  6298 containerizer.cpp:230] Using isolation: posix/cpu,posix/mem,filesystem/posix,network/cni,environment_secret
W0711 21:59:00.708175  6298 backend.cpp:76] Failed to create 'aufs' backend: AufsBackend requires
root privileges
W0711 21:59:00.708323  6298 backend.cpp:76] Failed to create 'bind' backend: BindBackend requires
root privileges
I0711 21:59:00.708371  6298 provisioner.cpp:255] Using default backend 'copy'
I0711 21:59:00.710575  6298 cluster.cpp:448] Creating default 'local' authorizer
I0711 21:59:00.712479  6340 slave.cpp:250] Mesos agent started on (790)@172.17.0.11:44464
I0711 21:59:00.712520  6340 slave.cpp:251] Flags at startup: --acls="" --appc_simple_discovery_uri_prefix="http://"
--appc_store_dir="/tmp/Endpoint_SlaveEndpointTest_NoAuthorizer_2_dO994n/store/appc" --authenticate_http_readonly="true"
--authenticate_http_readwrite="true" --authenticatee="crammd5" --authentication_backoff_factor="1secs"
--authorizer="local" --cgroups_cpu_enable_pids_and_tids_count="false" --cgroups_enable_cfs="false"
--cgroups_hierarchy="/sys/fs/cgroup" --cgroups_limit_swap="false" --cgroups_root="mesos" --container_disk_watch_interval="15secs"
--containerizers="mesos" --credential="/tmp/Endpoint_SlaveEndpointTest_NoAuthorizer_2_dO994n/credential"
--default_role="*" --disk_watch_interval="1mins" --docker="docker" --docker_kill_orphans="true"
--docker_registry="https://registry-1.docker.io" --docker_remove_delay="6hrs" --docker_socket="/var/run/docker.sock"
--docker_stop_timeout="0ns" --docker_store_dir="/tmp/Endpoint_SlaveEndpointTest_NoAuthorizer_2_dO994n/store/docker"
--docker_volume_checkpoint_dir="/var/run/mesos/isolators/docker/volume" --enforce_container_disk_quota="false"
--executor_registration_timeout="1mins" --executor_reregistration_timeout="2secs" --executor_shutdown_grace_period="5secs"
--fetcher_cache_dir="/tmp/Endpoint_SlaveEndpointTest_NoAuthorizer_2_dO994n/fetch" --fetcher_cache_size="2GB"
--frameworks_home="" --gc_delay="1weeks" --gc_disk_headroom="0.1" --hadoop_home="" --help="false"
--hostname_lookup="true" --http_command_executor="false" --http_credentials="/tmp/Endpoint_SlaveEndpointTest_NoAuthorizer_2_dO994n/http_credentials"
--http_heartbeat_interval="30secs" --initialize_driver_logging="true" --isolation="posix/cpu,posix/mem"
--launcher="posix" --launcher_dir="/mesos/mesos-1.4.0/_build/src" --logbufsecs="0" --logging_level="INFO"
--max_completed_executors_per_framework="150" --oversubscribed_resources_interval="15secs"
--perf_duration="10secs" --perf_interval="1mins" --port="5051" --qos_correction_interval_min="0ns"
--quiet="false" --recover="reconnect" --recovery_timeout="15mins" --registration_backoff_factor="10ms"
--resources="cpus:2;gpus:0;mem:1024;disk:1024;ports:[31000-32000]" --revocable_cpu_low_priority="true"
--runtime_dir="/tmp/Endpoint_SlaveEndpointTest_NoAuthorizer_2_dO994n" --sandbox_directory="/mnt/mesos/sandbox"
--strict="true" --switch_user="true" --systemd_enable_support="true" --systemd_runtime_directory="/run/systemd/system"
--version="false" --work_dir="/tmp/Endpoint_SlaveEndpointTest_NoAuthorizer_2_ORHQuL"
I0711 21:59:00.713104  6340 credentials.hpp:86] Loading credential for authentication from
'/tmp/Endpoint_SlaveEndpointTest_NoAuthorizer_2_dO994n/credential'
I0711 21:59:00.713376  6340 slave.cpp:283] Agent using credential for: test-principal
I0711 21:59:00.713397  6340 credentials.hpp:37] Loading credentials for authentication from
'/tmp/Endpoint_SlaveEndpointTest_NoAuthorizer_2_dO994n/http_credentials'
I0711 21:59:00.713706  6340 http.cpp:1009] Creating default 'basic' HTTP authenticator for
realm 'mesos-agent-readonly'
I0711 21:59:00.713917  6340 http.cpp:1009] Creating default 'basic' HTTP authenticator for
realm 'mesos-agent-readwrite'
I0711 21:59:00.715538  6340 slave.cpp:565] Agent resources: [{"name":"cpus","scalar":{"value":2.0},"type":"SCALAR"},{"name":"mem","scalar":{"value":1024.0},"type":"SCALAR"},{"name":"disk","scalar":{"value":1024.0},"type":"SCALAR"},{"name":"ports","ranges":{"range":[{"begin":31000,"end":32000}]},"type":"RANGES"}]
I0711 21:59:00.715834  6340 slave.cpp:573] Agent attributes: [  ]
I0711 21:59:00.715852  6340 slave.cpp:582] Agent hostname: d13aaed9bdc3
I0711 21:59:00.716035  6330 status_update_manager.cpp:177] Pausing sending status updates
I0711 21:59:00.717850  6339 state.cpp:64] Recovering state from '/tmp/Endpoint_SlaveEndpointTest_NoAuthorizer_2_ORHQuL/meta'
I0711 21:59:00.718472  6339 status_update_manager.cpp:203] Recovering status update manager
I0711 21:59:00.718653  6339 containerizer.cpp:582] Recovering containerizer
I0711 21:59:00.720804  6339 provisioner.cpp:416] Provisioner recovery complete
I0711 21:59:00.721376  6339 slave.cpp:6207] Finished recovery
I0711 21:59:00.721976  6339 slave.cpp:6389] Querying resource estimator for oversubscribable
resources
I0711 21:59:00.722674  6339 slave.cpp:6403] Received oversubscribable resources {} from the
resource estimator
I0711 21:59:00.725805  6335 process.cpp:3820] Handling HTTP event for process 'slave(790)'
with path: '/slave(790)/containers'
I0711 21:59:00.727263  6336 http.cpp:1149] HTTP GET for /slave(790)/containers from 172.17.0.11:32892
I0711 21:59:00.727368  6336 http.cpp:970] Authorizing principal 'test-principal' to GET the
'/containers' endpoint
I0711 21:59:00.731007  6337 slave.cpp:843] Agent terminating
[       OK ] Endpoint/SlaveEndpointTest.NoAuthorizer/2 (38 ms)
[----------] 9 tests from Endpoint/SlaveEndpointTest (328 ms total)

[----------] Global test environment tear-down
[==========] 1632 tests from 179 test cases ran. (654575 ms total)
[  PASSED  ] 1627 tests.
[  FAILED  ] 5 tests, listed below:
[  FAILED  ] CommandExecutorCheckTest.CommandCheckDeliveredAndReconciled
[  FAILED  ] DefaultExecutorCheckTest.CommandCheckDeliveredAndReconciled
[  FAILED  ] DefaultExecutorCheckTest.CommandCheckStatusChange
[  FAILED  ] DefaultExecutorCheckTest.CommandCheckSeesParentsEnv
[  FAILED  ] DefaultExecutorCheckTest.CommandCheckSharesWorkDirWithTask

 5 FAILED TESTS
  YOU HAVE 20 DISABLED TESTS

I0711 21:59:00.813880  6341 process.cpp:993] Failed to accept socket: future discarded
make[4]: *** [check-local] Error 1
make[4]: Leaving directory `/mesos/mesos-1.4.0/_build/src'
make[3]: *** [check-am] Error 2
make[3]: Leaving directory `/mesos/mesos-1.4.0/_build/src'
make[2]: *** [check] Error 2
make[2]: Leaving directory `/mesos/mesos-1.4.0/_build/src'
make[1]: *** [check-recursive] Error 1
make[1]: Leaving directory `/mesos/mesos-1.4.0/_build'
make: *** [distcheck] Error 1
+ docker rmi mesos-1499807368-18170
Untagged: mesos-1499807368-18170:latest
Deleted: sha256:1e0a68b9e7cd23096bc461910e6ed4be8f8f7fa0f8bb8f9b2dab1b8c3724adf0
Deleted: sha256:ed119b5876ee6cf25ad31e7ca54d79850129155c1ef8da7b879754f24c1cda69
Deleted: sha256:098640807d2182dfd8381922b292fc8b0c9a30ed1d9314fb5359b3534035e88a
Deleted: sha256:a5e1e917ac9978d71b8e1e8c2eaaee656830db56372ac46995dc14521f3cb66b
Deleted: sha256:3fee02d8c33999a55aeee586494040c3ddd5ca83c1a3a4e4f6597ce94b29c93d
Deleted: sha256:627c1663fcc9fa430d9966b2f948d60544cac68ff5e446bc117ba4a39e2cbc2d
Deleted: sha256:3c0934bd2d4a6e615169b632e502ff04a55689c2ef71e4954d1031a52c864bad
Deleted: sha256:8a9738fe5dbbc710002877d533cf109120ba2f1a4f086aa2307267fa8d3b210f
Deleted: sha256:bbf97752fedf822cf4d9c023cb0dda38f6051a30557193b8642a20e1f0352828
Deleted: sha256:b65f66faaec373a911f9fcbb338ffae8a1dafb04d8f9d644b7a23a57396c04aa
Deleted: sha256:797e172c33ef9108b9de4d53aecf27650920b92188ce89e2e638d0956ece4dc3
Deleted: sha256:3f92f2e3c0f9668db6ef6fb3f9bacd3201585d2be7079eda5a49b6203b1e0e13
Deleted: sha256:2d356582af412bebaaa5166fd490c58ce34566b9c818306469c237601d2b829c
Deleted: sha256:f2f431e67835ce533bd2bf8afe332569819c72d703c11f674ac7d519bd3bcb3a
Deleted: sha256:58215fdd33570343d3f5eebc2207fbe05664408c572ef7fac45eb5f46e3b48b9
Deleted: sha256:c22a9f7deab7c4dd5fdceb03b4d16e96b526e26c6dce474a376f660f5f11f966
Deleted: sha256:94084fe7c0cc0763f31e0fca59696a3408ba2efa6034330452b2c21b0dbc32cc
Deleted: sha256:fd59fb8f7cdb47fc702cc98660317136827390a192e72d7f38f9b045f55bd59b
Deleted: sha256:f1079d7ba39b5ab7f53ddaeeb272b65e53ea431a644b317e72c8e3e6d5f492ad
Deleted: sha256:0584b2ef3f4344e91ad510c4cd8289ebc00cc9ba9a67c01379f63633079b3aa7
Deleted: sha256:67a0f0186b93cb6ee65fb79d88bb446730b0641e4c03e65fb9f950802f3f38e7
Deleted: sha256:444e9ff9531f22ec2a48a58494ff616c107e4fdfcbc691cf41b3e9a79c3c8ae3
Deleted: sha256:a6d992fe9157f57b33b632816504a0593d8f30d9a6daa73d53fc41aa5e7578ed
Deleted: sha256:e7925102b8c17deb8d1eec91ad0d198e5884a3a31693b00396127835549e87d9
Deleted: sha256:8be05d381ff51136ed7ca50225c95e7ad63db769b0e7e65023fea3fc5b1077f1
Build step 'Execute shell' marked build as failure
Not sending mail to unregistered user neil.conway@gmail.com

Mime
View raw message