mesos-builds mailing list archives

Site index · List index
Message view « Date » · « Thread »
Top « Date » · « Thread »
From Apache Jenkins Server <jenk...@builds.apache.org>
Subject Build failed in Jenkins: Mesos-Buildbot » autotools,gcc,--verbose --enable-libevent --enable-ssl,GLOG_v=1 MESOS_VERBOSE=1,centos:7,(ubuntu)&&(!ubuntu-us1)&&(!ubuntu-eu2) #3891
Date Sun, 09 Jul 2017 10:09:49 GMT
See <https://builds.apache.org/job/Mesos-Buildbot/BUILDTOOL=autotools,COMPILER=gcc,CONFIGURATION=--verbose%20--enable-libevent%20--enable-ssl,ENVIRONMENT=GLOG_v=1%20MESOS_VERBOSE=1,OS=centos%3A7,label_exp=(ubuntu)&&(!ubuntu-us1)&&(!ubuntu-eu2)/3891/display/redirect>

------------------------------------------
[...truncated 30.96 MB...]
I0709 10:09:42.502862 26756 process.cpp:3810] Handling HTTP event for process 'slave(781)'
with path: '/slave(781)/containers'
I0709 10:09:42.504725 26764 http.cpp:1116] HTTP GET for /slave(781)/containers from 172.17.0.4:55445
I0709 10:09:42.504824 26764 http.cpp:937] Authorizing principal 'test-principal' to GET the
'/containers' endpoint
I0709 10:09:42.508378 26751 slave.cpp:839] Agent terminating
[       OK ] Endpoint/SlaveEndpointTest.AuthorizedRequest/2 (33 ms)
[ RUN      ] Endpoint/SlaveEndpointTest.UnauthorizedRequest/0
I0709 10:09:42.520581  8383 containerizer.cpp:230] Using isolation: posix/cpu,posix/mem,filesystem/posix,network/cni,environment_secret
W0709 10:09:42.521085  8383 backend.cpp:76] Failed to create 'aufs' backend: AufsBackend requires
root privileges
W0709 10:09:42.521196  8383 backend.cpp:76] Failed to create 'bind' backend: BindBackend requires
root privileges
I0709 10:09:42.521245  8383 provisioner.cpp:255] Using default backend 'copy'
I0709 10:09:42.525457 26759 slave.cpp:250] Mesos agent started on (782)@172.17.0.4:44207
I0709 10:09:42.525493 26759 slave.cpp:251] Flags at startup: --acls="" --appc_simple_discovery_uri_prefix="http://"
--appc_store_dir="/tmp/Endpoint_SlaveEndpointTest_UnauthorizedRequest_0_VITdXx/store/appc"
--authenticate_http_executors="true" --authenticate_http_readonly="true" --authenticate_http_readwrite="true"
--authenticatee="crammd5" --authentication_backoff_factor="1secs" --authorizer="local" --cgroups_cpu_enable_pids_and_tids_count="false"
--cgroups_enable_cfs="false" --cgroups_hierarchy="/sys/fs/cgroup" --cgroups_limit_swap="false"
--cgroups_root="mesos" --container_disk_watch_interval="15secs" --containerizers="mesos" --credential="/tmp/Endpoint_SlaveEndpointTest_UnauthorizedRequest_0_VITdXx/credential"
--default_role="*" --disk_watch_interval="1mins" --docker="docker" --docker_kill_orphans="true"
--docker_registry="https://registry-1.docker.io" --docker_remove_delay="6hrs" --docker_socket="/var/run/docker.sock"
--docker_stop_timeout="0ns" --docker_store_dir="/tmp/Endpoint_SlaveEndpointTest_UnauthorizedRequest_0_VITdXx/store/docker"
--docker_volume_checkpoint_dir="/var/run/mesos/isolators/docker/volume" --enforce_container_disk_quota="false"
--executor_registration_timeout="1mins" --executor_reregistration_timeout="2secs" --executor_secret_key="/tmp/Endpoint_SlaveEndpointTest_UnauthorizedRequest_0_VITdXx/executor_secret_key"
--executor_shutdown_grace_period="5secs" --fetcher_cache_dir="/tmp/Endpoint_SlaveEndpointTest_UnauthorizedRequest_0_VITdXx/fetch"
--fetcher_cache_size="2GB" --frameworks_home="" --gc_delay="1weeks" --gc_disk_headroom="0.1"
--hadoop_home="" --help="false" --hostname_lookup="true" --http_command_executor="false" --http_credentials="/tmp/Endpoint_SlaveEndpointTest_UnauthorizedRequest_0_VITdXx/http_credentials"
--http_heartbeat_interval="30secs" --initialize_driver_logging="true" --isolation="posix/cpu,posix/mem"
--launcher="posix" --launcher_dir="/mesos/mesos-1.4.0/_build/src" --logbufsecs="0" --logging_level="INFO"
--max_completed_executors_per_framework="150" --oversubscribed_resources_interval="15secs"
--perf_duration="10secs" --perf_interval="1mins" --port="5051" --qos_correction_interval_min="0ns"
--quiet="false" --recover="reconnect" --recovery_timeout="15mins" --registration_backoff_factor="10ms"
--resources="cpus:2;gpus:0;mem:1024;disk:1024;ports:[31000-32000]" --revocable_cpu_low_priority="true"
--runtime_dir="/tmp/Endpoint_SlaveEndpointTest_UnauthorizedRequest_0_VITdXx" --sandbox_directory="/mnt/mesos/sandbox"
--strict="true" --switch_user="true" --systemd_enable_support="true" --systemd_runtime_directory="/run/systemd/system"
--version="false" --work_dir="/tmp/Endpoint_SlaveEndpointTest_UnauthorizedRequest_0_cCmoYy"
I0709 10:09:42.526322 26759 credentials.hpp:86] Loading credential for authentication from
'/tmp/Endpoint_SlaveEndpointTest_UnauthorizedRequest_0_VITdXx/credential'
I0709 10:09:42.526559 26759 slave.cpp:283] Agent using credential for: test-principal
I0709 10:09:42.526593 26759 credentials.hpp:37] Loading credentials for authentication from
'/tmp/Endpoint_SlaveEndpointTest_UnauthorizedRequest_0_VITdXx/http_credentials'
I0709 10:09:42.527089 26759 http.cpp:976] Creating default 'basic' HTTP authenticator for
realm 'mesos-agent-executor'
I0709 10:09:42.527245 26759 http.cpp:997] Creating default 'jwt' HTTP authenticator for realm
'mesos-agent-executor'
I0709 10:09:42.527592 26759 http.cpp:976] Creating default 'basic' HTTP authenticator for
realm 'mesos-agent-readonly'
I0709 10:09:42.527742 26759 http.cpp:997] Creating default 'jwt' HTTP authenticator for realm
'mesos-agent-readonly'
I0709 10:09:42.528029 26759 http.cpp:976] Creating default 'basic' HTTP authenticator for
realm 'mesos-agent-readwrite'
I0709 10:09:42.528162 26759 http.cpp:997] Creating default 'jwt' HTTP authenticator for realm
'mesos-agent-readwrite'
I0709 10:09:42.530117 26759 slave.cpp:565] Agent resources: [{"name":"cpus","scalar":{"value":2.0},"type":"SCALAR"},{"name":"mem","scalar":{"value":1024.0},"type":"SCALAR"},{"name":"disk","scalar":{"value":1024.0},"type":"SCALAR"},{"name":"ports","ranges":{"range":[{"begin":31000,"end":32000}]},"type":"RANGES"}]
I0709 10:09:42.530397 26759 slave.cpp:573] Agent attributes: [  ]
I0709 10:09:42.530414 26759 slave.cpp:578] Agent hostname: 1076bb08e3f4
I0709 10:09:42.530593 26764 status_update_manager.cpp:177] Pausing sending status updates
I0709 10:09:42.532322 26750 state.cpp:64] Recovering state from '/tmp/Endpoint_SlaveEndpointTest_UnauthorizedRequest_0_cCmoYy/meta'
I0709 10:09:42.532671 26763 status_update_manager.cpp:203] Recovering status update manager
I0709 10:09:42.532920 26760 containerizer.cpp:582] Recovering containerizer
I0709 10:09:42.534942 26765 provisioner.cpp:416] Provisioner recovery complete
I0709 10:09:42.535461 26763 slave.cpp:6203] Finished recovery
I0709 10:09:42.535966 26763 slave.cpp:6385] Querying resource estimator for oversubscribable
resources
I0709 10:09:42.536295 26765 slave.cpp:6399] Received oversubscribable resources {} from the
resource estimator
I0709 10:09:42.539539 26762 process.cpp:3810] Handling HTTP event for process 'slave(782)'
with path: '/slave(782)/monitor/statistics'
I0709 10:09:42.541977 26758 http.cpp:1116] HTTP GET for /slave(782)/monitor/statistics from
172.17.0.4:55446
I0709 10:09:42.542062 26758 http.cpp:937] Authorizing principal 'test-principal' to GET the
'/monitor/statistics' endpoint
I0709 10:09:42.544597 26752 slave.cpp:839] Agent terminating
[       OK ] Endpoint/SlaveEndpointTest.UnauthorizedRequest/0 (35 ms)
[ RUN      ] Endpoint/SlaveEndpointTest.UnauthorizedRequest/1
I0709 10:09:42.556895  8383 containerizer.cpp:230] Using isolation: posix/cpu,posix/mem,filesystem/posix,network/cni,environment_secret
W0709 10:09:42.557605  8383 backend.cpp:76] Failed to create 'aufs' backend: AufsBackend requires
root privileges
W0709 10:09:42.557732  8383 backend.cpp:76] Failed to create 'bind' backend: BindBackend requires
root privileges
I0709 10:09:42.557776  8383 provisioner.cpp:255] Using default backend 'copy'
I0709 10:09:42.562041 26758 slave.cpp:250] Mesos agent started on (783)@172.17.0.4:44207
I0709 10:09:42.562067 26758 slave.cpp:251] Flags at startup: --acls="" --appc_simple_discovery_uri_prefix="http://"
--appc_store_dir="/tmp/Endpoint_SlaveEndpointTest_UnauthorizedRequest_1_hLgmcu/store/appc"
--authenticate_http_executors="true" --authenticate_http_readonly="true" --authenticate_http_readwrite="true"
--authenticatee="crammd5" --authentication_backoff_factor="1secs" --authorizer="local" --cgroups_cpu_enable_pids_and_tids_count="false"
--cgroups_enable_cfs="false" --cgroups_hierarchy="/sys/fs/cgroup" --cgroups_limit_swap="false"
--cgroups_root="mesos" --container_disk_watch_interval="15secs" --containerizers="mesos" --credential="/tmp/Endpoint_SlaveEndpointTest_UnauthorizedRequest_1_hLgmcu/credential"
--default_role="*" --disk_watch_interval="1mins" --docker="docker" --docker_kill_orphans="true"
--docker_registry="https://registry-1.docker.io" --docker_remove_delay="6hrs" --docker_socket="/var/run/docker.sock"
--docker_stop_timeout="0ns" --docker_store_dir="/tmp/Endpoint_SlaveEndpointTest_UnauthorizedRequest_1_hLgmcu/store/docker"
--docker_volume_checkpoint_dir="/var/run/mesos/isolators/docker/volume" --enforce_container_disk_quota="false"
--executor_registration_timeout="1mins" --executor_reregistration_timeout="2secs" --executor_secret_key="/tmp/Endpoint_SlaveEndpointTest_UnauthorizedRequest_1_hLgmcu/executor_secret_key"
--executor_shutdown_grace_period="5secs" --fetcher_cache_dir="/tmp/Endpoint_SlaveEndpointTest_UnauthorizedRequest_1_hLgmcu/fetch"
--fetcher_cache_size="2GB" --frameworks_home="" --gc_delay="1weeks" --gc_disk_headroom="0.1"
--hadoop_home="" --help="false" --hostname_lookup="true" --http_command_executor="false" --http_credentials="/tmp/Endpoint_SlaveEndpointTest_UnauthorizedRequest_1_hLgmcu/http_credentials"
--http_heartbeat_interval="30secs" --initialize_driver_logging="true" --isolation="posix/cpu,posix/mem"
--launcher="posix" --launcher_dir="/mesos/mesos-1.4.0/_build/src" --logbufsecs="0" --logging_level="INFO"
--max_completed_executors_per_framework="150" --oversubscribed_resources_interval="15secs"
--perf_duration="10secs" --perf_interval="1mins" --port="5051" --qos_correction_interval_min="0ns"
--quiet="false" --recover="reconnect" --recovery_timeout="15mins" --registration_backoff_factor="10ms"
--resources="cpus:2;gpus:0;mem:1024;disk:1024;ports:[31000-32000]" --revocable_cpu_low_priority="true"
--runtime_dir="/tmp/Endpoint_SlaveEndpointTest_UnauthorizedRequest_1_hLgmcu" --sandbox_directory="/mnt/mesos/sandbox"
--strict="true" --switch_user="true" --systemd_enable_support="true" --systemd_runtime_directory="/run/systemd/system"
--version="false" --work_dir="/tmp/Endpoint_SlaveEndpointTest_UnauthorizedRequest_1_a0fM7u"
I0709 10:09:42.562501 26758 credentials.hpp:86] Loading credential for authentication from
'/tmp/Endpoint_SlaveEndpointTest_UnauthorizedRequest_1_hLgmcu/credential'
I0709 10:09:42.562690 26758 slave.cpp:283] Agent using credential for: test-principal
I0709 10:09:42.562713 26758 credentials.hpp:37] Loading credentials for authentication from
'/tmp/Endpoint_SlaveEndpointTest_UnauthorizedRequest_1_hLgmcu/http_credentials'
I0709 10:09:42.563014 26758 http.cpp:976] Creating default 'basic' HTTP authenticator for
realm 'mesos-agent-executor'
I0709 10:09:42.563151 26758 http.cpp:997] Creating default 'jwt' HTTP authenticator for realm
'mesos-agent-executor'
I0709 10:09:42.563385 26758 http.cpp:976] Creating default 'basic' HTTP authenticator for
realm 'mesos-agent-readonly'
I0709 10:09:42.563482 26758 http.cpp:997] Creating default 'jwt' HTTP authenticator for realm
'mesos-agent-readonly'
I0709 10:09:42.563661 26758 http.cpp:976] Creating default 'basic' HTTP authenticator for
realm 'mesos-agent-readwrite'
I0709 10:09:42.563755 26758 http.cpp:997] Creating default 'jwt' HTTP authenticator for realm
'mesos-agent-readwrite'
I0709 10:09:42.565187 26758 slave.cpp:565] Agent resources: [{"name":"cpus","scalar":{"value":2.0},"type":"SCALAR"},{"name":"mem","scalar":{"value":1024.0},"type":"SCALAR"},{"name":"disk","scalar":{"value":1024.0},"type":"SCALAR"},{"name":"ports","ranges":{"range":[{"begin":31000,"end":32000}]},"type":"RANGES"}]
I0709 10:09:42.565423 26758 slave.cpp:573] Agent attributes: [  ]
I0709 10:09:42.565438 26758 slave.cpp:578] Agent hostname: 1076bb08e3f4
I0709 10:09:42.565706 26760 status_update_manager.cpp:177] Pausing sending status updates
I0709 10:09:42.567342 26756 state.cpp:64] Recovering state from '/tmp/Endpoint_SlaveEndpointTest_UnauthorizedRequest_1_a0fM7u/meta'
I0709 10:09:42.567728 26751 status_update_manager.cpp:203] Recovering status update manager
I0709 10:09:42.567940 26757 containerizer.cpp:582] Recovering containerizer
I0709 10:09:42.569625 26751 provisioner.cpp:416] Provisioner recovery complete
I0709 10:09:42.569996 26754 slave.cpp:6203] Finished recovery
I0709 10:09:42.570583 26754 slave.cpp:6385] Querying resource estimator for oversubscribable
resources
I0709 10:09:42.570931 26759 slave.cpp:6399] Received oversubscribable resources {} from the
resource estimator
I0709 10:09:42.573365 26758 process.cpp:3810] Handling HTTP event for process 'slave(783)'
with path: '/slave(783)/monitor/statistics.json'
I0709 10:09:42.575386 26764 http.cpp:1116] HTTP GET for /slave(783)/monitor/statistics.json
from 172.17.0.4:55447
I0709 10:09:42.575497 26764 http.cpp:937] Authorizing principal 'test-principal' to GET the
'/monitor/statistics.json' endpoint
I0709 10:09:42.577533 26761 slave.cpp:839] Agent terminating
[       OK ] Endpoint/SlaveEndpointTest.UnauthorizedRequest/1 (34 ms)
[ RUN      ] Endpoint/SlaveEndpointTest.UnauthorizedRequest/2
I0709 10:09:42.592973  8383 containerizer.cpp:230] Using isolation: posix/cpu,posix/mem,filesystem/posix,network/cni,environment_secret
W0709 10:09:42.593549  8383 backend.cpp:76] Failed to create 'aufs' backend: AufsBackend requires
root privileges
W0709 10:09:42.593669  8383 backend.cpp:76] Failed to create 'bind' backend: BindBackend requires
root privileges
I0709 10:09:42.593721  8383 provisioner.cpp:255] Using default backend 'copy'
I0709 10:09:42.597455 26752 slave.cpp:250] Mesos agent started on (784)@172.17.0.4:44207
I0709 10:09:42.597477 26752 slave.cpp:251] Flags at startup: --acls="" --appc_simple_discovery_uri_prefix="http://"
--appc_store_dir="/tmp/Endpoint_SlaveEndpointTest_UnauthorizedRequest_2_36BYOq/store/appc"
--authenticate_http_executors="true" --authenticate_http_readonly="true" --authenticate_http_readwrite="true"
--authenticatee="crammd5" --authentication_backoff_factor="1secs" --authorizer="local" --cgroups_cpu_enable_pids_and_tids_count="false"
--cgroups_enable_cfs="false" --cgroups_hierarchy="/sys/fs/cgroup" --cgroups_limit_swap="false"
--cgroups_root="mesos" --container_disk_watch_interval="15secs" --containerizers="mesos" --credential="/tmp/Endpoint_SlaveEndpointTest_UnauthorizedRequest_2_36BYOq/credential"
--default_role="*" --disk_watch_interval="1mins" --docker="docker" --docker_kill_orphans="true"
--docker_registry="https://registry-1.docker.io" --docker_remove_delay="6hrs" --docker_socket="/var/run/docker.sock"
--docker_stop_timeout="0ns" --docker_store_dir="/tmp/Endpoint_SlaveEndpointTest_UnauthorizedRequest_2_36BYOq/store/docker"
--docker_volume_checkpoint_dir="/var/run/mesos/isolators/docker/volume" --enforce_container_disk_quota="false"
--executor_registration_timeout="1mins" --executor_reregistration_timeout="2secs" --executor_secret_key="/tmp/Endpoint_SlaveEndpointTest_UnauthorizedRequest_2_36BYOq/executor_secret_key"
--executor_shutdown_grace_period="5secs" --fetcher_cache_dir="/tmp/Endpoint_SlaveEndpointTest_UnauthorizedRequest_2_36BYOq/fetch"
--fetcher_cache_size="2GB" --frameworks_home="" --gc_delay="1weeks" --gc_disk_headroom="0.1"
--hadoop_home="" --help="false" --hostname_lookup="true" --http_command_executor="false" --http_credentials="/tmp/Endpoint_SlaveEndpointTest_UnauthorizedRequest_2_36BYOq/http_credentials"
--http_heartbeat_interval="30secs" --initialize_driver_logging="true" --isolation="posix/cpu,posix/mem"
--launcher="posix" --launcher_dir="/mesos/mesos-1.4.0/_build/src" --logbufsecs="0" --logging_level="INFO"
--max_completed_executors_per_framework="150" --oversubscribed_resources_interval="15secs"
--perf_duration="10secs" --perf_interval="1mins" --port="5051" --qos_correction_interval_min="0ns"
--quiet="false" --recover="reconnect" --recovery_timeout="15mins" --registration_backoff_factor="10ms"
--resources="cpus:2;gpus:0;mem:1024;disk:1024;ports:[31000-32000]" --revocable_cpu_low_priority="true"
--runtime_dir="/tmp/Endpoint_SlaveEndpointTest_UnauthorizedRequest_2_36BYOq" --sandbox_directory="/mnt/mesos/sandbox"
--strict="true" --switch_user="true" --systemd_enable_support="true" --systemd_runtime_directory="/run/systemd/system"
--version="false" --work_dir="/tmp/Endpoint_SlaveEndpointTest_UnauthorizedRequest_2_wF7pEr"
I0709 10:09:42.598079 26752 credentials.hpp:86] Loading credential for authentication from
'/tmp/Endpoint_SlaveEndpointTest_UnauthorizedRequest_2_36BYOq/credential'
I0709 10:09:42.598315 26752 slave.cpp:283] Agent using credential for: test-principal
I0709 10:09:42.598336 26752 credentials.hpp:37] Loading credentials for authentication from
'/tmp/Endpoint_SlaveEndpointTest_UnauthorizedRequest_2_36BYOq/http_credentials'
I0709 10:09:42.598678 26752 http.cpp:976] Creating default 'basic' HTTP authenticator for
realm 'mesos-agent-executor'
I0709 10:09:42.598871 26752 http.cpp:997] Creating default 'jwt' HTTP authenticator for realm
'mesos-agent-executor'
I0709 10:09:42.599056 26752 http.cpp:976] Creating default 'basic' HTTP authenticator for
realm 'mesos-agent-readonly'
I0709 10:09:42.599195 26752 http.cpp:997] Creating default 'jwt' HTTP authenticator for realm
'mesos-agent-readonly'
I0709 10:09:42.599387 26752 http.cpp:976] Creating default 'basic' HTTP authenticator for
realm 'mesos-agent-readwrite'
I0709 10:09:42.599498 26752 http.cpp:997] Creating default 'jwt' HTTP authenticator for realm
'mesos-agent-readwrite'
I0709 10:09:42.601006 26752 slave.cpp:565] Agent resources: [{"name":"cpus","scalar":{"value":2.0},"type":"SCALAR"},{"name":"mem","scalar":{"value":1024.0},"type":"SCALAR"},{"name":"disk","scalar":{"value":1024.0},"type":"SCALAR"},{"name":"ports","ranges":{"range":[{"begin":31000,"end":32000}]},"type":"RANGES"}]
I0709 10:09:42.601233 26752 slave.cpp:573] Agent attributes: [  ]
I0709 10:09:42.601248 26752 slave.cpp:578] Agent hostname: 1076bb08e3f4
I0709 10:09:42.601537 26753 status_update_manager.cpp:177] Pausing sending status updates
I0709 10:09:42.603199 26763 state.cpp:64] Recovering state from '/tmp/Endpoint_SlaveEndpointTest_UnauthorizedRequest_2_wF7pEr/meta'
I0709 10:09:42.603618 26762 status_update_manager.cpp:203] Recovering status update manager
I0709 10:09:42.603935 26750 containerizer.cpp:582] Recovering containerizer
I0709 10:09:42.605445 26765 provisioner.cpp:416] Provisioner recovery complete
I0709 10:09:42.605860 26753 slave.cpp:6203] Finished recovery
I0709 10:09:42.606652 26753 slave.cpp:6385] Querying resource estimator for oversubscribable
resources
I0709 10:09:42.607177 26753 slave.cpp:6399] Received oversubscribable resources {} from the
resource estimator
I0709 10:09:42.609906 26761 process.cpp:3810] Handling HTTP event for process 'slave(784)'
with path: '/slave(784)/containers'
I0709 10:09:42.611955 26756 http.cpp:1116] HTTP GET for /slave(784)/containers from 172.17.0.4:55448
I0709 10:09:42.612234 26756 http.cpp:937] Authorizing principal 'test-principal' to GET the
'/containers' endpoint
I0709 10:09:42.615875  8383 slave.cpp:839] Agent terminating
[       OK ] Endpoint/SlaveEndpointTest.UnauthorizedRequest/2 (37 ms)
[ RUN      ] Endpoint/SlaveEndpointTest.NoAuthorizer/0
I0709 10:09:42.629777  8383 containerizer.cpp:230] Using isolation: posix/cpu,posix/mem,filesystem/posix,network/cni,environment_secret
W0709 10:09:42.630244  8383 backend.cpp:76] Failed to create 'aufs' backend: AufsBackend requires
root privileges
W0709 10:09:42.630347  8383 backend.cpp:76] Failed to create 'bind' backend: BindBackend requires
root privileges
I0709 10:09:42.630381  8383 provisioner.cpp:255] Using default backend 'copy'
I0709 10:09:42.632361  8383 cluster.cpp:448] Creating default 'local' authorizer
I0709 10:09:42.633958 26764 slave.cpp:250] Mesos agent started on (785)@172.17.0.4:44207
I0709 10:09:42.633981 26764 slave.cpp:251] Flags at startup: --acls="" --appc_simple_discovery_uri_prefix="http://"
--appc_store_dir="/tmp/Endpoint_SlaveEndpointTest_NoAuthorizer_0_vAbxPn/store/appc" --authenticate_http_executors="true"
--authenticate_http_readonly="true" --authenticate_http_readwrite="true" --authenticatee="crammd5"
--authentication_backoff_factor="1secs" --authorizer="local" --cgroups_cpu_enable_pids_and_tids_count="false"
--cgroups_enable_cfs="false" --cgroups_hierarchy="/sys/fs/cgroup" --cgroups_limit_swap="false"
--cgroups_root="mesos" --container_disk_watch_interval="15secs" --containerizers="mesos" --credential="/tmp/Endpoint_SlaveEndpointTest_NoAuthorizer_0_vAbxPn/credential"
--default_role="*" --disk_watch_interval="1mins" --docker="docker" --docker_kill_orphans="true"
--docker_registry="https://registry-1.docker.io" --docker_remove_delay="6hrs" --docker_socket="/var/run/docker.sock"
--docker_stop_timeout="0ns" --docker_store_dir="/tmp/Endpoint_SlaveEndpointTest_NoAuthorizer_0_vAbxPn/store/docker"
--docker_volume_checkpoint_dir="/var/run/mesos/isolators/docker/volume" --enforce_container_disk_quota="false"
--executor_registration_timeout="1mins" --executor_reregistration_timeout="2secs" --executor_secret_key="/tmp/Endpoint_SlaveEndpointTest_NoAuthorizer_0_vAbxPn/executor_secret_key"
--executor_shutdown_grace_period="5secs" --fetcher_cache_dir="/tmp/Endpoint_SlaveEndpointTest_NoAuthorizer_0_vAbxPn/fetch"
--fetcher_cache_size="2GB" --frameworks_home="" --gc_delay="1weeks" --gc_disk_headroom="0.1"
--hadoop_home="" --help="false" --hostname_lookup="true" --http_command_executor="false" --http_credentials="/tmp/Endpoint_SlaveEndpointTest_NoAuthorizer_0_vAbxPn/http_credentials"
--http_heartbeat_interval="30secs" --initialize_driver_logging="true" --isolation="posix/cpu,posix/mem"
--launcher="posix" --launcher_dir="/mesos/mesos-1.4.0/_build/src" --logbufsecs="0" --logging_level="INFO"
--max_completed_executors_per_framework="150" --oversubscribed_resources_interval="15secs"
--perf_duration="10secs" --perf_interval="1mins" --port="5051" --qos_correction_interval_min="0ns"
--quiet="false" --recover="reconnect" --recovery_timeout="15mins" --registration_backoff_factor="10ms"
--resources="cpus:2;gpus:0;mem:1024;disk:1024;ports:[31000-32000]" --revocable_cpu_low_priority="true"
--runtime_dir="/tmp/Endpoint_SlaveEndpointTest_NoAuthorizer_0_vAbxPn" --sandbox_directory="/mnt/mesos/sandbox"
--strict="true" --switch_user="true" --systemd_enable_support="true" --systemd_runtime_directory="/run/systemd/system"
--version="false" --work_dir="/tmp/Endpoint_SlaveEndpointTest_NoAuthorizer_0_YdTXyo"
I0709 10:09:42.634399 26764 credentials.hpp:86] Loading credential for authentication from
'/tmp/Endpoint_SlaveEndpointTest_NoAuthorizer_0_vAbxPn/credential'
I0709 10:09:42.634554 26764 slave.cpp:283] Agent using credential for: test-principal
I0709 10:09:42.634574 26764 credentials.hpp:37] Loading credentials for authentication from
'/tmp/Endpoint_SlaveEndpointTest_NoAuthorizer_0_vAbxPn/http_credentials'
I0709 10:09:42.634845 26764 http.cpp:976] Creating default 'basic' HTTP authenticator for
realm 'mesos-agent-executor'
I0709 10:09:42.634956 26764 http.cpp:997] Creating default 'jwt' HTTP authenticator for realm
'mesos-agent-executor'
I0709 10:09:42.635174 26764 http.cpp:976] Creating default 'basic' HTTP authenticator for
realm 'mesos-agent-readonly'
I0709 10:09:42.635303 26764 http.cpp:997] Creating default 'jwt' HTTP authenticator for realm
'mesos-agent-readonly'
I0709 10:09:42.635483 26764 http.cpp:976] Creating default 'basic' HTTP authenticator for
realm 'mesos-agent-readwrite'
I0709 10:09:42.635566 26764 http.cpp:997] Creating default 'jwt' HTTP authenticator for realm
'mesos-agent-readwrite'
I0709 10:09:42.636934 26764 slave.cpp:565] Agent resources: [{"name":"cpus","scalar":{"value":2.0},"type":"SCALAR"},{"name":"mem","scalar":{"value":1024.0},"type":"SCALAR"},{"name":"disk","scalar":{"value":1024.0},"type":"SCALAR"},{"name":"ports","ranges":{"range":[{"begin":31000,"end":32000}]},"type":"RANGES"}]
I0709 10:09:42.637148 26764 slave.cpp:573] Agent attributes: [  ]
I0709 10:09:42.637162 26764 slave.cpp:578] Agent hostname: 1076bb08e3f4
I0709 10:09:42.637291 26756 status_update_manager.cpp:177] Pausing sending status updates
I0709 10:09:42.639063 26762 state.cpp:64] Recovering state from '/tmp/Endpoint_SlaveEndpointTest_NoAuthorizer_0_YdTXyo/meta'
I0709 10:09:42.639637 26763 status_update_manager.cpp:203] Recovering status update manager
I0709 10:09:42.639863 26764 containerizer.cpp:582] Recovering containerizer
I0709 10:09:42.641789 26759 provisioner.cpp:416] Provisioner recovery complete
I0709 10:09:42.642304 26758 slave.cpp:6203] Finished recovery
I0709 10:09:42.642984 26758 slave.cpp:6385] Querying resource estimator for oversubscribable
resources
I0709 10:09:42.643303 26753 slave.cpp:6399] Received oversubscribable resources {} from the
resource estimator
I0709 10:09:42.646023 26759 process.cpp:3810] Handling HTTP event for process 'slave(785)'
with path: '/slave(785)/monitor/statistics'
I0709 10:09:42.648236 26753 http.cpp:1116] HTTP GET for /slave(785)/monitor/statistics from
172.17.0.4:55453
I0709 10:09:42.648351 26753 http.cpp:937] Authorizing principal 'test-principal' to GET the
'/monitor/statistics' endpoint
I0709 10:09:42.652086 26750 slave.cpp:839] Agent terminating
[       OK ] Endpoint/SlaveEndpointTest.NoAuthorizer/0 (33 ms)
[ RUN      ] Endpoint/SlaveEndpointTest.NoAuthorizer/1
I0709 10:09:42.663043  8383 containerizer.cpp:230] Using isolation: posix/cpu,posix/mem,filesystem/posix,network/cni,environment_secret
W0709 10:09:42.663496  8383 backend.cpp:76] Failed to create 'aufs' backend: AufsBackend requires
root privileges
W0709 10:09:42.663620  8383 backend.cpp:76] Failed to create 'bind' backend: BindBackend requires
root privileges
I0709 10:09:42.663669  8383 provisioner.cpp:255] Using default backend 'copy'
I0709 10:09:42.665292  8383 cluster.cpp:448] Creating default 'local' authorizer
I0709 10:09:42.666977 26751 slave.cpp:250] Mesos agent started on (786)@172.17.0.4:44207
I0709 10:09:42.667001 26751 slave.cpp:251] Flags at startup: --acls="" --appc_simple_discovery_uri_prefix="http://"
--appc_store_dir="/tmp/Endpoint_SlaveEndpointTest_NoAuthorizer_1_fYbhcl/store/appc" --authenticate_http_executors="true"
--authenticate_http_readonly="true" --authenticate_http_readwrite="true" --authenticatee="crammd5"
--authentication_backoff_factor="1secs" --authorizer="local" --cgroups_cpu_enable_pids_and_tids_count="false"
--cgroups_enable_cfs="false" --cgroups_hierarchy="/sys/fs/cgroup" --cgroups_limit_swap="false"
--cgroups_root="mesos" --container_disk_watch_interval="15secs" --containerizers="mesos" --credential="/tmp/Endpoint_SlaveEndpointTest_NoAuthorizer_1_fYbhcl/credential"
--default_role="*" --disk_watch_interval="1mins" --docker="docker" --docker_kill_orphans="true"
--docker_registry="https://registry-1.docker.io" --docker_remove_delay="6hrs" --docker_socket="/var/run/docker.sock"
--docker_stop_timeout="0ns" --docker_store_dir="/tmp/Endpoint_SlaveEndpointTest_NoAuthorizer_1_fYbhcl/store/docker"
--docker_volume_checkpoint_dir="/var/run/mesos/isolators/docker/volume" --enforce_container_disk_quota="false"
--executor_registration_timeout="1mins" --executor_reregistration_timeout="2secs" --executor_secret_key="/tmp/Endpoint_SlaveEndpointTest_NoAuthorizer_1_fYbhcl/executor_secret_key"
--executor_shutdown_grace_period="5secs" --fetcher_cache_dir="/tmp/Endpoint_SlaveEndpointTest_NoAuthorizer_1_fYbhcl/fetch"
--fetcher_cache_size="2GB" --frameworks_home="" --gc_delay="1weeks" --gc_disk_headroom="0.1"
--hadoop_home="" --help="false" --hostname_lookup="true" --http_command_executor="false" --http_credentials="/tmp/Endpoint_SlaveEndpointTest_NoAuthorizer_1_fYbhcl/http_credentials"
--http_heartbeat_interval="30secs" --initialize_driver_logging="true" --isolation="posix/cpu,posix/mem"
--launcher="posix" --launcher_dir="/mesos/mesos-1.4.0/_build/src" --logbufsecs="0" --logging_level="INFO"
--max_completed_executors_per_framework="150" --oversubscribed_resources_interval="15secs"
--perf_duration="10secs" --perf_interval="1mins" --port="5051" --qos_correction_interval_min="0ns"
--quiet="false" --recover="reconnect" --recovery_timeout="15mins" --registration_backoff_factor="10ms"
--resources="cpus:2;gpus:0;mem:1024;disk:1024;ports:[31000-32000]" --revocable_cpu_low_priority="true"
--runtime_dir="/tmp/Endpoint_SlaveEndpointTest_NoAuthorizer_1_fYbhcl" --sandbox_directory="/mnt/mesos/sandbox"
--strict="true" --switch_user="true" --systemd_enable_support="true" --systemd_runtime_directory="/run/systemd/system"
--version="false" --work_dir="/tmp/Endpoint_SlaveEndpointTest_NoAuthorizer_1_62giQl"
I0709 10:09:42.667512 26751 credentials.hpp:86] Loading credential for authentication from
'/tmp/Endpoint_SlaveEndpointTest_NoAuthorizer_1_fYbhcl/credential'
I0709 10:09:42.667670 26751 slave.cpp:283] Agent using credential for: test-principal
I0709 10:09:42.667690 26751 credentials.hpp:37] Loading credentials for authentication from
'/tmp/Endpoint_SlaveEndpointTest_NoAuthorizer_1_fYbhcl/http_credentials'
I0709 10:09:42.667951 26751 http.cpp:976] Creating default 'basic' HTTP authenticator for
realm 'mesos-agent-executor'
I0709 10:09:42.668058 26751 http.cpp:997] Creating default 'jwt' HTTP authenticator for realm
'mesos-agent-executor'
I0709 10:09:42.668226 26751 http.cpp:976] Creating default 'basic' HTTP authenticator for
realm 'mesos-agent-readonly'
I0709 10:09:42.668318 26751 http.cpp:997] Creating default 'jwt' HTTP authenticator for realm
'mesos-agent-readonly'
I0709 10:09:42.668577 26751 http.cpp:976] Creating default 'basic' HTTP authenticator for
realm 'mesos-agent-readwrite'
I0709 10:09:42.668679 26751 http.cpp:997] Creating default 'jwt' HTTP authenticator for realm
'mesos-agent-readwrite'
I0709 10:09:42.670076 26751 slave.cpp:565] Agent resources: [{"name":"cpus","scalar":{"value":2.0},"type":"SCALAR"},{"name":"mem","scalar":{"value":1024.0},"type":"SCALAR"},{"name":"disk","scalar":{"value":1024.0},"type":"SCALAR"},{"name":"ports","ranges":{"range":[{"begin":31000,"end":32000}]},"type":"RANGES"}]
I0709 10:09:42.670295 26751 slave.cpp:573] Agent attributes: [  ]
I0709 10:09:42.670310 26751 slave.cpp:578] Agent hostname: 1076bb08e3f4
I0709 10:09:42.670454 26755 status_update_manager.cpp:177] Pausing sending status updates
I0709 10:09:42.672157 26760 state.cpp:64] Recovering state from '/tmp/Endpoint_SlaveEndpointTest_NoAuthorizer_1_62giQl/meta'
I0709 10:09:42.672482 26755 status_update_manager.cpp:203] Recovering status update manager
I0709 10:09:42.672760 26758 containerizer.cpp:582] Recovering containerizer
I0709 10:09:42.674093 26760 provisioner.cpp:416] Provisioner recovery complete
I0709 10:09:42.674396 26757 slave.cpp:6203] Finished recovery
I0709 10:09:42.674908 26757 slave.cpp:6385] Querying resource estimator for oversubscribable
resources
I0709 10:09:42.675182 26760 slave.cpp:6399] Received oversubscribable resources {} from the
resource estimator
I0709 10:09:42.677392 26764 process.cpp:3810] Handling HTTP event for process 'slave(786)'
with path: '/slave(786)/monitor/statistics.json'
I0709 10:09:42.679867 26756 http.cpp:1116] HTTP GET for /slave(786)/monitor/statistics.json
from 172.17.0.4:55454
I0709 10:09:42.679976 26756 http.cpp:937] Authorizing principal 'test-principal' to GET the
'/monitor/statistics.json' endpoint
I0709 10:09:42.684845 26752 slave.cpp:839] Agent terminating
[       OK ] Endpoint/SlaveEndpointTest.NoAuthorizer/1 (34 ms)
[ RUN      ] Endpoint/SlaveEndpointTest.NoAuthorizer/2
I0709 10:09:42.699419  8383 containerizer.cpp:230] Using isolation: posix/cpu,posix/mem,filesystem/posix,network/cni,environment_secret
W0709 10:09:42.699862  8383 backend.cpp:76] Failed to create 'aufs' backend: AufsBackend requires
root privileges
W0709 10:09:42.699954  8383 backend.cpp:76] Failed to create 'bind' backend: BindBackend requires
root privileges
I0709 10:09:42.699985  8383 provisioner.cpp:255] Using default backend 'copy'
I0709 10:09:42.702924  8383 cluster.cpp:448] Creating default 'local' authorizer
I0709 10:09:42.705062 26765 slave.cpp:250] Mesos agent started on (787)@172.17.0.4:44207
I0709 10:09:42.705090 26765 slave.cpp:251] Flags at startup: --acls="" --appc_simple_discovery_uri_prefix="http://"
--appc_store_dir="/tmp/Endpoint_SlaveEndpointTest_NoAuthorizer_2_Cu3yVi/store/appc" --authenticate_http_executors="true"
--authenticate_http_readonly="true" --authenticate_http_readwrite="true" --authenticatee="crammd5"
--authentication_backoff_factor="1secs" --authorizer="local" --cgroups_cpu_enable_pids_and_tids_count="false"
--cgroups_enable_cfs="false" --cgroups_hierarchy="/sys/fs/cgroup" --cgroups_limit_swap="false"
--cgroups_root="mesos" --container_disk_watch_interval="15secs" --containerizers="mesos" --credential="/tmp/Endpoint_SlaveEndpointTest_NoAuthorizer_2_Cu3yVi/credential"
--default_role="*" --disk_watch_interval="1mins" --docker="docker" --docker_kill_orphans="true"
--docker_registry="https://registry-1.docker.io" --docker_remove_delay="6hrs" --docker_socket="/var/run/docker.sock"
--docker_stop_timeout="0ns" --docker_store_dir="/tmp/Endpoint_SlaveEndpointTest_NoAuthorizer_2_Cu3yVi/store/docker"
--docker_volume_checkpoint_dir="/var/run/mesos/isolators/docker/volume" --enforce_container_disk_quota="false"
--executor_registration_timeout="1mins" --executor_reregistration_timeout="2secs" --executor_secret_key="/tmp/Endpoint_SlaveEndpointTest_NoAuthorizer_2_Cu3yVi/executor_secret_key"
--executor_shutdown_grace_period="5secs" --fetcher_cache_dir="/tmp/Endpoint_SlaveEndpointTest_NoAuthorizer_2_Cu3yVi/fetch"
--fetcher_cache_size="2GB" --frameworks_home="" --gc_delay="1weeks" --gc_disk_headroom="0.1"
--hadoop_home="" --help="false" --hostname_lookup="true" --http_command_executor="false" --http_credentials="/tmp/Endpoint_SlaveEndpointTest_NoAuthorizer_2_Cu3yVi/http_credentials"
--http_heartbeat_interval="30secs" --initialize_driver_logging="true" --isolation="posix/cpu,posix/mem"
--launcher="posix" --launcher_dir="/mesos/mesos-1.4.0/_build/src" --logbufsecs="0" --logging_level="INFO"
--max_completed_executors_per_framework="150" --oversubscribed_resources_interval="15secs"
--perf_duration="10secs" --perf_interval="1mins" --port="5051" --qos_correction_interval_min="0ns"
--quiet="false" --recover="reconnect" --recovery_timeout="15mins" --registration_backoff_factor="10ms"
--resources="cpus:2;gpus:0;mem:1024;disk:1024;ports:[31000-32000]" --revocable_cpu_low_priority="true"
--runtime_dir="/tmp/Endpoint_SlaveEndpointTest_NoAuthorizer_2_Cu3yVi" --sandbox_directory="/mnt/mesos/sandbox"
--strict="true" --switch_user="true" --systemd_enable_support="true" --systemd_runtime_directory="/run/systemd/system"
--version="false" --work_dir="/tmp/Endpoint_SlaveEndpointTest_NoAuthorizer_2_P3xKtj"
I0709 10:09:42.705690 26765 credentials.hpp:86] Loading credential for authentication from
'/tmp/Endpoint_SlaveEndpointTest_NoAuthorizer_2_Cu3yVi/credential'
I0709 10:09:42.705919 26765 slave.cpp:283] Agent using credential for: test-principal
I0709 10:09:42.705946 26765 credentials.hpp:37] Loading credentials for authentication from
'/tmp/Endpoint_SlaveEndpointTest_NoAuthorizer_2_Cu3yVi/http_credentials'
I0709 10:09:42.706300 26765 http.cpp:976] Creating default 'basic' HTTP authenticator for
realm 'mesos-agent-executor'
I0709 10:09:42.706449 26765 http.cpp:997] Creating default 'jwt' HTTP authenticator for realm
'mesos-agent-executor'
I0709 10:09:42.706841 26765 http.cpp:976] Creating default 'basic' HTTP authenticator for
realm 'mesos-agent-readonly'
I0709 10:09:42.706995 26765 http.cpp:997] Creating default 'jwt' HTTP authenticator for realm
'mesos-agent-readonly'
I0709 10:09:42.707285 26765 http.cpp:976] Creating default 'basic' HTTP authenticator for
realm 'mesos-agent-readwrite'
I0709 10:09:42.707403 26765 http.cpp:997] Creating default 'jwt' HTTP authenticator for realm
'mesos-agent-readwrite'
I0709 10:09:42.708977 26765 slave.cpp:565] Agent resources: [{"name":"cpus","scalar":{"value":2.0},"type":"SCALAR"},{"name":"mem","scalar":{"value":1024.0},"type":"SCALAR"},{"name":"disk","scalar":{"value":1024.0},"type":"SCALAR"},{"name":"ports","ranges":{"range":[{"begin":31000,"end":32000}]},"type":"RANGES"}]
I0709 10:09:42.709231 26765 slave.cpp:573] Agent attributes: [  ]
I0709 10:09:42.709254 26765 slave.cpp:578] Agent hostname: 1076bb08e3f4
I0709 10:09:42.709429 26756 status_update_manager.cpp:177] Pausing sending status updates
I0709 10:09:42.711388 26752 state.cpp:64] Recovering state from '/tmp/Endpoint_SlaveEndpointTest_NoAuthorizer_2_P3xKtj/meta'
I0709 10:09:42.711763 26753 status_update_manager.cpp:203] Recovering status update manager
I0709 10:09:42.711989 26764 containerizer.cpp:582] Recovering containerizer
I0709 10:09:42.713874 26760 provisioner.cpp:416] Provisioner recovery complete
I0709 10:09:42.714332 26765 slave.cpp:6203] Finished recovery
I0709 10:09:42.714851 26765 slave.cpp:6385] Querying resource estimator for oversubscribable
resources
I0709 10:09:42.715093 26752 slave.cpp:6399] Received oversubscribable resources {} from the
resource estimator
I0709 10:09:42.717048 26755 process.cpp:3810] Handling HTTP event for process 'slave(787)'
with path: '/slave(787)/containers'
I0709 10:09:42.719214 26751 http.cpp:1116] HTTP GET for /slave(787)/containers from 172.17.0.4:55455
I0709 10:09:42.719290 26751 http.cpp:937] Authorizing principal 'test-principal' to GET the
'/containers' endpoint
I0709 10:09:42.723508 26762 slave.cpp:839] Agent terminating
[       OK ] Endpoint/SlaveEndpointTest.NoAuthorizer/2 (37 ms)
[----------] 9 tests from Endpoint/SlaveEndpointTest (322 ms total)

[----------] Global test environment tear-down
[==========] 1628 tests from 180 test cases ran. (635037 ms total)
[  PASSED  ] 1627 tests.
[  FAILED  ] 1 test, listed below:
[  FAILED  ] ContentType/MasterAPITest.ReserveResources/0, where GetParam() = application/x-protobuf

 1 FAILED TEST
  YOU HAVE 20 DISABLED TESTS

I0709 10:09:42.788966 26766 process.cpp:988] Failed to accept socket: future discarded
make[4]: *** [check-local] Error 1
make[4]: Leaving directory `/mesos/mesos-1.4.0/_build/src'
make[3]: *** [check-am] Error 2
make[3]: Leaving directory `/mesos/mesos-1.4.0/_build/src'
make[2]: *** [check] Error 2
make[2]: Leaving directory `/mesos/mesos-1.4.0/_build/src'
make[1]: *** [check-recursive] Error 1
make[1]: Leaving directory `/mesos/mesos-1.4.0/_build'
make: *** [distcheck] Error 1
+ docker rmi mesos-1499591828-17860
Untagged: mesos-1499591828-17860:latest
Deleted: sha256:f9b195f87dc8e93d602b946a30d9ae016e97a5c3feb6fb0c7c9b0626036c1256
Deleted: sha256:50b5b14088968b76f103c007e4589c09529a8e88093f3b128c880012ae6360fd
Deleted: sha256:977c82a3ab7a402c44fdd3fdefb86bb971b93d1978a754ec4fae1c9e1a354039
Deleted: sha256:63e7d10388543aa9e05264e9cb4fab456b579c2191e23da30cf4ba5cf24f1b76
Deleted: sha256:430a28f9b2f46a521fdb7bfb235a3f467715c336eeedde770b6a891ebd7ba907
Deleted: sha256:f0f1f812e666eef8936efa2d14f9f056b34708e0fa7239b24f8b4e1482c968f4
Deleted: sha256:5ba9332375c73e2bc08172280bc83b390ba6a7ae2e00b01e704452ae450a686d
Deleted: sha256:2dffdc9a2193c4c2cb1e9bd81d819dac24d14be1077d03e92f757c135223739a
Deleted: sha256:48e56fbc49012a5ae976f006b3cea0a9bd050ec8aa6c338dae664bc9e670e9f7
Deleted: sha256:6804ccd9113902e1d771fcaa68994dc01f11a79e5a6667e85dd8c13b23930c38
Deleted: sha256:2e148e6ca8a05762e8bd3ba8e39b11cd58ac29db1740fefad9f05427133c8978
Deleted: sha256:81f943833b3ceabec330b13eb1e821d3b660bb61e478e90d86570a094d373470
Deleted: sha256:c1ad3aadeb3dc092aabe6c36f13286b7f2edddc91bd8f720eedd1faf7f4c1d30
Deleted: sha256:12365587377c1bb7b2e9a2ddffbe12c9c606e32d6c50e61313b554311fd1476a
Deleted: sha256:a536dd1b4a8f434b683e7ab16e762c3d62192a0a8062587796813cce78aef2bb
Deleted: sha256:d976fb325b7a5d10ef0e2be141472b7b0c5b103c5e33d5f506b81f8b774798fd
Deleted: sha256:06ea6f39e4017fa5a98f1d229c4fb9fa2b4cb3e37d008680bf26c9e9e78b8fcc
Deleted: sha256:61e5820dd800cb1f24ab87793082741820dfc62f54dd2591f5ad95462fa04967
Deleted: sha256:cdf7980ff5be0f3a06ece8e9603c5aab0334e94fc429ba8825a2c83820b3fdba
Deleted: sha256:0e3ec385877d31048173eed66576ff41235962380a4decadc2449b5ac7d8feda
Deleted: sha256:c35e9ee71a7fc5e310e1c6421339324bf972836194c7c6a0f193badc1f08da42
Deleted: sha256:9f7db1aa3818c5e520b8f74dbf491fe74a8c2e444b2ea347907814d75e4b8824
Deleted: sha256:5fb91135e77c093fd563b8b777024ad29c2ac99e03bed752eb37574bd7c5f9bc
Deleted: sha256:ea63eb5592e2e5e3c4f34ba84f01bd41af925b73e91c00979782612b317eaa44
Deleted: sha256:05016ab9a05c67df36a5181a6224439eefda3d6f5ace1b339085fbd60860f749
Build step 'Execute shell' marked build as failure

Mime
View raw message