mesos-builds mailing list archives

Site index · List index
Message view « Date » · « Thread »
Top « Date » · « Thread »
From Apache Jenkins Server <jenk...@builds.apache.org>
Subject Build failed in Jenkins: Mesos-Buildbot » autotools,gcc,--verbose,GLOG_v=1 MESOS_VERBOSE=1,centos:7,(ubuntu)&&(!ubuntu-us1)&&(!ubuntu-eu2) #3951
Date Tue, 25 Jul 2017 05:10:33 GMT
See <https://builds.apache.org/job/Mesos-Buildbot/BUILDTOOL=autotools,COMPILER=gcc,CONFIGURATION=--verbose,ENVIRONMENT=GLOG_v=1%20MESOS_VERBOSE=1,OS=centos%3A7,label_exp=(ubuntu)&&(!ubuntu-us1)&&(!ubuntu-eu2)/3951/display/redirect>

------------------------------------------
[...truncated 29.90 MB...]
[ RUN      ] Endpoint/SlaveEndpointTest.AuthorizedRequest/2
I0725 05:10:27.314779  6338 containerizer.cpp:230] Using isolation: posix/cpu,posix/mem,filesystem/posix,network/cni,environment_secret
W0725 05:10:27.315238  6338 backend.cpp:76] Failed to create 'aufs' backend: AufsBackend requires
root privileges
W0725 05:10:27.315342  6338 backend.cpp:76] Failed to create 'bind' backend: BindBackend requires
root privileges
I0725 05:10:27.315382  6338 provisioner.cpp:255] Using default backend 'copy'
I0725 05:10:27.318085  6370 slave.cpp:250] Mesos agent started on (789)@172.17.0.6:35005
I0725 05:10:27.318111  6370 slave.cpp:251] Flags at startup: --acls="" --appc_simple_discovery_uri_prefix="http://"
--appc_store_dir="/tmp/Endpoint_SlaveEndpointTest_AuthorizedRequest_2_G77qpM/store/appc" --authenticate_http_readonly="true"
--authenticate_http_readwrite="true" --authenticatee="crammd5" --authentication_backoff_factor="1secs"
--authorizer="local" --cgroups_cpu_enable_pids_and_tids_count="false" --cgroups_enable_cfs="false"
--cgroups_hierarchy="/sys/fs/cgroup" --cgroups_limit_swap="false" --cgroups_root="mesos" --container_disk_watch_interval="15secs"
--containerizers="mesos" --credential="/tmp/Endpoint_SlaveEndpointTest_AuthorizedRequest_2_G77qpM/credential"
--default_role="*" --disk_watch_interval="1mins" --docker="docker" --docker_kill_orphans="true"
--docker_registry="https://registry-1.docker.io" --docker_remove_delay="6hrs" --docker_socket="/var/run/docker.sock"
--docker_stop_timeout="0ns" --docker_store_dir="/tmp/Endpoint_SlaveEndpointTest_AuthorizedRequest_2_G77qpM/store/docker"
--docker_volume_checkpoint_dir="/var/run/mesos/isolators/docker/volume" --enforce_container_disk_quota="false"
--executor_registration_timeout="1mins" --executor_reregistration_timeout="2secs" --executor_shutdown_grace_period="5secs"
--fetcher_cache_dir="/tmp/Endpoint_SlaveEndpointTest_AuthorizedRequest_2_G77qpM/fetch" --fetcher_cache_size="2GB"
--frameworks_home="" --gc_delay="1weeks" --gc_disk_headroom="0.1" --hadoop_home="" --help="false"
--hostname_lookup="true" --http_command_executor="false" --http_credentials="/tmp/Endpoint_SlaveEndpointTest_AuthorizedRequest_2_G77qpM/http_credentials"
--http_heartbeat_interval="30secs" --initialize_driver_logging="true" --isolation="posix/cpu,posix/mem"
--launcher="posix" --launcher_dir="/mesos/mesos-1.4.0/_build/src" --logbufsecs="0" --logging_level="INFO"
--max_completed_executors_per_framework="150" --oversubscribed_resources_interval="15secs"
--perf_duration="10secs" --perf_interval="1mins" --port="5051" --qos_correction_interval_min="0ns"
--quiet="false" --recover="reconnect" --recovery_timeout="15mins" --registration_backoff_factor="10ms"
--resources="cpus:2;gpus:0;mem:1024;disk:1024;ports:[31000-32000]" --revocable_cpu_low_priority="true"
--runtime_dir="/tmp/Endpoint_SlaveEndpointTest_AuthorizedRequest_2_G77qpM" --sandbox_directory="/mnt/mesos/sandbox"
--strict="true" --switch_user="true" --systemd_enable_support="true" --systemd_runtime_directory="/run/systemd/system"
--version="false" --work_dir="/tmp/Endpoint_SlaveEndpointTest_AuthorizedRequest_2_yKhVbt"
I0725 05:10:27.318621  6370 credentials.hpp:86] Loading credential for authentication from
'/tmp/Endpoint_SlaveEndpointTest_AuthorizedRequest_2_G77qpM/credential'
I0725 05:10:27.318799  6370 slave.cpp:283] Agent using credential for: test-principal
I0725 05:10:27.318828  6370 credentials.hpp:37] Loading credentials for authentication from
'/tmp/Endpoint_SlaveEndpointTest_AuthorizedRequest_2_G77qpM/http_credentials'
I0725 05:10:27.319140  6370 http.cpp:993] Creating default 'basic' HTTP authenticator for
realm 'mesos-agent-readonly'
I0725 05:10:27.319288  6370 http.cpp:993] Creating default 'basic' HTTP authenticator for
realm 'mesos-agent-readwrite'
I0725 05:10:27.320389  6370 slave.cpp:565] Agent resources: [{"name":"cpus","scalar":{"value":2.0},"type":"SCALAR"},{"name":"mem","scalar":{"value":1024.0},"type":"SCALAR"},{"name":"disk","scalar":{"value":1024.0},"type":"SCALAR"},{"name":"ports","ranges":{"range":[{"begin":31000,"end":32000}]},"type":"RANGES"}]
I0725 05:10:27.320597  6370 slave.cpp:573] Agent attributes: [  ]
I0725 05:10:27.320611  6370 slave.cpp:582] Agent hostname: 11fcfede14f7
I0725 05:10:27.320735  6360 status_update_manager.cpp:177] Pausing sending status updates
I0725 05:10:27.321868  6364 state.cpp:64] Recovering state from '/tmp/Endpoint_SlaveEndpointTest_AuthorizedRequest_2_yKhVbt/meta'
I0725 05:10:27.322118  6361 status_update_manager.cpp:203] Recovering status update manager
I0725 05:10:27.322268  6367 containerizer.cpp:582] Recovering containerizer
I0725 05:10:27.323359  6359 provisioner.cpp:416] Provisioner recovery complete
I0725 05:10:27.323626  6375 slave.cpp:6207] Finished recovery
I0725 05:10:27.323987  6375 slave.cpp:6389] Querying resource estimator for oversubscribable
resources
I0725 05:10:27.324196  6366 slave.cpp:6403] Received oversubscribable resources {} from the
resource estimator
I0725 05:10:27.326228  6376 process.cpp:3837] Handling HTTP event for process 'slave(789)'
with path: '/slave(789)/containers'
I0725 05:10:27.327191  6357 http.cpp:1133] HTTP GET for /slave(789)/containers from 172.17.0.6:36714
I0725 05:10:27.327256  6357 http.cpp:957] Authorizing principal 'test-principal' to GET the
'/containers' endpoint
I0725 05:10:27.330338  6374 slave.cpp:843] Agent terminating
[       OK ] Endpoint/SlaveEndpointTest.AuthorizedRequest/2 (23 ms)
[ RUN      ] Endpoint/SlaveEndpointTest.UnauthorizedRequest/0
I0725 05:10:27.338484  6338 containerizer.cpp:230] Using isolation: posix/cpu,posix/mem,filesystem/posix,network/cni,environment_secret
W0725 05:10:27.338930  6338 backend.cpp:76] Failed to create 'aufs' backend: AufsBackend requires
root privileges
W0725 05:10:27.339023  6338 backend.cpp:76] Failed to create 'bind' backend: BindBackend requires
root privileges
I0725 05:10:27.339061  6338 provisioner.cpp:255] Using default backend 'copy'
I0725 05:10:27.341737  6376 slave.cpp:250] Mesos agent started on (790)@172.17.0.6:35005
I0725 05:10:27.341755  6376 slave.cpp:251] Flags at startup: --acls="" --appc_simple_discovery_uri_prefix="http://"
--appc_store_dir="/tmp/Endpoint_SlaveEndpointTest_UnauthorizedRequest_0_6nRut1/store/appc"
--authenticate_http_readonly="true" --authenticate_http_readwrite="true" --authenticatee="crammd5"
--authentication_backoff_factor="1secs" --authorizer="local" --cgroups_cpu_enable_pids_and_tids_count="false"
--cgroups_enable_cfs="false" --cgroups_hierarchy="/sys/fs/cgroup" --cgroups_limit_swap="false"
--cgroups_root="mesos" --container_disk_watch_interval="15secs" --containerizers="mesos" --credential="/tmp/Endpoint_SlaveEndpointTest_UnauthorizedRequest_0_6nRut1/credential"
--default_role="*" --disk_watch_interval="1mins" --docker="docker" --docker_kill_orphans="true"
--docker_registry="https://registry-1.docker.io" --docker_remove_delay="6hrs" --docker_socket="/var/run/docker.sock"
--docker_stop_timeout="0ns" --docker_store_dir="/tmp/Endpoint_SlaveEndpointTest_UnauthorizedRequest_0_6nRut1/store/docker"
--docker_volume_checkpoint_dir="/var/run/mesos/isolators/docker/volume" --enforce_container_disk_quota="false"
--executor_registration_timeout="1mins" --executor_reregistration_timeout="2secs" --executor_shutdown_grace_period="5secs"
--fetcher_cache_dir="/tmp/Endpoint_SlaveEndpointTest_UnauthorizedRequest_0_6nRut1/fetch" --fetcher_cache_size="2GB"
--frameworks_home="" --gc_delay="1weeks" --gc_disk_headroom="0.1" --hadoop_home="" --help="false"
--hostname_lookup="true" --http_command_executor="false" --http_credentials="/tmp/Endpoint_SlaveEndpointTest_UnauthorizedRequest_0_6nRut1/http_credentials"
--http_heartbeat_interval="30secs" --initialize_driver_logging="true" --isolation="posix/cpu,posix/mem"
--launcher="posix" --launcher_dir="/mesos/mesos-1.4.0/_build/src" --logbufsecs="0" --logging_level="INFO"
--max_completed_executors_per_framework="150" --oversubscribed_resources_interval="15secs"
--perf_duration="10secs" --perf_interval="1mins" --port="5051" --qos_correction_interval_min="0ns"
--quiet="false" --recover="reconnect" --recovery_timeout="15mins" --registration_backoff_factor="10ms"
--resources="cpus:2;gpus:0;mem:1024;disk:1024;ports:[31000-32000]" --revocable_cpu_low_priority="true"
--runtime_dir="/tmp/Endpoint_SlaveEndpointTest_UnauthorizedRequest_0_6nRut1" --sandbox_directory="/mnt/mesos/sandbox"
--strict="true" --switch_user="true" --systemd_enable_support="true" --systemd_runtime_directory="/run/systemd/system"
--version="false" --work_dir="/tmp/Endpoint_SlaveEndpointTest_UnauthorizedRequest_0_83cscI"
I0725 05:10:27.342057  6376 credentials.hpp:86] Loading credential for authentication from
'/tmp/Endpoint_SlaveEndpointTest_UnauthorizedRequest_0_6nRut1/credential'
I0725 05:10:27.342182  6376 slave.cpp:283] Agent using credential for: test-principal
I0725 05:10:27.342203  6376 credentials.hpp:37] Loading credentials for authentication from
'/tmp/Endpoint_SlaveEndpointTest_UnauthorizedRequest_0_6nRut1/http_credentials'
I0725 05:10:27.342404  6376 http.cpp:993] Creating default 'basic' HTTP authenticator for
realm 'mesos-agent-readonly'
I0725 05:10:27.342519  6376 http.cpp:993] Creating default 'basic' HTTP authenticator for
realm 'mesos-agent-readwrite'
I0725 05:10:27.343612  6376 slave.cpp:565] Agent resources: [{"name":"cpus","scalar":{"value":2.0},"type":"SCALAR"},{"name":"mem","scalar":{"value":1024.0},"type":"SCALAR"},{"name":"disk","scalar":{"value":1024.0},"type":"SCALAR"},{"name":"ports","ranges":{"range":[{"begin":31000,"end":32000}]},"type":"RANGES"}]
I0725 05:10:27.343819  6376 slave.cpp:573] Agent attributes: [  ]
I0725 05:10:27.343832  6376 slave.cpp:582] Agent hostname: 11fcfede14f7
I0725 05:10:27.343927  6375 status_update_manager.cpp:177] Pausing sending status updates
I0725 05:10:27.345156  6368 state.cpp:64] Recovering state from '/tmp/Endpoint_SlaveEndpointTest_UnauthorizedRequest_0_83cscI/meta'
I0725 05:10:27.345394  6371 status_update_manager.cpp:203] Recovering status update manager
I0725 05:10:27.345546  6378 containerizer.cpp:582] Recovering containerizer
I0725 05:10:27.346602  6372 provisioner.cpp:416] Provisioner recovery complete
I0725 05:10:27.346889  6357 slave.cpp:6207] Finished recovery
I0725 05:10:27.347334  6357 slave.cpp:6389] Querying resource estimator for oversubscribable
resources
I0725 05:10:27.347556  6373 slave.cpp:6403] Received oversubscribable resources {} from the
resource estimator
I0725 05:10:27.349570  6379 process.cpp:3837] Handling HTTP event for process 'slave(790)'
with path: '/slave(790)/monitor/statistics'
I0725 05:10:27.350525  6363 http.cpp:1133] HTTP GET for /slave(790)/monitor/statistics from
172.17.0.6:36716
I0725 05:10:27.350589  6363 http.cpp:957] Authorizing principal 'test-principal' to GET the
'/monitor/statistics' endpoint
I0725 05:10:27.352214  6362 slave.cpp:843] Agent terminating
[       OK ] Endpoint/SlaveEndpointTest.UnauthorizedRequest/0 (21 ms)
[ RUN      ] Endpoint/SlaveEndpointTest.UnauthorizedRequest/1
I0725 05:10:27.360342  6338 containerizer.cpp:230] Using isolation: posix/cpu,posix/mem,filesystem/posix,network/cni,environment_secret
W0725 05:10:27.360771  6338 backend.cpp:76] Failed to create 'aufs' backend: AufsBackend requires
root privileges
W0725 05:10:27.360857  6338 backend.cpp:76] Failed to create 'bind' backend: BindBackend requires
root privileges
I0725 05:10:27.360885  6338 provisioner.cpp:255] Using default backend 'copy'
I0725 05:10:27.363484  6371 slave.cpp:250] Mesos agent started on (791)@172.17.0.6:35005
I0725 05:10:27.363509  6371 slave.cpp:251] Flags at startup: --acls="" --appc_simple_discovery_uri_prefix="http://"
--appc_store_dir="/tmp/Endpoint_SlaveEndpointTest_UnauthorizedRequest_1_yFFOKg/store/appc"
--authenticate_http_readonly="true" --authenticate_http_readwrite="true" --authenticatee="crammd5"
--authentication_backoff_factor="1secs" --authorizer="local" --cgroups_cpu_enable_pids_and_tids_count="false"
--cgroups_enable_cfs="false" --cgroups_hierarchy="/sys/fs/cgroup" --cgroups_limit_swap="false"
--cgroups_root="mesos" --container_disk_watch_interval="15secs" --containerizers="mesos" --credential="/tmp/Endpoint_SlaveEndpointTest_UnauthorizedRequest_1_yFFOKg/credential"
--default_role="*" --disk_watch_interval="1mins" --docker="docker" --docker_kill_orphans="true"
--docker_registry="https://registry-1.docker.io" --docker_remove_delay="6hrs" --docker_socket="/var/run/docker.sock"
--docker_stop_timeout="0ns" --docker_store_dir="/tmp/Endpoint_SlaveEndpointTest_UnauthorizedRequest_1_yFFOKg/store/docker"
--docker_volume_checkpoint_dir="/var/run/mesos/isolators/docker/volume" --enforce_container_disk_quota="false"
--executor_registration_timeout="1mins" --executor_reregistration_timeout="2secs" --executor_shutdown_grace_period="5secs"
--fetcher_cache_dir="/tmp/Endpoint_SlaveEndpointTest_UnauthorizedRequest_1_yFFOKg/fetch" --fetcher_cache_size="2GB"
--frameworks_home="" --gc_delay="1weeks" --gc_disk_headroom="0.1" --hadoop_home="" --help="false"
--hostname_lookup="true" --http_command_executor="false" --http_credentials="/tmp/Endpoint_SlaveEndpointTest_UnauthorizedRequest_1_yFFOKg/http_credentials"
--http_heartbeat_interval="30secs" --initialize_driver_logging="true" --isolation="posix/cpu,posix/mem"
--launcher="posix" --launcher_dir="/mesos/mesos-1.4.0/_build/src" --logbufsecs="0" --logging_level="INFO"
--max_completed_executors_per_framework="150" --oversubscribed_resources_interval="15secs"
--perf_duration="10secs" --perf_interval="1mins" --port="5051" --qos_correction_interval_min="0ns"
--quiet="false" --recover="reconnect" --recovery_timeout="15mins" --registration_backoff_factor="10ms"
--resources="cpus:2;gpus:0;mem:1024;disk:1024;ports:[31000-32000]" --revocable_cpu_low_priority="true"
--runtime_dir="/tmp/Endpoint_SlaveEndpointTest_UnauthorizedRequest_1_yFFOKg" --sandbox_directory="/mnt/mesos/sandbox"
--strict="true" --switch_user="true" --systemd_enable_support="true" --systemd_runtime_directory="/run/systemd/system"
--version="false" --work_dir="/tmp/Endpoint_SlaveEndpointTest_UnauthorizedRequest_1_yaLvqX"
I0725 05:10:27.363890  6371 credentials.hpp:86] Loading credential for authentication from
'/tmp/Endpoint_SlaveEndpointTest_UnauthorizedRequest_1_yFFOKg/credential'
I0725 05:10:27.364014  6371 slave.cpp:283] Agent using credential for: test-principal
I0725 05:10:27.364035  6371 credentials.hpp:37] Loading credentials for authentication from
'/tmp/Endpoint_SlaveEndpointTest_UnauthorizedRequest_1_yFFOKg/http_credentials'
I0725 05:10:27.364235  6371 http.cpp:993] Creating default 'basic' HTTP authenticator for
realm 'mesos-agent-readonly'
I0725 05:10:27.364351  6371 http.cpp:993] Creating default 'basic' HTTP authenticator for
realm 'mesos-agent-readwrite'
I0725 05:10:27.365944  6371 slave.cpp:565] Agent resources: [{"name":"cpus","scalar":{"value":2.0},"type":"SCALAR"},{"name":"mem","scalar":{"value":1024.0},"type":"SCALAR"},{"name":"disk","scalar":{"value":1024.0},"type":"SCALAR"},{"name":"ports","ranges":{"range":[{"begin":31000,"end":32000}]},"type":"RANGES"}]
I0725 05:10:27.366148  6371 slave.cpp:573] Agent attributes: [  ]
I0725 05:10:27.366161  6371 slave.cpp:582] Agent hostname: 11fcfede14f7
I0725 05:10:27.366277  6379 status_update_manager.cpp:177] Pausing sending status updates
I0725 05:10:27.367410  6367 state.cpp:64] Recovering state from '/tmp/Endpoint_SlaveEndpointTest_UnauthorizedRequest_1_yaLvqX/meta'
I0725 05:10:27.367655  6369 status_update_manager.cpp:203] Recovering status update manager
I0725 05:10:27.367805  6361 containerizer.cpp:582] Recovering containerizer
I0725 05:10:27.368923  6375 provisioner.cpp:416] Provisioner recovery complete
I0725 05:10:27.369243  6371 slave.cpp:6207] Finished recovery
I0725 05:10:27.369624  6371 slave.cpp:6389] Querying resource estimator for oversubscribable
resources
I0725 05:10:27.369803  6362 slave.cpp:6403] Received oversubscribable resources {} from the
resource estimator
I0725 05:10:27.371652  6358 process.cpp:3837] Handling HTTP event for process 'slave(791)'
with path: '/slave(791)/monitor/statistics.json'
I0725 05:10:27.372611  6372 http.cpp:1133] HTTP GET for /slave(791)/monitor/statistics.json
from 172.17.0.6:36718
I0725 05:10:27.372673  6372 http.cpp:957] Authorizing principal 'test-principal' to GET the
'/monitor/statistics.json' endpoint
I0725 05:10:27.374191  6367 slave.cpp:843] Agent terminating
[       OK ] Endpoint/SlaveEndpointTest.UnauthorizedRequest/1 (21 ms)
[ RUN      ] Endpoint/SlaveEndpointTest.UnauthorizedRequest/2
I0725 05:10:27.382148  6338 containerizer.cpp:230] Using isolation: posix/cpu,posix/mem,filesystem/posix,network/cni,environment_secret
W0725 05:10:27.382573  6338 backend.cpp:76] Failed to create 'aufs' backend: AufsBackend requires
root privileges
W0725 05:10:27.382655  6338 backend.cpp:76] Failed to create 'bind' backend: BindBackend requires
root privileges
I0725 05:10:27.382683  6338 provisioner.cpp:255] Using default backend 'copy'
I0725 05:10:27.385781  6373 slave.cpp:250] Mesos agent started on (792)@172.17.0.6:35005
I0725 05:10:27.385800  6373 slave.cpp:251] Flags at startup: --acls="" --appc_simple_discovery_uri_prefix="http://"
--appc_store_dir="/tmp/Endpoint_SlaveEndpointTest_UnauthorizedRequest_2_Cbecfw/store/appc"
--authenticate_http_readonly="true" --authenticate_http_readwrite="true" --authenticatee="crammd5"
--authentication_backoff_factor="1secs" --authorizer="local" --cgroups_cpu_enable_pids_and_tids_count="false"
--cgroups_enable_cfs="false" --cgroups_hierarchy="/sys/fs/cgroup" --cgroups_limit_swap="false"
--cgroups_root="mesos" --container_disk_watch_interval="15secs" --containerizers="mesos" --credential="/tmp/Endpoint_SlaveEndpointTest_UnauthorizedRequest_2_Cbecfw/credential"
--default_role="*" --disk_watch_interval="1mins" --docker="docker" --docker_kill_orphans="true"
--docker_registry="https://registry-1.docker.io" --docker_remove_delay="6hrs" --docker_socket="/var/run/docker.sock"
--docker_stop_timeout="0ns" --docker_store_dir="/tmp/Endpoint_SlaveEndpointTest_UnauthorizedRequest_2_Cbecfw/store/docker"
--docker_volume_checkpoint_dir="/var/run/mesos/isolators/docker/volume" --enforce_container_disk_quota="false"
--executor_registration_timeout="1mins" --executor_reregistration_timeout="2secs" --executor_shutdown_grace_period="5secs"
--fetcher_cache_dir="/tmp/Endpoint_SlaveEndpointTest_UnauthorizedRequest_2_Cbecfw/fetch" --fetcher_cache_size="2GB"
--frameworks_home="" --gc_delay="1weeks" --gc_disk_headroom="0.1" --hadoop_home="" --help="false"
--hostname_lookup="true" --http_command_executor="false" --http_credentials="/tmp/Endpoint_SlaveEndpointTest_UnauthorizedRequest_2_Cbecfw/http_credentials"
--http_heartbeat_interval="30secs" --initialize_driver_logging="true" --isolation="posix/cpu,posix/mem"
--launcher="posix" --launcher_dir="/mesos/mesos-1.4.0/_build/src" --logbufsecs="0" --logging_level="INFO"
--max_completed_executors_per_framework="150" --oversubscribed_resources_interval="15secs"
--perf_duration="10secs" --perf_interval="1mins" --port="5051" --qos_correction_interval_min="0ns"
--quiet="false" --recover="reconnect" --recovery_timeout="15mins" --registration_backoff_factor="10ms"
--resources="cpus:2;gpus:0;mem:1024;disk:1024;ports:[31000-32000]" --revocable_cpu_low_priority="true"
--runtime_dir="/tmp/Endpoint_SlaveEndpointTest_UnauthorizedRequest_2_Cbecfw" --sandbox_directory="/mnt/mesos/sandbox"
--strict="true" --switch_user="true" --systemd_enable_support="true" --systemd_runtime_directory="/run/systemd/system"
--version="false" --work_dir="/tmp/Endpoint_SlaveEndpointTest_UnauthorizedRequest_2_NGhERc"
I0725 05:10:27.386099  6373 credentials.hpp:86] Loading credential for authentication from
'/tmp/Endpoint_SlaveEndpointTest_UnauthorizedRequest_2_Cbecfw/credential'
I0725 05:10:27.386227  6373 slave.cpp:283] Agent using credential for: test-principal
I0725 05:10:27.386248  6373 credentials.hpp:37] Loading credentials for authentication from
'/tmp/Endpoint_SlaveEndpointTest_UnauthorizedRequest_2_Cbecfw/http_credentials'
I0725 05:10:27.386445  6373 http.cpp:993] Creating default 'basic' HTTP authenticator for
realm 'mesos-agent-readonly'
I0725 05:10:27.386557  6373 http.cpp:993] Creating default 'basic' HTTP authenticator for
realm 'mesos-agent-readwrite'
I0725 05:10:27.387658  6373 slave.cpp:565] Agent resources: [{"name":"cpus","scalar":{"value":2.0},"type":"SCALAR"},{"name":"mem","scalar":{"value":1024.0},"type":"SCALAR"},{"name":"disk","scalar":{"value":1024.0},"type":"SCALAR"},{"name":"ports","ranges":{"range":[{"begin":31000,"end":32000}]},"type":"RANGES"}]
I0725 05:10:27.387861  6373 slave.cpp:573] Agent attributes: [  ]
I0725 05:10:27.387873  6373 slave.cpp:582] Agent hostname: 11fcfede14f7
I0725 05:10:27.387974  6357 status_update_manager.cpp:177] Pausing sending status updates
I0725 05:10:27.389086  6360 state.cpp:64] Recovering state from '/tmp/Endpoint_SlaveEndpointTest_UnauthorizedRequest_2_NGhERc/meta'
I0725 05:10:27.389300  6368 status_update_manager.cpp:203] Recovering status update manager
I0725 05:10:27.389442  6369 containerizer.cpp:582] Recovering containerizer
I0725 05:10:27.390540  6358 provisioner.cpp:416] Provisioner recovery complete
I0725 05:10:27.390803  6364 slave.cpp:6207] Finished recovery
I0725 05:10:27.391167  6364 slave.cpp:6389] Querying resource estimator for oversubscribable
resources
I0725 05:10:27.391355  6380 slave.cpp:6403] Received oversubscribable resources {} from the
resource estimator
I0725 05:10:27.393265  6361 process.cpp:3837] Handling HTTP event for process 'slave(792)'
with path: '/slave(792)/containers'
I0725 05:10:27.394181  6376 http.cpp:1133] HTTP GET for /slave(792)/containers from 172.17.0.6:36720
I0725 05:10:27.394244  6376 http.cpp:957] Authorizing principal 'test-principal' to GET the
'/containers' endpoint
I0725 05:10:27.395669  6368 slave.cpp:843] Agent terminating
[       OK ] Endpoint/SlaveEndpointTest.UnauthorizedRequest/2 (21 ms)
[ RUN      ] Endpoint/SlaveEndpointTest.NoAuthorizer/0
I0725 05:10:27.404191  6338 containerizer.cpp:230] Using isolation: posix/cpu,posix/mem,filesystem/posix,network/cni,environment_secret
W0725 05:10:27.404676  6338 backend.cpp:76] Failed to create 'aufs' backend: AufsBackend requires
root privileges
W0725 05:10:27.404796  6338 backend.cpp:76] Failed to create 'bind' backend: BindBackend requires
root privileges
I0725 05:10:27.404825  6338 provisioner.cpp:255] Using default backend 'copy'
I0725 05:10:27.406352  6338 cluster.cpp:448] Creating default 'local' authorizer
I0725 05:10:27.407699  6359 slave.cpp:250] Mesos agent started on (793)@172.17.0.6:35005
I0725 05:10:27.407717  6359 slave.cpp:251] Flags at startup: --acls="" --appc_simple_discovery_uri_prefix="http://"
--appc_store_dir="/tmp/Endpoint_SlaveEndpointTest_NoAuthorizer_0_HnIuWL/store/appc" --authenticate_http_readonly="true"
--authenticate_http_readwrite="true" --authenticatee="crammd5" --authentication_backoff_factor="1secs"
--authorizer="local" --cgroups_cpu_enable_pids_and_tids_count="false" --cgroups_enable_cfs="false"
--cgroups_hierarchy="/sys/fs/cgroup" --cgroups_limit_swap="false" --cgroups_root="mesos" --container_disk_watch_interval="15secs"
--containerizers="mesos" --credential="/tmp/Endpoint_SlaveEndpointTest_NoAuthorizer_0_HnIuWL/credential"
--default_role="*" --disk_watch_interval="1mins" --docker="docker" --docker_kill_orphans="true"
--docker_registry="https://registry-1.docker.io" --docker_remove_delay="6hrs" --docker_socket="/var/run/docker.sock"
--docker_stop_timeout="0ns" --docker_store_dir="/tmp/Endpoint_SlaveEndpointTest_NoAuthorizer_0_HnIuWL/store/docker"
--docker_volume_checkpoint_dir="/var/run/mesos/isolators/docker/volume" --enforce_container_disk_quota="false"
--executor_registration_timeout="1mins" --executor_reregistration_timeout="2secs" --executor_shutdown_grace_period="5secs"
--fetcher_cache_dir="/tmp/Endpoint_SlaveEndpointTest_NoAuthorizer_0_HnIuWL/fetch" --fetcher_cache_size="2GB"
--frameworks_home="" --gc_delay="1weeks" --gc_disk_headroom="0.1" --hadoop_home="" --help="false"
--hostname_lookup="true" --http_command_executor="false" --http_credentials="/tmp/Endpoint_SlaveEndpointTest_NoAuthorizer_0_HnIuWL/http_credentials"
--http_heartbeat_interval="30secs" --initialize_driver_logging="true" --isolation="posix/cpu,posix/mem"
--launcher="posix" --launcher_dir="/mesos/mesos-1.4.0/_build/src" --logbufsecs="0" --logging_level="INFO"
--max_completed_executors_per_framework="150" --oversubscribed_resources_interval="15secs"
--perf_duration="10secs" --perf_interval="1mins" --port="5051" --qos_correction_interval_min="0ns"
--quiet="false" --recover="reconnect" --recovery_timeout="15mins" --registration_backoff_factor="10ms"
--resources="cpus:2;gpus:0;mem:1024;disk:1024;ports:[31000-32000]" --revocable_cpu_low_priority="true"
--runtime_dir="/tmp/Endpoint_SlaveEndpointTest_NoAuthorizer_0_HnIuWL" --sandbox_directory="/mnt/mesos/sandbox"
--strict="true" --switch_user="true" --systemd_enable_support="true" --systemd_runtime_directory="/run/systemd/system"
--version="false" --work_dir="/tmp/Endpoint_SlaveEndpointTest_NoAuthorizer_0_r0wHvs"
I0725 05:10:27.408025  6359 credentials.hpp:86] Loading credential for authentication from
'/tmp/Endpoint_SlaveEndpointTest_NoAuthorizer_0_HnIuWL/credential'
I0725 05:10:27.408176  6359 slave.cpp:283] Agent using credential for: test-principal
I0725 05:10:27.408198  6359 credentials.hpp:37] Loading credentials for authentication from
'/tmp/Endpoint_SlaveEndpointTest_NoAuthorizer_0_HnIuWL/http_credentials'
I0725 05:10:27.408401  6359 http.cpp:993] Creating default 'basic' HTTP authenticator for
realm 'mesos-agent-readonly'
I0725 05:10:27.408512  6359 http.cpp:993] Creating default 'basic' HTTP authenticator for
realm 'mesos-agent-readwrite'
I0725 05:10:27.409610  6359 slave.cpp:565] Agent resources: [{"name":"cpus","scalar":{"value":2.0},"type":"SCALAR"},{"name":"mem","scalar":{"value":1024.0},"type":"SCALAR"},{"name":"disk","scalar":{"value":1024.0},"type":"SCALAR"},{"name":"ports","ranges":{"range":[{"begin":31000,"end":32000}]},"type":"RANGES"}]
I0725 05:10:27.409816  6359 slave.cpp:573] Agent attributes: [  ]
I0725 05:10:27.409831  6359 slave.cpp:582] Agent hostname: 11fcfede14f7
I0725 05:10:27.409927  6363 status_update_manager.cpp:177] Pausing sending status updates
I0725 05:10:27.411057  6361 state.cpp:64] Recovering state from '/tmp/Endpoint_SlaveEndpointTest_NoAuthorizer_0_r0wHvs/meta'
I0725 05:10:27.411273  6376 status_update_manager.cpp:203] Recovering status update manager
I0725 05:10:27.411412  6368 containerizer.cpp:582] Recovering containerizer
I0725 05:10:27.412499  6358 provisioner.cpp:416] Provisioner recovery complete
I0725 05:10:27.412762  6365 slave.cpp:6207] Finished recovery
I0725 05:10:27.413133  6365 slave.cpp:6389] Querying resource estimator for oversubscribable
resources
I0725 05:10:27.413322  6367 slave.cpp:6403] Received oversubscribable resources {} from the
resource estimator
I0725 05:10:27.415158  6366 process.cpp:3837] Handling HTTP event for process 'slave(793)'
with path: '/slave(793)/monitor/statistics'
I0725 05:10:27.416085  6379 http.cpp:1133] HTTP GET for /slave(793)/monitor/statistics from
172.17.0.6:36722
I0725 05:10:27.416148  6379 http.cpp:957] Authorizing principal 'test-principal' to GET the
'/monitor/statistics' endpoint
I0725 05:10:27.418586  6365 slave.cpp:843] Agent terminating
[       OK ] Endpoint/SlaveEndpointTest.NoAuthorizer/0 (23 ms)
[ RUN      ] Endpoint/SlaveEndpointTest.NoAuthorizer/1
I0725 05:10:27.426880  6338 containerizer.cpp:230] Using isolation: posix/cpu,posix/mem,filesystem/posix,network/cni,environment_secret
W0725 05:10:27.427312  6338 backend.cpp:76] Failed to create 'aufs' backend: AufsBackend requires
root privileges
W0725 05:10:27.427403  6338 backend.cpp:76] Failed to create 'bind' backend: BindBackend requires
root privileges
I0725 05:10:27.427438  6338 provisioner.cpp:255] Using default backend 'copy'
I0725 05:10:27.428814  6338 cluster.cpp:448] Creating default 'local' authorizer
I0725 05:10:27.430129  6365 slave.cpp:250] Mesos agent started on (794)@172.17.0.6:35005
I0725 05:10:27.430148  6365 slave.cpp:251] Flags at startup: --acls="" --appc_simple_discovery_uri_prefix="http://"
--appc_store_dir="/tmp/Endpoint_SlaveEndpointTest_NoAuthorizer_1_EAneR1/store/appc" --authenticate_http_readonly="true"
--authenticate_http_readwrite="true" --authenticatee="crammd5" --authentication_backoff_factor="1secs"
--authorizer="local" --cgroups_cpu_enable_pids_and_tids_count="false" --cgroups_enable_cfs="false"
--cgroups_hierarchy="/sys/fs/cgroup" --cgroups_limit_swap="false" --cgroups_root="mesos" --container_disk_watch_interval="15secs"
--containerizers="mesos" --credential="/tmp/Endpoint_SlaveEndpointTest_NoAuthorizer_1_EAneR1/credential"
--default_role="*" --disk_watch_interval="1mins" --docker="docker" --docker_kill_orphans="true"
--docker_registry="https://registry-1.docker.io" --docker_remove_delay="6hrs" --docker_socket="/var/run/docker.sock"
--docker_stop_timeout="0ns" --docker_store_dir="/tmp/Endpoint_SlaveEndpointTest_NoAuthorizer_1_EAneR1/store/docker"
--docker_volume_checkpoint_dir="/var/run/mesos/isolators/docker/volume" --enforce_container_disk_quota="false"
--executor_registration_timeout="1mins" --executor_reregistration_timeout="2secs" --executor_shutdown_grace_period="5secs"
--fetcher_cache_dir="/tmp/Endpoint_SlaveEndpointTest_NoAuthorizer_1_EAneR1/fetch" --fetcher_cache_size="2GB"
--frameworks_home="" --gc_delay="1weeks" --gc_disk_headroom="0.1" --hadoop_home="" --help="false"
--hostname_lookup="true" --http_command_executor="false" --http_credentials="/tmp/Endpoint_SlaveEndpointTest_NoAuthorizer_1_EAneR1/http_credentials"
--http_heartbeat_interval="30secs" --initialize_driver_logging="true" --isolation="posix/cpu,posix/mem"
--launcher="posix" --launcher_dir="/mesos/mesos-1.4.0/_build/src" --logbufsecs="0" --logging_level="INFO"
--max_completed_executors_per_framework="150" --oversubscribed_resources_interval="15secs"
--perf_duration="10secs" --perf_interval="1mins" --port="5051" --qos_correction_interval_min="0ns"
--quiet="false" --recover="reconnect" --recovery_timeout="15mins" --registration_backoff_factor="10ms"
--resources="cpus:2;gpus:0;mem:1024;disk:1024;ports:[31000-32000]" --revocable_cpu_low_priority="true"
--runtime_dir="/tmp/Endpoint_SlaveEndpointTest_NoAuthorizer_1_EAneR1" --sandbox_directory="/mnt/mesos/sandbox"
--strict="true" --switch_user="true" --systemd_enable_support="true" --systemd_runtime_directory="/run/systemd/system"
--version="false" --work_dir="/tmp/Endpoint_SlaveEndpointTest_NoAuthorizer_1_u3E3mI"
I0725 05:10:27.430454  6365 credentials.hpp:86] Loading credential for authentication from
'/tmp/Endpoint_SlaveEndpointTest_NoAuthorizer_1_EAneR1/credential'
I0725 05:10:27.430579  6365 slave.cpp:283] Agent using credential for: test-principal
I0725 05:10:27.430599  6365 credentials.hpp:37] Loading credentials for authentication from
'/tmp/Endpoint_SlaveEndpointTest_NoAuthorizer_1_EAneR1/http_credentials'
I0725 05:10:27.430799  6365 http.cpp:993] Creating default 'basic' HTTP authenticator for
realm 'mesos-agent-readonly'
I0725 05:10:27.430917  6365 http.cpp:993] Creating default 'basic' HTTP authenticator for
realm 'mesos-agent-readwrite'
I0725 05:10:27.432024  6365 slave.cpp:565] Agent resources: [{"name":"cpus","scalar":{"value":2.0},"type":"SCALAR"},{"name":"mem","scalar":{"value":1024.0},"type":"SCALAR"},{"name":"disk","scalar":{"value":1024.0},"type":"SCALAR"},{"name":"ports","ranges":{"range":[{"begin":31000,"end":32000}]},"type":"RANGES"}]
I0725 05:10:27.432226  6365 slave.cpp:573] Agent attributes: [  ]
I0725 05:10:27.432240  6365 slave.cpp:582] Agent hostname: 11fcfede14f7
I0725 05:10:27.432332  6363 status_update_manager.cpp:177] Pausing sending status updates
I0725 05:10:27.433491  6379 state.cpp:64] Recovering state from '/tmp/Endpoint_SlaveEndpointTest_NoAuthorizer_1_u3E3mI/meta'
I0725 05:10:27.433761  6373 status_update_manager.cpp:203] Recovering status update manager
I0725 05:10:27.433894  6378 containerizer.cpp:582] Recovering containerizer
I0725 05:10:27.434949  6375 provisioner.cpp:416] Provisioner recovery complete
I0725 05:10:27.435214  6376 slave.cpp:6207] Finished recovery
I0725 05:10:27.435582  6376 slave.cpp:6389] Querying resource estimator for oversubscribable
resources
I0725 05:10:27.435772  6368 slave.cpp:6403] Received oversubscribable resources {} from the
resource estimator
I0725 05:10:27.437669  6374 process.cpp:3837] Handling HTTP event for process 'slave(794)'
with path: '/slave(794)/monitor/statistics.json'
I0725 05:10:27.438896  6371 http.cpp:1133] HTTP GET for /slave(794)/monitor/statistics.json
from 172.17.0.6:36724
I0725 05:10:27.438977  6371 http.cpp:957] Authorizing principal 'test-principal' to GET the
'/monitor/statistics.json' endpoint
I0725 05:10:27.441263  6357 slave.cpp:843] Agent terminating
[       OK ] Endpoint/SlaveEndpointTest.NoAuthorizer/1 (22 ms)
[ RUN      ] Endpoint/SlaveEndpointTest.NoAuthorizer/2
I0725 05:10:27.449441  6338 containerizer.cpp:230] Using isolation: posix/cpu,posix/mem,filesystem/posix,network/cni,environment_secret
W0725 05:10:27.449895  6338 backend.cpp:76] Failed to create 'aufs' backend: AufsBackend requires
root privileges
W0725 05:10:27.449985  6338 backend.cpp:76] Failed to create 'bind' backend: BindBackend requires
root privileges
I0725 05:10:27.450017  6338 provisioner.cpp:255] Using default backend 'copy'
I0725 05:10:27.451362  6338 cluster.cpp:448] Creating default 'local' authorizer
I0725 05:10:27.452705  6371 slave.cpp:250] Mesos agent started on (795)@172.17.0.6:35005
I0725 05:10:27.452723  6371 slave.cpp:251] Flags at startup: --acls="" --appc_simple_discovery_uri_prefix="http://"
--appc_store_dir="/tmp/Endpoint_SlaveEndpointTest_NoAuthorizer_2_EMgoZh/store/appc" --authenticate_http_readonly="true"
--authenticate_http_readwrite="true" --authenticatee="crammd5" --authentication_backoff_factor="1secs"
--authorizer="local" --cgroups_cpu_enable_pids_and_tids_count="false" --cgroups_enable_cfs="false"
--cgroups_hierarchy="/sys/fs/cgroup" --cgroups_limit_swap="false" --cgroups_root="mesos" --container_disk_watch_interval="15secs"
--containerizers="mesos" --credential="/tmp/Endpoint_SlaveEndpointTest_NoAuthorizer_2_EMgoZh/credential"
--default_role="*" --disk_watch_interval="1mins" --docker="docker" --docker_kill_orphans="true"
--docker_registry="https://registry-1.docker.io" --docker_remove_delay="6hrs" --docker_socket="/var/run/docker.sock"
--docker_stop_timeout="0ns" --docker_store_dir="/tmp/Endpoint_SlaveEndpointTest_NoAuthorizer_2_EMgoZh/store/docker"
--docker_volume_checkpoint_dir="/var/run/mesos/isolators/docker/volume" --enforce_container_disk_quota="false"
--executor_registration_timeout="1mins" --executor_reregistration_timeout="2secs" --executor_shutdown_grace_period="5secs"
--fetcher_cache_dir="/tmp/Endpoint_SlaveEndpointTest_NoAuthorizer_2_EMgoZh/fetch" --fetcher_cache_size="2GB"
--frameworks_home="" --gc_delay="1weeks" --gc_disk_headroom="0.1" --hadoop_home="" --help="false"
--hostname_lookup="true" --http_command_executor="false" --http_credentials="/tmp/Endpoint_SlaveEndpointTest_NoAuthorizer_2_EMgoZh/http_credentials"
--http_heartbeat_interval="30secs" --initialize_driver_logging="true" --isolation="posix/cpu,posix/mem"
--launcher="posix" --launcher_dir="/mesos/mesos-1.4.0/_build/src" --logbufsecs="0" --logging_level="INFO"
--max_completed_executors_per_framework="150" --oversubscribed_resources_interval="15secs"
--perf_duration="10secs" --perf_interval="1mins" --port="5051" --qos_correction_interval_min="0ns"
--quiet="false" --recover="reconnect" --recovery_timeout="15mins" --registration_backoff_factor="10ms"
--resources="cpus:2;gpus:0;mem:1024;disk:1024;ports:[31000-32000]" --revocable_cpu_low_priority="true"
--runtime_dir="/tmp/Endpoint_SlaveEndpointTest_NoAuthorizer_2_EMgoZh" --sandbox_directory="/mnt/mesos/sandbox"
--strict="true" --switch_user="true" --systemd_enable_support="true" --systemd_runtime_directory="/run/systemd/system"
--version="false" --work_dir="/tmp/Endpoint_SlaveEndpointTest_NoAuthorizer_2_pQgRrY"
I0725 05:10:27.453078  6371 credentials.hpp:86] Loading credential for authentication from
'/tmp/Endpoint_SlaveEndpointTest_NoAuthorizer_2_EMgoZh/credential'
I0725 05:10:27.453229  6371 slave.cpp:283] Agent using credential for: test-principal
I0725 05:10:27.453251  6371 credentials.hpp:37] Loading credentials for authentication from
'/tmp/Endpoint_SlaveEndpointTest_NoAuthorizer_2_EMgoZh/http_credentials'
I0725 05:10:27.453454  6371 http.cpp:993] Creating default 'basic' HTTP authenticator for
realm 'mesos-agent-readonly'
I0725 05:10:27.453567  6371 http.cpp:993] Creating default 'basic' HTTP authenticator for
realm 'mesos-agent-readwrite'
I0725 05:10:27.454666  6371 slave.cpp:565] Agent resources: [{"name":"cpus","scalar":{"value":2.0},"type":"SCALAR"},{"name":"mem","scalar":{"value":1024.0},"type":"SCALAR"},{"name":"disk","scalar":{"value":1024.0},"type":"SCALAR"},{"name":"ports","ranges":{"range":[{"begin":31000,"end":32000}]},"type":"RANGES"}]
I0725 05:10:27.454871  6371 slave.cpp:573] Agent attributes: [  ]
I0725 05:10:27.454885  6371 slave.cpp:582] Agent hostname: 11fcfede14f7
I0725 05:10:27.454983  6369 status_update_manager.cpp:177] Pausing sending status updates
I0725 05:10:27.456159  6361 state.cpp:64] Recovering state from '/tmp/Endpoint_SlaveEndpointTest_NoAuthorizer_2_pQgRrY/meta'
I0725 05:10:27.456382  6370 status_update_manager.cpp:203] Recovering status update manager
I0725 05:10:27.456522  6372 containerizer.cpp:582] Recovering containerizer
I0725 05:10:27.457698  6365 provisioner.cpp:416] Provisioner recovery complete
I0725 05:10:27.457962  6375 slave.cpp:6207] Finished recovery
I0725 05:10:27.458304  6375 slave.cpp:6389] Querying resource estimator for oversubscribable
resources
I0725 05:10:27.458484  6373 slave.cpp:6403] Received oversubscribable resources {} from the
resource estimator
I0725 05:10:27.460554  6366 process.cpp:3837] Handling HTTP event for process 'slave(795)'
with path: '/slave(795)/containers'
I0725 05:10:27.461526  6361 http.cpp:1133] HTTP GET for /slave(795)/containers from 172.17.0.6:36726
I0725 05:10:27.461589  6361 http.cpp:957] Authorizing principal 'test-principal' to GET the
'/containers' endpoint
I0725 05:10:27.464256  6368 slave.cpp:843] Agent terminating
[       OK ] Endpoint/SlaveEndpointTest.NoAuthorizer/2 (22 ms)
[----------] 9 tests from Endpoint/SlaveEndpointTest (204 ms total)

[----------] Global test environment tear-down
[==========] 1634 tests from 179 test cases ran. (533100 ms total)
[  PASSED  ] 1633 tests.
[  FAILED  ] 1 test, listed below:
[  FAILED  ] ExamplesTest.V0JavaFramework

 1 FAILED TEST
  YOU HAVE 20 DISABLED TESTS

I0725 05:10:27.523068  6381 process.cpp:1006] Failed to accept socket: future discarded
make[4]: *** [check-local] Error 1
make[4]: Leaving directory `/mesos/mesos-1.4.0/_build/src'
make[3]: *** [check-am] Error 2
make[3]: Leaving directory `/mesos/mesos-1.4.0/_build/src'
make[2]: *** [check] Error 2
make[2]: Leaving directory `/mesos/mesos-1.4.0/_build/src'
make[1]: *** [check-recursive] Error 1
make[1]: Leaving directory `/mesos/mesos-1.4.0/_build'
make: *** [distcheck] Error 1
+ docker rmi mesos-1500956917-7903
Untagged: mesos-1500956917-7903:latest
Deleted: sha256:c5e8da46875d140a9e68e7b82236784d692fad92c591f0dc4eaae7345a55377d
Deleted: sha256:db293ab771cad7448e6bee0f82ffd9a7aa9ffd01fd272af8d7651c520865ccf5
Deleted: sha256:bb3db5c0cc1f52b2f8c57dd16320be8b3186c1fd2900232db2909eb462a41ee6
Deleted: sha256:9464fc04a029144becc389b4cbb71f35daa7c5d163de92401772993458db1cec
Deleted: sha256:84b471b1b8769dceb2487310494d6c3a4425d11271f5ef01fe0f9d925bbae815
Deleted: sha256:c2932d98eb1c5f4dff7b2086199eca5dd5d7d229b88ec77c5d00765bb2484e93
Deleted: sha256:949c3a1f00e4b5757e0911909a5cc897c2c12735aa1e1ef38f7e9463cd19909e
Deleted: sha256:ab33a128f2799e93625baf8ba4428a9d2b1256c5deb6213cffd4624b05c5e415
Deleted: sha256:4fc4b765c1413f5ca2a7e4b5a29cada1c9f7f560a5587900b2949faea15a3f80
Deleted: sha256:b4b7f3f0493d090d211bd94422b47383e2eae340f1788ec738d1ad9992c8e938
Deleted: sha256:77460b649848a88a15d76063955b48442a4dee83136aef3bbba0f688e462b0a7
Deleted: sha256:75a15f8956ff5d611eb005a94c257366df4a8bef46e83877a9ab1085893f9807
Deleted: sha256:65a0714383ca81e4fbf27d2d7816949f4858e96682a01d41516ca10a69b4f645
Deleted: sha256:abf45a7c039dd6df0df542aabd87ceed6f91734ae2160230ab1b8d8f08d07153
Deleted: sha256:fe476d3a0d54305e923733fe121e84b25a23097b625e5d619867150b2ba84f1a
Deleted: sha256:2d7ac465a086e0262fd9558078248e33ad51793f3bfeb6ce12a9c4fbcb526032
Deleted: sha256:6ae20c51e474e7bfd7b4516aaaf03a8a2af442e41bba794e5e286e5c93f87676
Deleted: sha256:e18e11f9dcb8a14bd46efb4233d156994fc6e147357c8a61916a565543cd560e
Deleted: sha256:105bf5c6e46cc458d463a18da0033a6aedc3c0c2443a4abfded5b33e8f3c7d94
Deleted: sha256:723757d6df1ca02b553111f9d6438c52fef8bccc2d82e5f15e101743875d9147
Deleted: sha256:cb7b94bb9f41070d80be5a8fdf4c918932784ad63db80a593026fe0b447fe308
Deleted: sha256:f2899800d10b278c139df67ea2a77053df294fb19bbbc93946cdb7e68a169dc1
Deleted: sha256:501b6149c6f0b1a60a5ee9b8fc7be77f9c96e4db8c30bad68c66671aed83e6ca
Deleted: sha256:3732b027db7e557105004dbc016762f1bcbec1a552c0d61a69bdcb78a49e53b5
Deleted: sha256:de050801978a03c2081e0ef64cf2bb7c32c24e4ea120357e7523e227a32de4bc
Build step 'Execute shell' marked build as failure
Not sending mail to unregistered user yujie.jay@gmail.com

Mime
View raw message