mesos-builds mailing list archives

Site index · List index
Message view « Date » · « Thread »
Top « Date » · « Thread »
From Vinod Kone <vinodk...@apache.org>
Subject Re: Build failed in Jenkins: Mesos-Buildbot » autotools,gcc,--verbose,GLOG_v=1 MESOS_VERBOSE=1,centos:7,(ubuntu)&&(!ubuntu-us1)&&(!ubuntu-eu2) #3850
Date Thu, 29 Jun 2017 17:57:58 GMT
filed https://issues.apache.org/jira/browse/MESOS-7440

On Thu, Jun 29, 2017 at 3:46 AM, Apache Jenkins Server <
jenkins@builds.apache.org> wrote:

> See <https://builds.apache.org/job/Mesos-Buildbot/BUILDTOOL=auto
> tools,COMPILER=gcc,CONFIGURATION=--verbose,ENVIRONMENT=GLOG_
> v=1%20MESOS_VERBOSE=1,OS=centos%3A7,label_exp=(ubuntu)&
> &(!ubuntu-us1)&&(!ubuntu-eu2)/3850/display/redirect?page=changes>
>
> Changes:
>
> [vinodkone] Fixed parameters in JNI call for disconnected event.
>
> [vinodkone] Logged operator API subscribed removal.
>
> [bmahler] Fixed a regression in support/apply-reviews.py.
>
> ------------------------------------------
> [...truncated 29.27 MB...]
> [       OK ] Endpoint/SlaveEndpointTest.AuthorizedRequest/1 (30 ms)
> [ RUN      ] Endpoint/SlaveEndpointTest.AuthorizedRequest/2
> I0629 10:46:22.094221  5916 containerizer.cpp:230] Using isolation:
> posix/cpu,posix/mem,filesystem/posix,network/cni,environment_secret
> W0629 10:46:22.094766  5916 backend.cpp:76] Failed to create 'aufs'
> backend: AufsBackend requires root privileges
> W0629 10:46:22.094887  5916 backend.cpp:76] Failed to create 'bind'
> backend: BindBackend requires root privileges
> I0629 10:46:22.094931  5916 provisioner.cpp:255] Using default backend
> 'copy'
> I0629 10:46:22.098794  5947 slave.cpp:249] Mesos agent started on (767)@
> 172.17.0.6:43517
> I0629 10:46:22.098819  5947 slave.cpp:250] Flags at startup: --acls=""
> --appc_simple_discovery_uri_prefix="http://"
> --appc_store_dir="/tmp/Endpoint_SlaveEndpointTest_AuthorizedRequest_2_GBNLgJ/store/appc"
> --authenticate_http_readonly="true" --authenticate_http_readwrite="true"
> --authenticatee="crammd5" --authentication_backoff_factor="1secs"
> --authorizer="local" --cgroups_cpu_enable_pids_and_tids_count="false"
> --cgroups_enable_cfs="false" --cgroups_hierarchy="/sys/fs/cgroup"
> --cgroups_limit_swap="false" --cgroups_root="mesos"
> --container_disk_watch_interval="15secs" --containerizers="mesos"
> --credential="/tmp/Endpoint_SlaveEndpointTest_AuthorizedRequest_2_GBNLgJ/credential"
> --default_role="*" --disk_watch_interval="1mins" --docker="docker"
> --docker_kill_orphans="true" --docker_registry="https://reg
> istry-1.docker.io" --docker_remove_delay="6hrs"
> --docker_socket="/var/run/docker.sock" --docker_stop_timeout="0ns"
> --docker_store_dir="/tmp/Endpoint_SlaveEndpointTest_Authoriz
> edRequest_2_GBNLgJ/store/docker" --docker_volume_checkpoint_dir
> ="/var/run/mesos/isolators/docker/volume" --enforce_container_disk_quota="false"
> --executor_registration_timeout="1mins" --executor_reregistration_timeout="2secs"
> --executor_shutdown_grace_period="5secs" --fetcher_cache_dir="/tmp/Endp
> oint_SlaveEndpointTest_AuthorizedRequest_2_GBNLgJ/fetch"
> --fetcher_cache_size="2GB" --frameworks_home="" --gc_delay="1weeks"
> --gc_disk_headroom="0.1" --hadoop_home="" --help="false"
> --hostname_lookup="true" --http_command_executor="false"
> --http_credentials="/tmp/Endpoint_SlaveEndpointTest_Authoriz
> edRequest_2_GBNLgJ/http_credentials" --http_heartbeat_interval="30secs"
> --initialize_driver_logging="true" --isolation="posix/cpu,posix/mem"
> --launcher="posix" --launcher_dir="/mesos/mesos-1.4.0/_build/src"
> --logbufsecs="0" --logging_level="INFO" --max_completed_executors_per_framework="150"
> --oversubscribed_resources_interval="15secs" --perf_duration="10secs"
> --perf_interval="1mins" --port="5051" --qos_correction_interval_min="0ns"
> --quiet="false" --recover="reconnect" --recovery_timeout="15mins"
> --registration_backoff_factor="10ms" --resources="cpus:2;gpus:0;mem
> :1024;disk:1024;ports:[31000-32000]" --revocable_cpu_low_priority="true"
> --runtime_dir="/tmp/Endpoint_SlaveEndpointTest_AuthorizedRequest_2_GBNLgJ"
> --sandbox_directory="/mnt/mesos/sandbox" --strict="true"
> --switch_user="true" --systemd_enable_support="true"
> --systemd_runtime_directory="/run/systemd/system" --version="false"
> --work_dir="/tmp/Endpoint_SlaveEndpointTest_AuthorizedRequest_2_GimOJJ"
> I0629 10:46:22.099427  5947 credentials.hpp:86] Loading credential for
> authentication from '/tmp/Endpoint_SlaveEndpointTe
> st_AuthorizedRequest_2_GBNLgJ/credential'
> I0629 10:46:22.099658  5947 slave.cpp:282] Agent using credential for:
> test-principal
> I0629 10:46:22.099684  5947 credentials.hpp:37] Loading credentials for
> authentication from '/tmp/Endpoint_SlaveEndpointTe
> st_AuthorizedRequest_2_GBNLgJ/http_credentials'
> I0629 10:46:22.100026  5947 http.cpp:974] Creating default 'basic' HTTP
> authenticator for realm 'mesos-agent-readonly'
> I0629 10:46:22.100206  5947 http.cpp:974] Creating default 'basic' HTTP
> authenticator for realm 'mesos-agent-readwrite'
> I0629 10:46:22.101572  5947 slave.cpp:553] Agent resources:
> [{"name":"cpus","scalar":{"value":2.0},"type":"SCALAR"},{"
> name":"mem","scalar":{"value":1024.0},"type":"SCALAR"},{"nam
> e":"disk","scalar":{"value":1024.0},"type":"SCALAR"},{"nam
> e":"ports","ranges":{"range":[{"begin":31000,"end":32000}]},
> "type":"RANGES"}]
> I0629 10:46:22.101814  5947 slave.cpp:561] Agent attributes: [  ]
> I0629 10:46:22.101835  5947 slave.cpp:566] Agent hostname: d89378cfb216
> I0629 10:46:22.101972  5955 status_update_manager.cpp:177] Pausing sending
> status updates
> I0629 10:46:22.103541  5936 state.cpp:64] Recovering state from
> '/tmp/Endpoint_SlaveEndpointTest_AuthorizedRequest_2_GimOJJ/meta'
> I0629 10:46:22.107648  5958 status_update_manager.cpp:203] Recovering
> status update manager
> I0629 10:46:22.107836  5958 containerizer.cpp:582] Recovering containerizer
> I0629 10:46:22.109344  5948 provisioner.cpp:416] Provisioner recovery
> complete
> I0629 10:46:22.109915  5953 slave.cpp:6168] Finished recovery
> I0629 10:46:22.110584  5953 slave.cpp:6350] Querying resource estimator
> for oversubscribable resources
> I0629 10:46:22.110997  5953 slave.cpp:6364] Received oversubscribable
> resources {} from the resource estimator
> I0629 10:46:22.113710  5946 process.cpp:3779] Handling HTTP event for
> process 'slave(767)' with path: '/slave(767)/containers'
> I0629 10:46:22.115073  5947 http.cpp:1114] HTTP GET for
> /slave(767)/containers from 172.17.0.6:45894
> I0629 10:46:22.115149  5947 http.cpp:935] Authorizing principal
> 'test-principal' to GET the '/containers' endpoint
> I0629 10:46:22.118134  5950 slave.cpp:818] Agent terminating
> [       OK ] Endpoint/SlaveEndpointTest.AuthorizedRequest/2 (34 ms)
> [ RUN      ] Endpoint/SlaveEndpointTest.UnauthorizedRequest/0
> I0629 10:46:22.129155  5916 containerizer.cpp:230] Using isolation:
> posix/cpu,posix/mem,filesystem/posix,network/cni,environment_secret
> W0629 10:46:22.129611  5916 backend.cpp:76] Failed to create 'aufs'
> backend: AufsBackend requires root privileges
> W0629 10:46:22.129704  5916 backend.cpp:76] Failed to create 'bind'
> backend: BindBackend requires root privileges
> I0629 10:46:22.129734  5916 provisioner.cpp:255] Using default backend
> 'copy'
> I0629 10:46:22.132603  5935 slave.cpp:249] Mesos agent started on (768)@
> 172.17.0.6:43517
> I0629 10:46:22.132627  5935 slave.cpp:250] Flags at startup: --acls=""
> --appc_simple_discovery_uri_prefix="http://"
> --appc_store_dir="/tmp/Endpoint_SlaveEndpointTest_UnauthorizedRequest_0_W8LAGH/store/appc"
> --authenticate_http_readonly="true" --authenticate_http_readwrite="true"
> --authenticatee="crammd5" --authentication_backoff_factor="1secs"
> --authorizer="local" --cgroups_cpu_enable_pids_and_tids_count="false"
> --cgroups_enable_cfs="false" --cgroups_hierarchy="/sys/fs/cgroup"
> --cgroups_limit_swap="false" --cgroups_root="mesos"
> --container_disk_watch_interval="15secs" --containerizers="mesos"
> --credential="/tmp/Endpoint_SlaveEndpointTest_UnauthorizedRequest_0_W8LAGH/credential"
> --default_role="*" --disk_watch_interval="1mins" --docker="docker"
> --docker_kill_orphans="true" --docker_registry="https://reg
> istry-1.docker.io" --docker_remove_delay="6hrs"
> --docker_socket="/var/run/docker.sock" --docker_stop_timeout="0ns"
> --docker_store_dir="/tmp/Endpoint_SlaveEndpointTest_Unauthor
> izedRequest_0_W8LAGH/store/docker" --docker_volume_checkpoint_dir
> ="/var/run/mesos/isolators/docker/volume" --enforce_container_disk_quota="false"
> --executor_registration_timeout="1mins" --executor_reregistration_timeout="2secs"
> --executor_shutdown_grace_period="5secs" --fetcher_cache_dir="/tmp/Endp
> oint_SlaveEndpointTest_UnauthorizedRequest_0_W8LAGH/fetch"
> --fetcher_cache_size="2GB" --frameworks_home="" --gc_delay="1weeks"
> --gc_disk_headroom="0.1" --hadoop_home="" --help="false"
> --hostname_lookup="true" --http_command_executor="false"
> --http_credentials="/tmp/Endpoint_SlaveEndpointTest_Unauthor
> izedRequest_0_W8LAGH/http_credentials" --http_heartbeat_interval="30secs"
> --initialize_driver_logging="true" --isolation="posix/cpu,posix/mem"
> --launcher="posix" --launcher_dir="/mesos/mesos-1.4.0/_build/src"
> --logbufsecs="0" --logging_level="INFO" --max_completed_executors_per_framework="150"
> --oversubscribed_resources_interval="15secs" --perf_duration="10secs"
> --perf_interval="1mins" --port="5051" --qos_correction_interval_min="0ns"
> --quiet="false" --recover="reconnect" --recovery_timeout="15mins"
> --registration_backoff_factor="10ms" --resources="cpus:2;gpus:0;mem
> :1024;disk:1024;ports:[31000-32000]" --revocable_cpu_low_priority="true"
> --runtime_dir="/tmp/Endpoint_SlaveEndpointTest_UnauthorizedRequest_0_W8LAGH"
> --sandbox_directory="/mnt/mesos/sandbox" --strict="true"
> --switch_user="true" --systemd_enable_support="true"
> --systemd_runtime_directory="/run/systemd/system" --version="false"
> --work_dir="/tmp/Endpoint_SlaveEndpointTest_UnauthorizedRequest_0_yKfr4H"
> I0629 10:46:22.133036  5935 credentials.hpp:86] Loading credential for
> authentication from '/tmp/Endpoint_SlaveEndpointTe
> st_UnauthorizedRequest_0_W8LAGH/credential'
> I0629 10:46:22.133213  5935 slave.cpp:282] Agent using credential for:
> test-principal
> I0629 10:46:22.133240  5935 credentials.hpp:37] Loading credentials for
> authentication from '/tmp/Endpoint_SlaveEndpointTe
> st_UnauthorizedRequest_0_W8LAGH/http_credentials'
> I0629 10:46:22.133492  5935 http.cpp:974] Creating default 'basic' HTTP
> authenticator for realm 'mesos-agent-readonly'
> I0629 10:46:22.133646  5935 http.cpp:974] Creating default 'basic' HTTP
> authenticator for realm 'mesos-agent-readwrite'
> I0629 10:46:22.134912  5935 slave.cpp:553] Agent resources:
> [{"name":"cpus","scalar":{"value":2.0},"type":"SCALAR"},{"
> name":"mem","scalar":{"value":1024.0},"type":"SCALAR"},{"nam
> e":"disk","scalar":{"value":1024.0},"type":"SCALAR"},{"nam
> e":"ports","ranges":{"range":[{"begin":31000,"end":32000}]},
> "type":"RANGES"}]
> I0629 10:46:22.135123  5935 slave.cpp:561] Agent attributes: [  ]
> I0629 10:46:22.135136  5935 slave.cpp:566] Agent hostname: d89378cfb216
> I0629 10:46:22.135247  5944 status_update_manager.cpp:177] Pausing sending
> status updates
> I0629 10:46:22.136484  5950 state.cpp:64] Recovering state from
> '/tmp/Endpoint_SlaveEndpointTest_UnauthorizedRequest_0_yKfr4H/meta'
> I0629 10:46:22.136773  5956 status_update_manager.cpp:203] Recovering
> status update manager
> I0629 10:46:22.137054  5941 containerizer.cpp:582] Recovering containerizer
> I0629 10:46:22.138545  5937 provisioner.cpp:416] Provisioner recovery
> complete
> I0629 10:46:22.138927  5944 slave.cpp:6168] Finished recovery
> I0629 10:46:22.139339  5944 slave.cpp:6350] Querying resource estimator
> for oversubscribable resources
> I0629 10:46:22.139595  5935 slave.cpp:6364] Received oversubscribable
> resources {} from the resource estimator
> I0629 10:46:22.141854  5937 process.cpp:3779] Handling HTTP event for
> process 'slave(768)' with path: '/slave(768)/monitor/statistics'
> I0629 10:46:22.143025  5939 http.cpp:1114] HTTP GET for
> /slave(768)/monitor/statistics from 172.17.0.6:45896
> I0629 10:46:22.143095  5939 http.cpp:935] Authorizing principal
> 'test-principal' to GET the '/monitor/statistics' endpoint
> I0629 10:46:22.144870  5954 slave.cpp:818] Agent terminating
> [       OK ] Endpoint/SlaveEndpointTest.UnauthorizedRequest/0 (25 ms)
> [ RUN      ] Endpoint/SlaveEndpointTest.UnauthorizedRequest/1
> I0629 10:46:22.154052  5916 containerizer.cpp:230] Using isolation:
> posix/cpu,posix/mem,filesystem/posix,network/cni,environment_secret
> W0629 10:46:22.154500  5916 backend.cpp:76] Failed to create 'aufs'
> backend: AufsBackend requires root privileges
> W0629 10:46:22.154598  5916 backend.cpp:76] Failed to create 'bind'
> backend: BindBackend requires root privileges
> I0629 10:46:22.154628  5916 provisioner.cpp:255] Using default backend
> 'copy'
> I0629 10:46:22.157349  5948 slave.cpp:249] Mesos agent started on (769)@
> 172.17.0.6:43517
> I0629 10:46:22.157371  5948 slave.cpp:250] Flags at startup: --acls=""
> --appc_simple_discovery_uri_prefix="http://"
> --appc_store_dir="/tmp/Endpoint_SlaveEndpointTest_UnauthorizedRequest_1_TKnWlG/store/appc"
> --authenticate_http_readonly="true" --authenticate_http_readwrite="true"
> --authenticatee="crammd5" --authentication_backoff_factor="1secs"
> --authorizer="local" --cgroups_cpu_enable_pids_and_tids_count="false"
> --cgroups_enable_cfs="false" --cgroups_hierarchy="/sys/fs/cgroup"
> --cgroups_limit_swap="false" --cgroups_root="mesos"
> --container_disk_watch_interval="15secs" --containerizers="mesos"
> --credential="/tmp/Endpoint_SlaveEndpointTest_UnauthorizedRequest_1_TKnWlG/credential"
> --default_role="*" --disk_watch_interval="1mins" --docker="docker"
> --docker_kill_orphans="true" --docker_registry="https://reg
> istry-1.docker.io" --docker_remove_delay="6hrs"
> --docker_socket="/var/run/docker.sock" --docker_stop_timeout="0ns"
> --docker_store_dir="/tmp/Endpoint_SlaveEndpointTest_Unauthor
> izedRequest_1_TKnWlG/store/docker" --docker_volume_checkpoint_dir
> ="/var/run/mesos/isolators/docker/volume" --enforce_container_disk_quota="false"
> --executor_registration_timeout="1mins" --executor_reregistration_timeout="2secs"
> --executor_shutdown_grace_period="5secs" --fetcher_cache_dir="/tmp/Endp
> oint_SlaveEndpointTest_UnauthorizedRequest_1_TKnWlG/fetch"
> --fetcher_cache_size="2GB" --frameworks_home="" --gc_delay="1weeks"
> --gc_disk_headroom="0.1" --hadoop_home="" --help="false"
> --hostname_lookup="true" --http_command_executor="false"
> --http_credentials="/tmp/Endpoint_SlaveEndpointTest_Unauthor
> izedRequest_1_TKnWlG/http_credentials" --http_heartbeat_interval="30secs"
> --initialize_driver_logging="true" --isolation="posix/cpu,posix/mem"
> --launcher="posix" --launcher_dir="/mesos/mesos-1.4.0/_build/src"
> --logbufsecs="0" --logging_level="INFO" --max_completed_executors_per_framework="150"
> --oversubscribed_resources_interval="15secs" --perf_duration="10secs"
> --perf_interval="1mins" --port="5051" --qos_correction_interval_min="0ns"
> --quiet="false" --recover="reconnect" --recovery_timeout="15mins"
> --registration_backoff_factor="10ms" --resources="cpus:2;gpus:0;mem
> :1024;disk:1024;ports:[31000-32000]" --revocable_cpu_low_priority="true"
> --runtime_dir="/tmp/Endpoint_SlaveEndpointTest_UnauthorizedRequest_1_TKnWlG"
> --sandbox_directory="/mnt/mesos/sandbox" --strict="true"
> --switch_user="true" --systemd_enable_support="true"
> --systemd_runtime_directory="/run/systemd/system" --version="false"
> --work_dir="/tmp/Endpoint_SlaveEndpointTest_UnauthorizedRequest_1_4vm4FG"
> I0629 10:46:22.157717  5948 credentials.hpp:86] Loading credential for
> authentication from '/tmp/Endpoint_SlaveEndpointTe
> st_UnauthorizedRequest_1_TKnWlG/credential'
> I0629 10:46:22.157841  5948 slave.cpp:282] Agent using credential for:
> test-principal
> I0629 10:46:22.157860  5948 credentials.hpp:37] Loading credentials for
> authentication from '/tmp/Endpoint_SlaveEndpointTe
> st_UnauthorizedRequest_1_TKnWlG/http_credentials'
> I0629 10:46:22.158061  5948 http.cpp:974] Creating default 'basic' HTTP
> authenticator for realm 'mesos-agent-readonly'
> I0629 10:46:22.158241  5948 http.cpp:974] Creating default 'basic' HTTP
> authenticator for realm 'mesos-agent-readwrite'
> I0629 10:46:22.159385  5948 slave.cpp:553] Agent resources:
> [{"name":"cpus","scalar":{"value":2.0},"type":"SCALAR"},{"
> name":"mem","scalar":{"value":1024.0},"type":"SCALAR"},{"nam
> e":"disk","scalar":{"value":1024.0},"type":"SCALAR"},{"nam
> e":"ports","ranges":{"range":[{"begin":31000,"end":32000}]},
> "type":"RANGES"}]
> I0629 10:46:22.159588  5948 slave.cpp:561] Agent attributes: [  ]
> I0629 10:46:22.159602  5948 slave.cpp:566] Agent hostname: d89378cfb216
> I0629 10:46:22.159713  5941 status_update_manager.cpp:177] Pausing sending
> status updates
> I0629 10:46:22.160914  5954 state.cpp:64] Recovering state from
> '/tmp/Endpoint_SlaveEndpointTest_UnauthorizedRequest_1_4vm4FG/meta'
> I0629 10:46:22.161195  5941 status_update_manager.cpp:203] Recovering
> status update manager
> I0629 10:46:22.161370  5942 containerizer.cpp:582] Recovering containerizer
> I0629 10:46:22.162698  5951 provisioner.cpp:416] Provisioner recovery
> complete
> I0629 10:46:22.163045  5949 slave.cpp:6168] Finished recovery
> I0629 10:46:22.163465  5949 slave.cpp:6350] Querying resource estimator
> for oversubscribable resources
> I0629 10:46:22.163764  5947 slave.cpp:6364] Received oversubscribable
> resources {} from the resource estimator
> I0629 10:46:22.165632  5945 process.cpp:3779] Handling HTTP event for
> process 'slave(769)' with path: '/slave(769)/monitor/statistics.json'
> I0629 10:46:22.166679  5944 http.cpp:1114] HTTP GET for
> /slave(769)/monitor/statistics.json from 172.17.0.6:45898
> I0629 10:46:22.166743  5944 http.cpp:935] Authorizing principal
> 'test-principal' to GET the '/monitor/statistics.json' endpoint
> I0629 10:46:22.168628  5957 slave.cpp:818] Agent terminating
> [       OK ] Endpoint/SlaveEndpointTest.UnauthorizedRequest/1 (23 ms)
> [ RUN      ] Endpoint/SlaveEndpointTest.UnauthorizedRequest/2
> I0629 10:46:22.177464  5916 containerizer.cpp:230] Using isolation:
> posix/cpu,posix/mem,filesystem/posix,network/cni,environment_secret
> W0629 10:46:22.177901  5916 backend.cpp:76] Failed to create 'aufs'
> backend: AufsBackend requires root privileges
> W0629 10:46:22.177997  5916 backend.cpp:76] Failed to create 'bind'
> backend: BindBackend requires root privileges
> I0629 10:46:22.178028  5916 provisioner.cpp:255] Using default backend
> 'copy'
> I0629 10:46:22.180943  5946 slave.cpp:249] Mesos agent started on (770)@
> 172.17.0.6:43517
> I0629 10:46:22.180968  5946 slave.cpp:250] Flags at startup: --acls=""
> --appc_simple_discovery_uri_prefix="http://"
> --appc_store_dir="/tmp/Endpoint_SlaveEndpointTest_UnauthorizedRequest_2_WDtjfF/store/appc"
> --authenticate_http_readonly="true" --authenticate_http_readwrite="true"
> --authenticatee="crammd5" --authentication_backoff_factor="1secs"
> --authorizer="local" --cgroups_cpu_enable_pids_and_tids_count="false"
> --cgroups_enable_cfs="false" --cgroups_hierarchy="/sys/fs/cgroup"
> --cgroups_limit_swap="false" --cgroups_root="mesos"
> --container_disk_watch_interval="15secs" --containerizers="mesos"
> --credential="/tmp/Endpoint_SlaveEndpointTest_UnauthorizedRequest_2_WDtjfF/credential"
> --default_role="*" --disk_watch_interval="1mins" --docker="docker"
> --docker_kill_orphans="true" --docker_registry="https://reg
> istry-1.docker.io" --docker_remove_delay="6hrs"
> --docker_socket="/var/run/docker.sock" --docker_stop_timeout="0ns"
> --docker_store_dir="/tmp/Endpoint_SlaveEndpointTest_Unauthor
> izedRequest_2_WDtjfF/store/docker" --docker_volume_checkpoint_dir
> ="/var/run/mesos/isolators/docker/volume" --enforce_container_disk_quota="false"
> --executor_registration_timeout="1mins" --executor_reregistration_timeout="2secs"
> --executor_shutdown_grace_period="5secs" --fetcher_cache_dir="/tmp/Endp
> oint_SlaveEndpointTest_UnauthorizedRequest_2_WDtjfF/fetch"
> --fetcher_cache_size="2GB" --frameworks_home="" --gc_delay="1weeks"
> --gc_disk_headroom="0.1" --hadoop_home="" --help="false"
> --hostname_lookup="true" --http_command_executor="false"
> --http_credentials="/tmp/Endpoint_SlaveEndpointTest_Unauthor
> izedRequest_2_WDtjfF/http_credentials" --http_heartbeat_interval="30secs"
> --initialize_driver_logging="true" --isolation="posix/cpu,posix/mem"
> --launcher="posix" --launcher_dir="/mesos/mesos-1.4.0/_build/src"
> --logbufsecs="0" --logging_level="INFO" --max_completed_executors_per_framework="150"
> --oversubscribed_resources_interval="15secs" --perf_duration="10secs"
> --perf_interval="1mins" --port="5051" --qos_correction_interval_min="0ns"
> --quiet="false" --recover="reconnect" --recovery_timeout="15mins"
> --registration_backoff_factor="10ms" --resources="cpus:2;gpus:0;mem
> :1024;disk:1024;ports:[31000-32000]" --revocable_cpu_low_priority="true"
> --runtime_dir="/tmp/Endpoint_SlaveEndpointTest_UnauthorizedRequest_2_WDtjfF"
> --sandbox_directory="/mnt/mesos/sandbox" --strict="true"
> --switch_user="true" --systemd_enable_support="true"
> --systemd_runtime_directory="/run/systemd/system" --version="false"
> --work_dir="/tmp/Endpoint_SlaveEndpointTest_UnauthorizedRequest_2_9WJXvF"
> I0629 10:46:22.181486  5946 credentials.hpp:86] Loading credential for
> authentication from '/tmp/Endpoint_SlaveEndpointTe
> st_UnauthorizedRequest_2_WDtjfF/credential'
> I0629 10:46:22.181650  5946 slave.cpp:282] Agent using credential for:
> test-principal
> I0629 10:46:22.181676  5946 credentials.hpp:37] Loading credentials for
> authentication from '/tmp/Endpoint_SlaveEndpointTe
> st_UnauthorizedRequest_2_WDtjfF/http_credentials'
> I0629 10:46:22.181993  5946 http.cpp:974] Creating default 'basic' HTTP
> authenticator for realm 'mesos-agent-readonly'
> I0629 10:46:22.182152  5946 http.cpp:974] Creating default 'basic' HTTP
> authenticator for realm 'mesos-agent-readwrite'
> I0629 10:46:22.183430  5946 slave.cpp:553] Agent resources:
> [{"name":"cpus","scalar":{"value":2.0},"type":"SCALAR"},{"
> name":"mem","scalar":{"value":1024.0},"type":"SCALAR"},{"nam
> e":"disk","scalar":{"value":1024.0},"type":"SCALAR"},{"nam
> e":"ports","ranges":{"range":[{"begin":31000,"end":32000}]},
> "type":"RANGES"}]
> I0629 10:46:22.183640  5946 slave.cpp:561] Agent attributes: [  ]
> I0629 10:46:22.183653  5946 slave.cpp:566] Agent hostname: d89378cfb216
> I0629 10:46:22.183761  5938 status_update_manager.cpp:177] Pausing sending
> status updates
> I0629 10:46:22.185078  5947 state.cpp:64] Recovering state from
> '/tmp/Endpoint_SlaveEndpointTest_UnauthorizedRequest_2_9WJXvF/meta'
> I0629 10:46:22.185407  5938 status_update_manager.cpp:203] Recovering
> status update manager
> I0629 10:46:22.185674  5935 containerizer.cpp:582] Recovering containerizer
> I0629 10:46:22.187149  5947 provisioner.cpp:416] Provisioner recovery
> complete
> I0629 10:46:22.187541  5936 slave.cpp:6168] Finished recovery
> I0629 10:46:22.188107  5936 slave.cpp:6350] Querying resource estimator
> for oversubscribable resources
> I0629 10:46:22.188417  5937 slave.cpp:6364] Received oversubscribable
> resources {} from the resource estimator
> I0629 10:46:22.191155  5941 process.cpp:3779] Handling HTTP event for
> process 'slave(770)' with path: '/slave(770)/containers'
> I0629 10:46:22.192495  5955 http.cpp:1114] HTTP GET for
> /slave(770)/containers from 172.17.0.6:45902
> I0629 10:46:22.192571  5955 http.cpp:935] Authorizing principal
> 'test-principal' to GET the '/containers' endpoint
> I0629 10:46:22.195428  5952 slave.cpp:818] Agent terminating
> [       OK ] Endpoint/SlaveEndpointTest.UnauthorizedRequest/2 (34 ms)
> [ RUN      ] Endpoint/SlaveEndpointTest.NoAuthorizer/0
> I0629 10:46:22.212551  5916 containerizer.cpp:230] Using isolation:
> posix/cpu,posix/mem,filesystem/posix,network/cni,environment_secret
> W0629 10:46:22.213062  5916 backend.cpp:76] Failed to create 'aufs'
> backend: AufsBackend requires root privileges
> W0629 10:46:22.213184  5916 backend.cpp:76] Failed to create 'bind'
> backend: BindBackend requires root privileges
> I0629 10:46:22.213232  5916 provisioner.cpp:255] Using default backend
> 'copy'
> I0629 10:46:22.214804  5916 cluster.cpp:448] Creating default 'local'
> authorizer
> I0629 10:46:22.216254  5951 slave.cpp:249] Mesos agent started on (771)@
> 172.17.0.6:43517
> I0629 10:46:22.216276 5951 slave.cpp:250] Flags at startup: --acls=""
> --appc_simple_discovery_uri_prefix="http://"
> --appc_store_dir="/tmp/Endpoint_SlaveEndpointTest_NoAuthorizer_0_fxrMrE/store/appc"
> --authenticate_http_readonly="true" --authenticate_http_readwrite="true"
> --authenticatee="crammd5" --authentication_backoff_factor="1secs"
> --authorizer="local" --cgroups_cpu_enable_pids_and_tids_count="false"
> --cgroups_enable_cfs="false" --cgroups_hierarchy="/sys/fs/cgroup"
> --cgroups_limit_swap="false" --cgroups_root="mesos"
> --container_disk_watch_interval="15secs" --containerizers="mesos"
> --credential="/tmp/Endpoint_SlaveEndpointTest_NoAuthorizer_0_fxrMrE/credential"
> --default_role="*" --disk_watch_interval="1mins" --docker="docker"
> --docker_kill_orphans="true" --docker_registry="https://reg
> istry-1.docker.io" --docker_remove_delay="6hrs"
> --docker_socket="/var/run/docker.sock" --docker_stop_timeout="0ns"
> --docker_store_dir="/tmp/Endpoint_SlaveEndpointTest_NoAuthorizer_0_fxrMrE/store/docker"
> --docker_volume_checkpoint_dir="/var/run/mesos/isolators/docker/volume"
> --enforce_container_disk_quota="false" --executor_registration_timeout="1mins"
> --executor_reregistration_timeout="2secs" --executor_shutdown_grace_period="5secs"
> --fetcher_cache_dir="/tmp/Endpoint_SlaveEndpointTest_NoAuthorizer_0_fxrMrE/fetch"
> --fetcher_cache_size="2GB" --frameworks_home="" --gc_delay="1weeks"
> --gc_disk_headroom="0.1" --hadoop_home="" --help="false"
> --hostname_lookup="true" --http_command_executor="false"
> --http_credentials="/tmp/Endpoint_SlaveEndpointTest_NoAuthor
> izer_0_fxrMrE/http_credentials" --http_heartbeat_interval="30secs"
> --initialize_driver_logging="true" --isolation="posix/cpu,posix/mem"
> --launcher="posix" --launcher_dir="/mesos/mesos-1.4.0/_build/src"
> --logbufsecs="0" --logging_level="INFO" --max_completed_executors_per_framework="150"
> --oversubscribed_resources_interval="15secs" --perf_duration="10secs"
> --perf_interval="1mins" --port="5051" --qos_correction_interval_min="0ns"
> --quiet="false" --recover="reconnect" --recovery_timeout="15mins"
> --registration_backoff_factor="10ms" --resources="cpus:2;gpus:0;mem
> :1024;disk:1024;ports:[31000-32000]" --revocable_cpu_low_priority="true"
> --runtime_dir="/tmp/Endpoint_SlaveEndpointTest_NoAuthorizer_0_fxrMrE"
> --sandbox_directory="/mnt/mesos/sandbox" --strict="true"
> --switch_user="true" --systemd_enable_support="true"
> --systemd_runtime_directory="/run/systemd/system" --version="false"
> --work_dir="/tmp/Endpoint_SlaveEndpointTest_NoAuthorizer_0_DQKgDE"
> I0629 10:46:22.216642  5951 credentials.hpp:86] Loading credential for
> authentication from '/tmp/Endpoint_SlaveEndpointTe
> st_NoAuthorizer_0_fxrMrE/credential'
> I0629 10:46:22.216795  5951 slave.cpp:282] Agent using credential for:
> test-principal
> I0629 10:46:22.216819  5951 credentials.hpp:37] Loading credentials for
> authentication from '/tmp/Endpoint_SlaveEndpointTe
> st_NoAuthorizer_0_fxrMrE/http_credentials'
> I0629 10:46:22.217043  5951 http.cpp:974] Creating default 'basic' HTTP
> authenticator for realm 'mesos-agent-readonly'
> I0629 10:46:22.217275  5951 http.cpp:974] Creating default 'basic' HTTP
> authenticator for realm 'mesos-agent-readwrite'
> I0629 10:46:22.218538  5951 slave.cpp:553] Agent resources:
> [{"name":"cpus","scalar":{"value":2.0},"type":"SCALAR"},{"
> name":"mem","scalar":{"value":1024.0},"type":"SCALAR"},{"nam
> e":"disk","scalar":{"value":1024.0},"type":"SCALAR"},{"nam
> e":"ports","ranges":{"range":[{"begin":31000,"end":32000}]},
> "type":"RANGES"}]
> I0629 10:46:22.218753  5951 slave.cpp:561] Agent attributes: [  ]
> I0629 10:46:22.218771  5951 slave.cpp:566] Agent hostname: d89378cfb216
> I0629 10:46:22.218899  5943 status_update_manager.cpp:177] Pausing sending
> status updates
> I0629 10:46:22.220191  5955 state.cpp:64] Recovering state from
> '/tmp/Endpoint_SlaveEndpointTest_NoAuthorizer_0_DQKgDE/meta'
> I0629 10:46:22.220526  5940 status_update_manager.cpp:203] Recovering
> status update manager
> I0629 10:46:22.220748  5946 containerizer.cpp:582] Recovering containerizer
> I0629 10:46:22.222154  5936 provisioner.cpp:416] Provisioner recovery
> complete
> I0629 10:46:22.222493  5946 slave.cpp:6168] Finished recovery
> I0629 10:46:22.222921  5946 slave.cpp:6350] Querying resource estimator
> for oversubscribable resources
> I0629 10:46:22.223170  5945 slave.cpp:6364] Received oversubscribable
> resources {} from the resource estimator
> I0629 10:46:22.225536  5951 process.cpp:3779] Handling HTTP event for
> process 'slave(771)' with path: '/slave(771)/monitor/statistics'
> I0629 10:46:22.226707  5949 http.cpp:1114] HTTP GET for
> /slave(771)/monitor/statistics from 172.17.0.6:45904
> I0629 10:46:22.226769 5949 http.cpp:935] Authorizing principal
> 'test-principal' to GET the '/monitor/statistics' endpoint
> I0629 10:46:22.229537  5953 slave.cpp:818] Agent terminating
> [       OK ] Endpoint/SlaveEndpointTest.NoAuthorizer/0 (26 ms)
> [ RUN      ] Endpoint/SlaveEndpointTest.NoAuthorizer/1
> I0629 10:46:22.238651  5916 containerizer.cpp:230] Using isolation:
> posix/cpu,posix/mem,filesystem/posix,network/cni,environment_secret
> W0629 10:46:22.239084  5916 backend.cpp:76] Failed to create 'aufs'
> backend: AufsBackend requires root privileges
> W0629 10:46:22.239169  5916 backend.cpp:76] Failed to create 'bind'
> backend: BindBackend requires root privileges
> I0629 10:46:22.239197  5916 provisioner.cpp:255] Using default backend
> 'copy'
> I0629 10:46:22.240762  5916 cluster.cpp:448] Creating default 'local'
> authorizer
> I0629 10:46:22.242156  5950 slave.cpp:249] Mesos agent started on (772)@
> 172.17.0.6:43517
> I0629 10:46:22.242178  5950 slave.cpp:250] Flags at startup: --acls=""
> --appc_simple_discovery_uri_prefix="http://"
> --appc_store_dir="/tmp/Endpoint_SlaveEndpointTest_NoAuthorizer_1_50jgVD/store/appc"
> --authenticate_http_readonly="true" --authenticate_http_readwrite="true"
> --authenticatee="crammd5" --authentication_backoff_factor="1secs"
> --authorizer="local" --cgroups_cpu_enable_pids_and_tids_count="false"
> --cgroups_enable_cfs="false" --cgroups_hierarchy="/sys/fs/cgroup"
> --cgroups_limit_swap="false" --cgroups_root="mesos"
> --container_disk_watch_interval="15secs" --containerizers="mesos"
> --credential="/tmp/Endpoint_SlaveEndpointTest_NoAuthorizer_1_50jgVD/credential"
> --default_role="*" --disk_watch_interval="1mins" --docker="docker"
> --docker_kill_orphans="true" --docker_registry="https://reg
> istry-1.docker.io" --docker_remove_delay="6hrs"
> --docker_socket="/var/run/docker.sock" --docker_stop_timeout="0ns"
> --docker_store_dir="/tmp/Endpoint_SlaveEndpointTest_NoAuthorizer_1_50jgVD/store/docker"
> --docker_volume_checkpoint_dir="/var/run/mesos/isolators/docker/volume"
> --enforce_container_disk_quota="false" --executor_registration_timeout="1mins"
> --executor_reregistration_timeout="2secs" --executor_shutdown_grace_period="5secs"
> --fetcher_cache_dir="/tmp/Endpoint_SlaveEndpointTest_NoAuthorizer_1_50jgVD/fetch"
> --fetcher_cache_size="2GB" --frameworks_home="" --gc_delay="1weeks"
> --gc_disk_headroom="0.1" --hadoop_home="" --help="false"
> --hostname_lookup="true" --http_command_executor="false"
> --http_credentials="/tmp/Endpoint_SlaveEndpointTest_NoAuthor
> izer_1_50jgVD/http_credentials" --http_heartbeat_interval="30secs"
> --initialize_driver_logging="true" --isolation="posix/cpu,posix/mem"
> --launcher="posix" --launcher_dir="/mesos/mesos-1.4.0/_build/src"
> --logbufsecs="0" --logging_level="INFO" --max_completed_executors_per_framework="150"
> --oversubscribed_resources_interval="15secs" --perf_duration="10secs"
> --perf_interval="1mins" --port="5051" --qos_correction_interval_min="0ns"
> --quiet="false" --recover="reconnect" --recovery_timeout="15mins"
> --registration_backoff_factor="10ms" --resources="cpus:2;gpus:0;mem
> :1024;disk:1024;ports:[31000-32000]" --revocable_cpu_low_priority="true"
> --runtime_dir="/tmp/Endpoint_SlaveEndpointTest_NoAuthorizer_1_50jgVD"
> --sandbox_directory="/mnt/mesos/sandbox" --strict="true"
> --switch_user="true" --systemd_enable_support="true"
> --systemd_runtime_directory="/run/systemd/system" --version="false"
> --work_dir="/tmp/Endpoint_SlaveEndpointTest_NoAuthorizer_1_7QmP2D"
> I0629 10:46:22.242506  5950 credentials.hpp:86] Loading credential for
> authentication from '/tmp/Endpoint_SlaveEndpointTe
> st_NoAuthorizer_1_50jgVD/credential'
> I0629 10:46:22.242647  5950 slave.cpp:282] Agent using credential for:
> test-principal
> I0629 10:46:22.242669  5950 credentials.hpp:37] Loading credentials for
> authentication from '/tmp/Endpoint_SlaveEndpointTe
> st_NoAuthorizer_1_50jgVD/http_credentials'
> I0629 10:46:22.242875  5950 http.cpp:974] Creating default 'basic' HTTP
> authenticator for realm 'mesos-agent-readonly'
> I0629 10:46:22.243052  5950 http.cpp:974] Creating default 'basic' HTTP
> authenticator for realm 'mesos-agent-readwrite'
> I0629 10:46:22.244141  5950 slave.cpp:553] Agent resources:
> [{"name":"cpus","scalar":{"value":2.0},"type":"SCALAR"},{"
> name":"mem","scalar":{"value":1024.0},"type":"SCALAR"},{"nam
> e":"disk","scalar":{"value":1024.0},"type":"SCALAR"},{"nam
> e":"ports","ranges":{"range":[{"begin":31000,"end":32000}]},
> "type":"RANGES"}]
> I0629 10:46:22.244341  5950 slave.cpp:561] Agent attributes: [  ]
> I0629 10:46:22.244354  5950 slave.cpp:566] Agent hostname: d89378cfb216
> I0629 10:46:22.244467  5957 status_update_manager.cpp:177] Pausing sending
> status updates
> I0629 10:46:22.245609  5940 state.cpp:64] Recovering state from
> '/tmp/Endpoint_SlaveEndpointTest_NoAuthorizer_1_7QmP2D/meta'
> I0629 10:46:22.245862  5942 status_update_manager.cpp:203] Recovering
> status update manager
> I0629 10:46:22.246096  5937 containerizer.cpp:582] Recovering containerizer
> I0629 10:46:22.247349  5956 provisioner.cpp:416] Provisioner recovery
> complete
> I0629 10:46:22.247714  5950 slave.cpp:6168] Finished recovery
> I0629 10:46:22.248100  5950 slave.cpp:6350] Querying resource estimator
> for oversubscribable resources
> I0629 10:46:22.248437  5948 slave.cpp:6364] Received oversubscribable
> resources {} from the resource estimator
> I0629 10:46:22.250377  5948 process.cpp:3779] Handling HTTP event for
> process 'slave(772)' with path: '/slave(772)/monitor/statistics.json'
> I0629 10:46:22.251487  5945 http.cpp:1114] HTTP GET for
> /slave(772)/monitor/statistics.json from 172.17.0.6:45906
> I0629 10:46:22.251554  5945 http.cpp:935] Authorizing principal
> 'test-principal' to GET the '/monitor/statistics.json' endpoint
> I0629 10:46:22.254086  5936 slave.cpp:818] Agent terminating
> [       OK ] Endpoint/SlaveEndpointTest.NoAuthorizer/1 (24 ms)
> [ RUN      ] Endpoint/SlaveEndpointTest.NoAuthorizer/2
> I0629 10:46:22.263178  5916 containerizer.cpp:230] Using isolation:
> posix/cpu,posix/mem,filesystem/posix,network/cni,environment_secret
> W0629 10:46:22.263629  5916 backend.cpp:76] Failed to create 'aufs'
> backend: AufsBackend requires root privileges
> W0629 10:46:22.263712  5916 backend.cpp:76] Failed to create 'bind'
> backend: BindBackend requires root privileges
> I0629 10:46:22.263739  5916 provisioner.cpp:255] Using default backend
> 'copy'
> I0629 10:46:22.265265  5916 cluster.cpp:448] Creating default 'local'
> authorizer
> I0629 10:46:22.266628  5945 slave.cpp:249] Mesos agent started on (773)@
> 172.17.0.6:43517
> I0629 10:46:22.266647  5945 slave.cpp:250] Flags at startup: --acls=""
> --appc_simple_discovery_uri_prefix="http://"
> --appc_store_dir="/tmp/Endpoint_SlaveEndpointTest_NoAuthorizer_2_CogoDD/store/appc"
> --authenticate_http_readonly="true" --authenticate_http_readwrite="true"
> --authenticatee="crammd5" --authentication_backoff_factor="1secs"
> --authorizer="local" --cgroups_cpu_enable_pids_and_tids_count="false"
> --cgroups_enable_cfs="false" --cgroups_hierarchy="/sys/fs/cgroup"
> --cgroups_limit_swap="false" --cgroups_root="mesos"
> --container_disk_watch_interval="15secs" --containerizers="mesos"
> --credential="/tmp/Endpoint_SlaveEndpointTest_NoAuthorizer_2_CogoDD/credential"
> --default_role="*" --disk_watch_interval="1mins" --docker="docker"
> --docker_kill_orphans="true" --docker_registry="https://reg
> istry-1.docker.io" --docker_remove_delay="6hrs"
> --docker_socket="/var/run/docker.sock" --docker_stop_timeout="0ns"
> --docker_store_dir="/tmp/Endpoint_SlaveEndpointTest_NoAuthorizer_2_CogoDD/store/docker"
> --docker_volume_checkpoint_dir="/var/run/mesos/isolators/docker/volume"
> --enforce_container_disk_quota="false" --executor_registration_timeout="1mins"
> --executor_reregistration_timeout="2secs" --executor_shutdown_grace_period="5secs"
> --fetcher_cache_dir="/tmp/Endpoint_SlaveEndpointTest_NoAuthorizer_2_CogoDD/fetch"
> --fetcher_cache_size="2GB" --frameworks_home="" --gc_delay="1weeks"
> --gc_disk_headroom="0.1" --hadoop_home="" --help="false"
> --hostname_lookup="true" --http_command_executor="false"
> --http_credentials="/tmp/Endpoint_SlaveEndpointTest_NoAuthor
> izer_2_CogoDD/http_credentials" --http_heartbeat_interval="30secs"
> --initialize_driver_logging="true" --isolation="posix/cpu,posix/mem"
> --launcher="posix" --launcher_dir="/mesos/mesos-1.4.0/_build/src"
> --logbufsecs="0" --logging_level="INFO" --max_completed_executors_per_framework="150"
> --oversubscribed_resources_interval="15secs" --perf_duration="10secs"
> --perf_interval="1mins" --port="5051" --qos_correction_interval_min="0ns"
> --quiet="false" --recover="reconnect" --recovery_timeout="15mins"
> --registration_backoff_factor="10ms" --resources="cpus:2;gpus:0;mem
> :1024;disk:1024;ports:[31000-32000]" --revocable_cpu_low_priority="true"
> --runtime_dir="/tmp/Endpoint_SlaveEndpointTest_NoAuthorizer_2_CogoDD"
> --sandbox_directory="/mnt/mesos/sandbox" --strict="true"
> --switch_user="true" --systemd_enable_support="true"
> --systemd_runtime_directory="/run/systemd/system" --version="false"
> --work_dir="/tmp/Endpoint_SlaveEndpointTest_NoAuthorizer_2_2llkHD"
> I0629 10:46:22.266999  5945 credentials.hpp:86] Loading credential for
> authentication from '/tmp/Endpoint_SlaveEndpointTe
> st_NoAuthorizer_2_CogoDD/credential'
> I0629 10:46:22.267143  5945 slave.cpp:282] Agent using credential for:
> test-principal
> I0629 10:46:22.267163  5945 credentials.hpp:37] Loading credentials for
> authentication from '/tmp/Endpoint_SlaveEndpointTe
> st_NoAuthorizer_2_CogoDD/http_credentials'
> I0629 10:46:22.267385  5945 http.cpp:974] Creating default 'basic' HTTP
> authenticator for realm 'mesos-agent-readonly'
> I0629 10:46:22.267550  5945 http.cpp:974] Creating default 'basic' HTTP
> authenticator for realm 'mesos-agent-readwrite'
> I0629 10:46:22.268772  5945 slave.cpp:553] Agent resources:
> [{"name":"cpus","scalar":{"value":2.0},"type":"SCALAR"},{"
> name":"mem","scalar":{"value":1024.0},"type":"SCALAR"},{"nam
> e":"disk","scalar":{"value":1024.0},"type":"SCALAR"},{"nam
> e":"ports","ranges":{"range":[{"begin":31000,"end":32000}]},
> "type":"RANGES"}]
> I0629 10:46:22.268971  5945 slave.cpp:561] Agent attributes: [  ]
> I0629 10:46:22.268983  5945 slave.cpp:566] Agent hostname: d89378cfb216
> I0629 10:46:22.269085  5940 status_update_manager.cpp:177] Pausing sending
> status updates
> I0629 10:46:22.270236  5947 state.cpp:64] Recovering state from
> '/tmp/Endpoint_SlaveEndpointTest_NoAuthorizer_2_2llkHD/meta'
> I0629 10:46:22.270462  5941 status_update_manager.cpp:203] Recovering
> status update manager
> I0629 10:46:22.270632  5951 containerizer.cpp:582] Recovering containerizer
> I0629 10:46:22.271961  5935 provisioner.cpp:416] Provisioner recovery
> complete
> I0629 10:46:22.272322  5942 slave.cpp:6168] Finished recovery
> I0629 10:46:22.272727  5942 slave.cpp:6350] Querying resource estimator
> for oversubscribable resources
> I0629 10:46:22.272964  5957 slave.cpp:6364] Received oversubscribable
> resources {} from the resource estimator
> I0629 10:46:22.274818  5951 process.cpp:3779] Handling HTTP event for
> process 'slave(773)' with path: '/slave(773)/containers'
> I0629 10:46:22.275825  5944 http.cpp:1114] HTTP GET for
> /slave(773)/containers from 172.17.0.6:45908
> I0629 10:46:22.275889  5944 http.cpp:935] Authorizing principal
> 'test-principal' to GET the '/containers' endpoint
> I0629 10:46:22.278519  5947 slave.cpp:818] Agent terminating
> [       OK ] Endpoint/SlaveEndpointTest.NoAuthorizer/2 (25 ms)
> [----------] 9 tests from Endpoint/SlaveEndpointTest (256 ms total)
>
> [----------] Global test environment tear-down
> [==========] 1615 tests from 178 test cases ran. (553757 ms total)
> [  PASSED  ] 1614 tests.
> [  FAILED  ] 1 test, listed below:
> [  FAILED  ] DefaultExecutorCheckTest.CommandCheckDeliveredAndReconciled
>
>  1 FAILED TEST
>   YOU HAVE 20 DISABLED TESTS
>
> I0629 10:46:22.367902  5959 process.cpp:968] Failed to accept socket:
> future discarded
> make[4]: *** [check-local] Error 1
> make[4]: Leaving directory `/mesos/mesos-1.4.0/_build/src'
> make[3]: *** [check-am] Error 2
> make[3]: Leaving directory `/mesos/mesos-1.4.0/_build/src'
> make[2]: *** [check] Error 2
> make[2]: Leaving directory `/mesos/mesos-1.4.0/_build/src'
> make[1]: *** [check-recursive] Error 1
> make[1]: Leaving directory `/mesos/mesos-1.4.0/_build'
> make: *** [distcheck] Error 1
> + docker rmi mesos-1498730138-23020
> Untagged: mesos-1498730138-23020:latest
> Deleted: sha256:a46e89696a25d90b999d2422bddd8bb4ee94442ac0fee14780f1d
> be87cf8a358
> Deleted: sha256:a8e339cb97a0dbb82c7825c184d8f08f5dc938ff611195f17ef21
> e177fd98b02
> Deleted: sha256:fec920a73e553038cf6b832b399480c14e0d13bfb87b3ee3f7176
> 0905d1f9b53
> Deleted: sha256:931cbb1a65bea70ae82132d617b8f2809da76834670fa40a3accb
> 161f67b2abc
> Deleted: sha256:f45a09865bfcd062e886679a35065dcfe5148ab53dae8ccef38e9
> 4c4fda6594c
> Deleted: sha256:3c04e051c2f9fec38d5cd015b3a70d61e05b3297629a166f5803e
> a5189522e13
> Deleted: sha256:8d7a8b88b206d1e15fc6c3f8dbd51b00a19d3b3bbd52ce10b738d
> cc5eb06a07d
> Deleted: sha256:8d294d95139695e4dc767ed8e9e12178ce0d34c7a8e78532e0a4d
> 0157537a502
> Deleted: sha256:39f13a12c8f449f99fd4f61c2432d3333fd7d21e58f7bf13b077f
> 73cd936b1bd
> Deleted: sha256:e346ecb17890ff059a6e4b13d657aa090012e2d76518882963f7f
> 9a9beb759bf
> Deleted: sha256:8e845b1a4fa25eab3218c6f881f5be212e133029b9740098775a0
> 4f0be131587
> Deleted: sha256:9fb49761871612c1d875725de7a11e8806a16ca790f871641232f
> 26249e60b45
> Deleted: sha256:99578398b9c0ed235bc3a271045dd4df71d90111383c5a70e4d5b
> 57a20a3bc96
> Deleted: sha256:409c68662e6ce9169550590cbe9fbbd8927dcb6e008caf3d17ba9
> e0bfd1833f4
> Deleted: sha256:537d4228ebec6938ff99a69b7618a27be7c5b5b731f15108875d6
> 05a7b35b19a
> Deleted: sha256:9b50486bd0602fa129652b72b277e462dc6a067812d8de382fe03
> fde236038a1
> Deleted: sha256:bc34ce289bad68950a6a3a013f781ee97fda98ff64febbdf9a332
> 8cdb24dba3b
> Deleted: sha256:196498fd2aa65eb2eff51c5b3d45c18fb95f4d168f41c89587559
> ccab2effbf2
> Deleted: sha256:0c9dee12ea8148733b1ef4c4577836a7c775229cc780a9802f460
> 6123f1b417b
> Deleted: sha256:3e9d65506381039c9cc4d5980233c7543c93beaa70c1fae8a6e01
> b3b8fa757c9
> Deleted: sha256:dce46f3414e55e4b5ee8018491b4e9f372457dadc8d922a4cf1a4
> 7f65bd5cabe
> Deleted: sha256:502b61b5ee8311c8f281099ee9ee696cc56dfaf86fc1df2c271cd
> 97013ab056a
> Deleted: sha256:c388bc505280ed2b8d7845dab99d949f70baa05189c6792ffa064
> 13e6bfb07e1
> Deleted: sha256:f73fd28ff5dc3b5f9d10fb126bbdb5c6b785f0460a712e4deac2e
> 8388068de24
> Deleted: sha256:1735da383aaac4c8852ee72f67f1f871ca83803ae3c000fc75fd7
> d3d46feccc7
> Build step 'Execute shell' marked build as failure
>

Mime
  • Unnamed multipart/alternative (inline, None, 0 bytes)
View raw message