mesos-builds mailing list archives

Site index · List index
Message view « Date » · « Thread »
Top « Date » · « Thread »
From Vinod Kone <vinodk...@apache.org>
Subject Re: Build failed in Jenkins: Mesos-Buildbot » cmake,clang,--verbose --enable-libevent --enable-ssl,GLOG_v=1 MESOS_VERBOSE=1,ubuntu:14.04,(ubuntu)&&(!ubuntu-us1)&&(!ubuntu-eu2) #3849
Date Thu, 29 Jun 2017 17:44:51 GMT
re-opened https://issues.apache.org/jira/browse/MESOS-7457

On Wed, Jun 28, 2017 at 10:38 PM, Apache Jenkins Server <
jenkins@builds.apache.org> wrote:

> See <https://builds.apache.org/job/Mesos-Buildbot/BUILDTOOL=
> cmake,COMPILER=clang,CONFIGURATION=--verbose%20--
> enable-libevent%20--enable-ssl,ENVIRONMENT=GLOG_v=1%
> 20MESOS_VERBOSE=1,OS=ubuntu%3A14.04,label_exp=(ubuntu)&&(!
> ubuntu-us1)&&(!ubuntu-eu2)/3849/display/redirect?page=changes>
>
> Changes:
>
> [vinodkone] Fixed parameters in JNI call for disconnected event.
>
> ------------------------------------------
> [...truncated 26.10 MB...]
> I0629 05:38:29.324017 31670 slave.cpp:6075] Finished recovery
> I0629 05:38:29.324466 31670 slave.cpp:6257] Querying resource estimator
> for oversubscribable resources
> I0629 05:38:29.324599 31676 slave.cpp:6271] Received oversubscribable
> resources {} from the resource estimator
> I0629 05:38:29.325371 31680 process.cpp:3731] Handling HTTP event for
> process 'slave(743)' with path: '/slave(743)/containers'
> I0629 05:38:29.325898 31678 http.cpp:1115] HTTP GET for
> /slave(743)/containers from 172.17.0.2:51733
> I0629 05:38:29.325939 31678 http.cpp:936] Authorizing principal
> 'test-principal' to GET the '/containers' endpoint
> I0629 05:38:29.340139 25997 slave.cpp:796] Agent terminating
> [       OK ] Endpoint/SlaveEndpointTest.AuthorizedRequest/2 (28 ms)
> [ RUN      ] Endpoint/SlaveEndpointTest.UnauthorizedRequest/0
> I0629 05:38:29.347096 25997 containerizer.cpp:221] Using isolation:
> posix/cpu,posix/mem,filesystem/posix,network/cni
> W0629 05:38:29.347514 25997 backend.cpp:76] Failed to create 'aufs'
> backend: AufsBackend requires root privileges
> W0629 05:38:29.347642 25997 backend.cpp:76] Failed to create 'bind'
> backend: BindBackend requires root privileges
> I0629 05:38:29.347663 25997 provisioner.cpp:249] Using default backend
> 'copy'
> I0629 05:38:29.354605 31681 slave.cpp:231] Mesos agent started on (744)@
> 172.17.0.2:39522
> I0629 05:38:29.354651 31681 slave.cpp:232] Flags at startup: --acls=""
> --appc_simple_discovery_uri_prefix="http://" --appc_store_dir="/tmp/mesos/store/appc"
> --authenticate_http_executors="true" --authenticate_http_readonly="true"
> --authenticate_http_readwrite="true" --authenticatee="crammd5"
> --authentication_backoff_factor="1secs" --authorizer="local"
> --cgroups_cpu_enable_pids_and_tids_count="false"
> --cgroups_enable_cfs="false" --cgroups_hierarchy="/sys/fs/cgroup"
> --cgroups_limit_swap="false" --cgroups_root="mesos" --container_disk_watch_interval="15secs"
> --containerizers="mesos" --credential="/tmp/Endpoint_SlaveEndpointTest_
> UnauthorizedRequest_0_MTL6d6/credential" --default_role="*"
> --disk_watch_interval="1mins" --docker="docker"
> --docker_kill_orphans="true" --docker_registry="https://
> registry-1.docker.io" --docker_remove_delay="6hrs"
> --docker_socket="/var/run/docker.sock" --docker_stop_timeout="0ns"
> --docker_store_dir="/tmp/mesos/store/docker" --docker_volume_checkpoint_
> dir="/var/run/mesos/isolators/docker/volume" --enforce_container_disk_quota="false"
> --executor_registration_timeout="1mins" --executor_reregistration_timeout="2secs"
> --executor_secret_key="/tmp/Endpoint_SlaveEndpointTest_
> UnauthorizedRequest_0_MTL6d6/executor_secret_key"
> --executor_shutdown_grace_period="5secs" --fetcher_cache_dir="/tmp/
> Endpoint_SlaveEndpointTest_UnauthorizedRequest_0_MTL6d6/fetch"
> --fetcher_cache_size="2GB" --frameworks_home="" --gc_delay="1weeks"
> --gc_disk_headroom="0.1" --hadoop_home="" --help="false"
> --hostname_lookup="true" --http_command_executor="false"
> --http_credentials="/tmp/Endpoint_SlaveEndpointTest_
> UnauthorizedRequest_0_MTL6d6/http_credentials" --http_heartbeat_interval="30secs"
> --initialize_driver_logging="true" --isolation="posix/cpu,posix/mem"
> --launcher="posix" --launcher_dir="/mesos/build/src" --logbufsecs="0"
> --logging_level="INFO" --max_completed_executors_per_framework="150"
> --oversubscribed_resources_interval="15secs" --perf_duration="10secs"
> --perf_interval="1mins" --port="5051" --qos_correction_interval_min="0ns"
> --quiet="false" --recover="reconnect" --recovery_timeout="15mins"
> --registration_backoff_factor="10ms" --resources="cpus:2;gpus:0;
> mem:1024;disk:1024;ports:[31000-32000]" --revocable_cpu_low_priority="true"
> --runtime_dir="/tmp/Endpoint_SlaveEndpointTest_UnauthorizedRequest_0_MTL6d6"
> --sandbox_directory="/mnt/mesos/sandbox" --strict="true"
> --switch_user="true" --systemd_enable_support="true"
> --systemd_runtime_directory="/run/systemd/system" --version="false"
> --work_dir="/tmp/Endpoint_SlaveEndpointTest_UnauthorizedRequest_0_PtDg7r"
> I0629 05:38:29.354977 31681 credentials.hpp:86] Loading credential for
> authentication from '/tmp/Endpoint_SlaveEndpointTest_
> UnauthorizedRequest_0_MTL6d6/credential'
> I0629 05:38:29.355135 31681 slave.cpp:264] Agent using credential for:
> test-principal
> I0629 05:38:29.355152 31681 credentials.hpp:37] Loading credentials for
> authentication from '/tmp/Endpoint_SlaveEndpointTest_
> UnauthorizedRequest_0_MTL6d6/http_credentials'
> I0629 05:38:29.355355 31681 http.cpp:975] Creating default 'basic' HTTP
> authenticator for realm 'mesos-agent-executor'
> I0629 05:38:29.355412 31681 http.cpp:996] Creating default 'jwt' HTTP
> authenticator for realm 'mesos-agent-executor'
> I0629 05:38:29.355557 31681 http.cpp:975] Creating default 'basic' HTTP
> authenticator for realm 'mesos-agent-readonly'
> I0629 05:38:29.355590 31681 http.cpp:996] Creating default 'jwt' HTTP
> authenticator for realm 'mesos-agent-readonly'
> I0629 05:38:29.355734 31681 http.cpp:975] Creating default 'basic' HTTP
> authenticator for realm 'mesos-agent-readwrite'
> I0629 05:38:29.355772 31681 http.cpp:996] Creating default 'jwt' HTTP
> authenticator for realm 'mesos-agent-readwrite'
> I0629 05:38:29.356353 31681 slave.cpp:531] Agent resources: cpus(*):2;
> mem(*):1024; disk(*):1024; ports(*):[31000-32000]
> I0629 05:38:29.356400 31681 slave.cpp:539] Agent attributes: [  ]
> I0629 05:38:29.356412 31681 slave.cpp:544] Agent hostname: 0e3805988b41
> I0629 05:38:29.356580 31680 status_update_manager.cpp:177] Pausing sending
> status updates
> I0629 05:38:29.357270 31681 state.cpp:62] Recovering state from
> '/tmp/Endpoint_SlaveEndpointTest_UnauthorizedRequest_0_PtDg7r/meta'
> I0629 05:38:29.357470 31681 status_update_manager.cpp:203] Recovering
> status update manager
> I0629 05:38:29.357532 31681 containerizer.cpp:608] Recovering containerizer
> I0629 05:38:29.358177 31681 provisioner.cpp:410] Provisioner recovery
> complete
> I0629 05:38:29.358389 31681 slave.cpp:6075] Finished recovery
> I0629 05:38:29.358937 31681 slave.cpp:6257] Querying resource estimator
> for oversubscribable resources
> I0629 05:38:29.359123 31681 slave.cpp:6271] Received oversubscribable
> resources {} from the resource estimator
> I0629 05:38:29.365641 31683 process.cpp:3731] Handling HTTP event for
> process 'slave(744)' with path: '/slave(744)/monitor/statistics'
> I0629 05:38:29.366174 31671 http.cpp:1115] HTTP GET for
> /slave(744)/monitor/statistics from 172.17.0.2:51734
> I0629 05:38:29.366215 31671 http.cpp:936] Authorizing principal
> 'test-principal' to GET the '/monitor/statistics' endpoint
> I0629 05:38:29.367363 31684 slave.cpp:796] Agent terminating
> [       OK ] Endpoint/SlaveEndpointTest.UnauthorizedRequest/0 (26 ms)
> [ RUN      ] Endpoint/SlaveEndpointTest.UnauthorizedRequest/1
> I0629 05:38:29.373605 25997 containerizer.cpp:221] Using isolation:
> posix/cpu,posix/mem,filesystem/posix,network/cni
> W0629 05:38:29.373956 25997 backend.cpp:76] Failed to create 'aufs'
> backend: AufsBackend requires root privileges
> W0629 05:38:29.374008 25997 backend.cpp:76] Failed to create 'bind'
> backend: BindBackend requires root privileges
> I0629 05:38:29.374025 25997 provisioner.cpp:249] Using default backend
> 'copy'
> I0629 05:38:29.375166 31674 slave.cpp:231] Mesos agent started on (745)@
> 172.17.0.2:39522
> I0629 05:38:29.375192 31674 slave.cpp:232] Flags at startup: --acls=""
> --appc_simple_discovery_uri_prefix="http://" --appc_store_dir="/tmp/mesos/store/appc"
> --authenticate_http_executors="true" --authenticate_http_readonly="true"
> --authenticate_http_readwrite="true" --authenticatee="crammd5"
> --authentication_backoff_factor="1secs" --authorizer="local"
> --cgroups_cpu_enable_pids_and_tids_count="false"
> --cgroups_enable_cfs="false" --cgroups_hierarchy="/sys/fs/cgroup"
> --cgroups_limit_swap="false" --cgroups_root="mesos" --container_disk_watch_interval="15secs"
> --containerizers="mesos" --credential="/tmp/Endpoint_SlaveEndpointTest_
> UnauthorizedRequest_1_EM1MUG/credential" --default_role="*"
> --disk_watch_interval="1mins" --docker="docker"
> --docker_kill_orphans="true" --docker_registry="https://
> registry-1.docker.io" --docker_remove_delay="6hrs"
> --docker_socket="/var/run/docker.sock" --docker_stop_timeout="0ns"
> --docker_store_dir="/tmp/mesos/store/docker" --docker_volume_checkpoint_
> dir="/var/run/mesos/isolators/docker/volume" --enforce_container_disk_quota="false"
> --executor_registration_timeout="1mins" --executor_reregistration_timeout="2secs"
> --executor_secret_key="/tmp/Endpoint_SlaveEndpointTest_
> UnauthorizedRequest_1_EM1MUG/executor_secret_key"
> --executor_shutdown_grace_period="5secs" --fetcher_cache_dir="/tmp/
> Endpoint_SlaveEndpointTest_UnauthorizedRequest_1_EM1MUG/fetch"
> --fetcher_cache_size="2GB" --frameworks_home="" --gc_delay="1weeks"
> --gc_disk_headroom="0.1" --hadoop_home="" --help="false"
> --hostname_lookup="true" --http_command_executor="false"
> --http_credentials="/tmp/Endpoint_SlaveEndpointTest_
> UnauthorizedRequest_1_EM1MUG/http_credentials" --http_heartbeat_interval="30secs"
> --initialize_driver_logging="true" --isolation="posix/cpu,posix/mem"
> --launcher="posix" --launcher_dir="/mesos/build/src" --logbufsecs="0"
> --logging_level="INFO" --max_completed_executors_per_framework="150"
> --oversubscribed_resources_interval="15secs" --perf_duration="10secs"
> --perf_interval="1mins" --port="5051" --qos_correction_interval_min="0ns"
> --quiet="false" --recover="reconnect" --recovery_timeout="15mins"
> --registration_backoff_factor="10ms" --resources="cpus:2;gpus:0;
> mem:1024;disk:1024;ports:[31000-32000]" --revocable_cpu_low_priority="true"
> --runtime_dir="/tmp/Endpoint_SlaveEndpointTest_UnauthorizedRequest_1_EM1MUG"
> --sandbox_directory="/mnt/mesos/sandbox" --strict="true"
> --switch_user="true" --systemd_enable_support="true"
> --systemd_runtime_directory="/run/systemd/system" --version="false"
> --work_dir="/tmp/Endpoint_SlaveEndpointTest_UnauthorizedRequest_1_SILwJ2"
> I0629 05:38:29.375421 31674 credentials.hpp:86] Loading credential for
> authentication from '/tmp/Endpoint_SlaveEndpointTest_
> UnauthorizedRequest_1_EM1MUG/credential'
> I0629 05:38:29.375516 31674 slave.cpp:264] Agent using credential for:
> test-principal
> I0629 05:38:29.375530 31674 credentials.hpp:37] Loading credentials for
> authentication from '/tmp/Endpoint_SlaveEndpointTest_
> UnauthorizedRequest_1_EM1MUG/http_credentials'
> I0629 05:38:29.375668 31674 http.cpp:975] Creating default 'basic' HTTP
> authenticator for realm 'mesos-agent-executor'
> I0629 05:38:29.375715 31674 http.cpp:996] Creating default 'jwt' HTTP
> authenticator for realm 'mesos-agent-executor'
> I0629 05:38:29.375766 31674 http.cpp:975] Creating default 'basic' HTTP
> authenticator for realm 'mesos-agent-readonly'
> I0629 05:38:29.375797 31674 http.cpp:996] Creating default 'jwt' HTTP
> authenticator for realm 'mesos-agent-readonly'
> I0629 05:38:29.375844 31674 http.cpp:975] Creating default 'basic' HTTP
> authenticator for realm 'mesos-agent-readwrite'
> I0629 05:38:29.375875 31674 http.cpp:996] Creating default 'jwt' HTTP
> authenticator for realm 'mesos-agent-readwrite'
> I0629 05:38:29.376368 31674 slave.cpp:531] Agent resources: cpus(*):2;
> mem(*):1024; disk(*):1024; ports(*):[31000-32000]
> I0629 05:38:29.376399 31674 slave.cpp:539] Agent attributes: [  ]
> I0629 05:38:29.376404 31674 slave.cpp:544] Agent hostname: 0e3805988b41
> I0629 05:38:29.376482 31679 status_update_manager.cpp:177] Pausing sending
> status updates
> I0629 05:38:29.376773 31672 state.cpp:62] Recovering state from
> '/tmp/Endpoint_SlaveEndpointTest_UnauthorizedRequest_1_SILwJ2/meta'
> I0629 05:38:29.376956 31673 status_update_manager.cpp:203] Recovering
> status update manager
> I0629 05:38:29.377152 31673 containerizer.cpp:608] Recovering containerizer
> I0629 05:38:29.377696 31670 provisioner.cpp:410] Provisioner recovery
> complete
> I0629 05:38:29.377826 31670 slave.cpp:6075] Finished recovery
> I0629 05:38:29.378145 31670 slave.cpp:6257] Querying resource estimator
> for oversubscribable resources
> I0629 05:38:29.378262 31670 slave.cpp:6271] Received oversubscribable
> resources {} from the resource estimator
> I0629 05:38:29.378983 31672 process.cpp:3731] Handling HTTP event for
> process 'slave(745)' with path: '/slave(745)/monitor/statistics.json'
> I0629 05:38:29.379487 31671 http.cpp:1115] HTTP GET for
> /slave(745)/monitor/statistics.json from 172.17.0.2:51735
> I0629 05:38:29.379519 31671 http.cpp:936] Authorizing principal
> 'test-principal' to GET the '/monitor/statistics.json' endpoint
> I0629 05:38:29.380494 31677 slave.cpp:796] Agent terminating
> [       OK ] Endpoint/SlaveEndpointTest.UnauthorizedRequest/1 (12 ms)
> [ RUN      ] Endpoint/SlaveEndpointTest.UnauthorizedRequest/2
> I0629 05:38:29.385953 25997 containerizer.cpp:221] Using isolation:
> posix/cpu,posix/mem,filesystem/posix,network/cni
> W0629 05:38:29.386291 25997 backend.cpp:76] Failed to create 'aufs'
> backend: AufsBackend requires root privileges
> W0629 05:38:29.386334 25997 backend.cpp:76] Failed to create 'bind'
> backend: BindBackend requires root privileges
> I0629 05:38:29.386353 25997 provisioner.cpp:249] Using default backend
> 'copy'
> I0629 05:38:29.387471 31680 slave.cpp:231] Mesos agent started on (746)@
> 172.17.0.2:39522
> I0629 05:38:29.387493 31680 slave.cpp:232] Flags at startup: --acls=""
> --appc_simple_discovery_uri_prefix="http://" --appc_store_dir="/tmp/mesos/store/appc"
> --authenticate_http_executors="true" --authenticate_http_readonly="true"
> --authenticate_http_readwrite="true" --authenticatee="crammd5"
> --authentication_backoff_factor="1secs" --authorizer="local"
> --cgroups_cpu_enable_pids_and_tids_count="false"
> --cgroups_enable_cfs="false" --cgroups_hierarchy="/sys/fs/cgroup"
> --cgroups_limit_swap="false" --cgroups_root="mesos" --container_disk_watch_interval="15secs"
> --containerizers="mesos" --credential="/tmp/Endpoint_SlaveEndpointTest_
> UnauthorizedRequest_2_9ucGKh/credential" --default_role="*"
> --disk_watch_interval="1mins" --docker="docker"
> --docker_kill_orphans="true" --docker_registry="https://
> registry-1.docker.io" --docker_remove_delay="6hrs"
> --docker_socket="/var/run/docker.sock" --docker_stop_timeout="0ns"
> --docker_store_dir="/tmp/mesos/store/docker" --docker_volume_checkpoint_
> dir="/var/run/mesos/isolators/docker/volume" --enforce_container_disk_quota="false"
> --executor_registration_timeout="1mins" --executor_reregistration_timeout="2secs"
> --executor_secret_key="/tmp/Endpoint_SlaveEndpointTest_
> UnauthorizedRequest_2_9ucGKh/executor_secret_key"
> --executor_shutdown_grace_period="5secs" --fetcher_cache_dir="/tmp/
> Endpoint_SlaveEndpointTest_UnauthorizedRequest_2_9ucGKh/fetch"
> --fetcher_cache_size="2GB" --frameworks_home="" --gc_delay="1weeks"
> --gc_disk_headroom="0.1" --hadoop_home="" --help="false"
> --hostname_lookup="true" --http_command_executor="false"
> --http_credentials="/tmp/Endpoint_SlaveEndpointTest_
> UnauthorizedRequest_2_9ucGKh/http_credentials" --http_heartbeat_interval="30secs"
> --initialize_driver_logging="true" --isolation="posix/cpu,posix/mem"
> --launcher="posix" --launcher_dir="/mesos/build/src" --logbufsecs="0"
> --logging_level="INFO" --max_completed_executors_per_framework="150"
> --oversubscribed_resources_interval="15secs" --perf_duration="10secs"
> --perf_interval="1mins" --port="5051" --qos_correction_interval_min="0ns"
> --quiet="false" --recover="reconnect" --recovery_timeout="15mins"
> --registration_backoff_factor="10ms" --resources="cpus:2;gpus:0;
> mem:1024;disk:1024;ports:[31000-32000]" --revocable_cpu_low_priority="true"
> --runtime_dir="/tmp/Endpoint_SlaveEndpointTest_UnauthorizedRequest_2_9ucGKh"
> --sandbox_directory="/mnt/mesos/sandbox" --strict="true"
> --switch_user="true" --systemd_enable_support="true"
> --systemd_runtime_directory="/run/systemd/system" --version="false"
> --work_dir="/tmp/Endpoint_SlaveEndpointTest_UnauthorizedRequest_2_OSIoxD"
> I0629 05:38:29.387670 31680 credentials.hpp:86] Loading credential for
> authentication from '/tmp/Endpoint_SlaveEndpointTest_
> UnauthorizedRequest_2_9ucGKh/credential'
> I0629 05:38:29.387765 31680 slave.cpp:264] Agent using credential for:
> test-principal
> I0629 05:38:29.387776 31680 credentials.hpp:37] Loading credentials for
> authentication from '/tmp/Endpoint_SlaveEndpointTest_
> UnauthorizedRequest_2_9ucGKh/http_credentials'
> I0629 05:38:29.388044 31680 http.cpp:975] Creating default 'basic' HTTP
> authenticator for realm 'mesos-agent-executor'
> I0629 05:38:29.388087 31680 http.cpp:996] Creating default 'jwt' HTTP
> authenticator for realm 'mesos-agent-executor'
> I0629 05:38:29.388144 31680 http.cpp:975] Creating default 'basic' HTTP
> authenticator for realm 'mesos-agent-readonly'
> I0629 05:38:29.388178 31680 http.cpp:996] Creating default 'jwt' HTTP
> authenticator for realm 'mesos-agent-readonly'
> I0629 05:38:29.388223 31680 http.cpp:975] Creating default 'basic' HTTP
> authenticator for realm 'mesos-agent-readwrite'
> I0629 05:38:29.388258 31680 http.cpp:996] Creating default 'jwt' HTTP
> authenticator for realm 'mesos-agent-readwrite'
> I0629 05:38:29.388592 31680 slave.cpp:531] Agent resources: cpus(*):2;
> mem(*):1024; disk(*):1024; ports(*):[31000-32000]
> I0629 05:38:29.388624 31680 slave.cpp:539] Agent attributes: [  ]
> I0629 05:38:29.388631 31680 slave.cpp:544] Agent hostname: 0e3805988b41
> I0629 05:38:29.388926 31680 status_update_manager.cpp:177] Pausing sending
> status updates
> I0629 05:38:29.389097 31680 state.cpp:62] Recovering state from
> '/tmp/Endpoint_SlaveEndpointTest_UnauthorizedRequest_2_OSIoxD/meta'
> I0629 05:38:29.389216 31680 status_update_manager.cpp:203] Recovering
> status update manager
> I0629 05:38:29.389263 31680 containerizer.cpp:608] Recovering containerizer
> I0629 05:38:29.389605 31680 provisioner.cpp:410] Provisioner recovery
> complete
> I0629 05:38:29.389708 31680 slave.cpp:6075] Finished recovery
> I0629 05:38:29.389998 31680 slave.cpp:6257] Querying resource estimator
> for oversubscribable resources
> I0629 05:38:29.390125 31680 slave.cpp:6271] Received oversubscribable
> resources {} from the resource estimator
> I0629 05:38:29.390813 31677 process.cpp:3731] Handling HTTP event for
> process 'slave(746)' with path: '/slave(746)/containers'
> I0629 05:38:29.391330 31676 http.cpp:1115] HTTP GET for
> /slave(746)/containers from 172.17.0.2:51736
> I0629 05:38:29.391373 31676 http.cpp:936] Authorizing principal
> 'test-principal' to GET the '/containers' endpoint
> I0629 05:38:29.393566 31681 slave.cpp:796] Agent terminating
> [       OK ] Endpoint/SlaveEndpointTest.UnauthorizedRequest/2 (12 ms)
> [ RUN      ] Endpoint/SlaveEndpointTest.NoAuthorizer/0
> I0629 05:38:29.399437 25997 containerizer.cpp:221] Using isolation:
> posix/cpu,posix/mem,filesystem/posix,network/cni
> W0629 05:38:29.399798 25997 backend.cpp:76] Failed to create 'aufs'
> backend: AufsBackend requires root privileges
> W0629 05:38:29.399852 25997 backend.cpp:76] Failed to create 'bind'
> backend: BindBackend requires root privileges
> I0629 05:38:29.399871 25997 provisioner.cpp:249] Using default backend
> 'copy'
> I0629 05:38:29.400555 25997 cluster.cpp:448] Creating default 'local'
> authorizer
> I0629 05:38:29.401135 31681 slave.cpp:231] Mesos agent started on (747)@
> 172.17.0.2:39522
> I0629 05:38:29.401280 31681 slave.cpp:232] Flags at startup: --acls=""
> --appc_simple_discovery_uri_prefix="http://" --appc_store_dir="/tmp/mesos/store/appc"
> --authenticate_http_executors="true" --authenticate_http_readonly="true"
> --authenticate_http_readwrite="true" --authenticatee="crammd5"
> --authentication_backoff_factor="1secs" --authorizer="local"
> --cgroups_cpu_enable_pids_and_tids_count="false"
> --cgroups_enable_cfs="false" --cgroups_hierarchy="/sys/fs/cgroup"
> --cgroups_limit_swap="false" --cgroups_root="mesos" --container_disk_watch_interval="15secs"
> --containerizers="mesos" --credential="/tmp/Endpoint_SlaveEndpointTest_
> NoAuthorizer_0_7ciXIS/credential" --default_role="*"
> --disk_watch_interval="1mins" --docker="docker"
> --docker_kill_orphans="true" --docker_registry="https://
> registry-1.docker.io" --docker_remove_delay="6hrs"
> --docker_socket="/var/run/docker.sock" --docker_stop_timeout="0ns"
> --docker_store_dir="/tmp/mesos/store/docker" --docker_volume_checkpoint_
> dir="/var/run/mesos/isolators/docker/volume" --enforce_container_disk_quota="false"
> --executor_registration_timeout="1mins" --executor_reregistration_timeout="2secs"
> --executor_secret_key="/tmp/Endpoint_SlaveEndpointTest_
> NoAuthorizer_0_7ciXIS/executor_secret_key" --executor_shutdown_grace_period="5secs"
> --fetcher_cache_dir="/tmp/Endpoint_SlaveEndpointTest_NoAuthorizer_0_7ciXIS/fetch"
> --fetcher_cache_size="2GB" --frameworks_home="" --gc_delay="1weeks"
> --gc_disk_headroom="0.1" --hadoop_home="" --help="false"
> --hostname_lookup="true" --http_command_executor="false"
> --http_credentials="/tmp/Endpoint_SlaveEndpointTest_
> NoAuthorizer_0_7ciXIS/http_credentials" --http_heartbeat_interval="30secs"
> --initialize_driver_logging="true" --isolation="posix/cpu,posix/mem"
> --launcher="posix" --launcher_dir="/mesos/build/src" --logbufsecs="0"
> --logging_level="INFO" --max_completed_executors_per_framework="150"
> --oversubscribed_resources_interval="15secs" --perf_duration="10secs"
> --perf_interval="1mins" --port="5051" --qos_correction_interval_min="0ns"
> --quiet="false" --recover="reconnect" --recovery_timeout="15mins"
> --registration_backoff_factor="10ms" --resources="cpus:2;gpus:0;
> mem:1024;disk:1024;ports:[31000-32000]" --revocable_cpu_low_priority="true"
> --runtime_dir="/tmp/Endpoint_SlaveEndpointTest_NoAuthorizer_0_7ciXIS"
> --sandbox_directory="/mnt/mesos/sandbox" --strict="true"
> --switch_user="true" --systemd_enable_support="true"
> --systemd_runtime_directory="/run/systemd/system" --version="false"
> --work_dir="/tmp/Endpoint_SlaveEndpointTest_NoAuthorizer_0_RYlwte"
> I0629 05:38:29.401521 31681 credentials.hpp:86] Loading credential for
> authentication from '/tmp/Endpoint_SlaveEndpointTest_
> NoAuthorizer_0_7ciXIS/credential'
> I0629 05:38:29.401618 31681 slave.cpp:264] Agent using credential for:
> test-principal
> I0629 05:38:29.401630 31681 credentials.hpp:37] Loading credentials for
> authentication from '/tmp/Endpoint_SlaveEndpointTest_
> NoAuthorizer_0_7ciXIS/http_credentials'
> I0629 05:38:29.401826 31681 http.cpp:975] Creating default 'basic' HTTP
> authenticator for realm 'mesos-agent-executor'
> I0629 05:38:29.401867 31681 http.cpp:996] Creating default 'jwt' HTTP
> authenticator for realm 'mesos-agent-executor'
> I0629 05:38:29.401918 31681 http.cpp:975] Creating default 'basic' HTTP
> authenticator for realm 'mesos-agent-readonly'
> I0629 05:38:29.401974 31681 http.cpp:996] Creating default 'jwt' HTTP
> authenticator for realm 'mesos-agent-readonly'
> I0629 05:38:29.402074 31681 http.cpp:975] Creating default 'basic' HTTP
> authenticator for realm 'mesos-agent-readwrite'
> I0629 05:38:29.402256 31681 http.cpp:996] Creating default 'jwt' HTTP
> authenticator for realm 'mesos-agent-readwrite'
> I0629 05:38:29.402734 31681 slave.cpp:531] Agent resources: cpus(*):2;
> mem(*):1024; disk(*):1024; ports(*):[31000-32000]
> I0629 05:38:29.402765 31681 slave.cpp:539] Agent attributes: [  ]
> I0629 05:38:29.402770 31681 slave.cpp:544] Agent hostname: 0e3805988b41
> I0629 05:38:29.402835 31679 status_update_manager.cpp:177] Pausing sending
> status updates
> I0629 05:38:29.403147 31675 state.cpp:62] Recovering state from
> '/tmp/Endpoint_SlaveEndpointTest_NoAuthorizer_0_RYlwte/meta'
> I0629 05:38:29.403290 31683 status_update_manager.cpp:203] Recovering
> status update manager
> I0629 05:38:29.403439 31683 containerizer.cpp:608] Recovering containerizer
> I0629 05:38:29.403817 31683 provisioner.cpp:410] Provisioner recovery
> complete
> I0629 05:38:29.403965 31683 slave.cpp:6075] Finished recovery
> I0629 05:38:29.404287 31683 slave.cpp:6257] Querying resource estimator
> for oversubscribable resources
> I0629 05:38:29.404419 31683 slave.cpp:6271] Received oversubscribable
> resources {} from the resource estimator
> I0629 05:38:29.405149 31675 process.cpp:3731] Handling HTTP event for
> process 'slave(747)' with path: '/slave(747)/monitor/statistics'
> I0629 05:38:29.405709 31676 http.cpp:1115] HTTP GET for
> /slave(747)/monitor/statistics from 172.17.0.2:51737
> I0629 05:38:29.405752 31676 http.cpp:936] Authorizing principal
> 'test-principal' to GET the '/monitor/statistics' endpoint
> I0629 05:38:29.407012 31680 slave.cpp:796] Agent terminating
> [       OK ] Endpoint/SlaveEndpointTest.NoAuthorizer/0 (28 ms)
> [ RUN      ] Endpoint/SlaveEndpointTest.NoAuthorizer/1
> I0629 05:38:29.426965 25997 containerizer.cpp:221] Using isolation:
> posix/cpu,posix/mem,filesystem/posix,network/cni
> W0629 05:38:29.427223 25997 backend.cpp:76] Failed to create 'aufs'
> backend: AufsBackend requires root privileges
> W0629 05:38:29.427258 25997 backend.cpp:76] Failed to create 'bind'
> backend: BindBackend requires root privileges
> I0629 05:38:29.427270 25997 provisioner.cpp:249] Using default backend
> 'copy'
> I0629 05:38:29.427814 25997 cluster.cpp:448] Creating default 'local'
> authorizer
> I0629 05:38:29.428311 31680 slave.cpp:231] Mesos agent started on (748)@
> 172.17.0.2:39522
> I0629 05:38:29.428339 31680 slave.cpp:232] Flags at startup: --acls=""
> --appc_simple_discovery_uri_prefix="http://" --appc_store_dir="/tmp/mesos/store/appc"
> --authenticate_http_executors="true" --authenticate_http_readonly="true"
> --authenticate_http_readwrite="true" --authenticatee="crammd5"
> --authentication_backoff_factor="1secs" --authorizer="local"
> --cgroups_cpu_enable_pids_and_tids_count="false"
> --cgroups_enable_cfs="false" --cgroups_hierarchy="/sys/fs/cgroup"
> --cgroups_limit_swap="false" --cgroups_root="mesos" --container_disk_watch_interval="15secs"
> --containerizers="mesos" --credential="/tmp/Endpoint_SlaveEndpointTest_
> NoAuthorizer_1_G73jXt/credential" --default_role="*"
> --disk_watch_interval="1mins" --docker="docker"
> --docker_kill_orphans="true" --docker_registry="https://
> registry-1.docker.io" --docker_remove_delay="6hrs"
> --docker_socket="/var/run/docker.sock" --docker_stop_timeout="0ns"
> --docker_store_dir="/tmp/mesos/store/docker" --docker_volume_checkpoint_
> dir="/var/run/mesos/isolators/docker/volume" --enforce_container_disk_quota="false"
> --executor_registration_timeout="1mins" --executor_reregistration_timeout="2secs"
> --executor_secret_key="/tmp/Endpoint_SlaveEndpointTest_
> NoAuthorizer_1_G73jXt/executor_secret_key" --executor_shutdown_grace_period="5secs"
> --fetcher_cache_dir="/tmp/Endpoint_SlaveEndpointTest_NoAuthorizer_1_G73jXt/fetch"
> --fetcher_cache_size="2GB" --frameworks_home="" --gc_delay="1weeks"
> --gc_disk_headroom="0.1" --hadoop_home="" --help="false"
> --hostname_lookup="true" --http_command_executor="false"
> --http_credentials="/tmp/Endpoint_SlaveEndpointTest_
> NoAuthorizer_1_G73jXt/http_credentials" --http_heartbeat_interval="30secs"
> --initialize_driver_logging="true" --isolation="posix/cpu,posix/mem"
> --launcher="posix" --launcher_dir="/mesos/build/src" --logbufsecs="0"
> --logging_level="INFO" --max_completed_executors_per_framework="150"
> --oversubscribed_resources_interval="15secs" --perf_duration="10secs"
> --perf_interval="1mins" --port="5051" --qos_correction_interval_min="0ns"
> --quiet="false" --recover="reconnect" --recovery_timeout="15mins"
> --registration_backoff_factor="10ms" --resources="cpus:2;gpus:0;
> mem:1024;disk:1024;ports:[31000-32000]" --revocable_cpu_low_priority="true"
> --runtime_dir="/tmp/Endpoint_SlaveEndpointTest_NoAuthorizer_1_G73jXt"
> --sandbox_directory="/mnt/mesos/sandbox" --strict="true"
> --switch_user="true" --systemd_enable_support="true"
> --systemd_runtime_directory="/run/systemd/system" --version="false"
> --work_dir="/tmp/Endpoint_SlaveEndpointTest_NoAuthorizer_1_xUJjDP"
> I0629 05:38:29.428624 31680 credentials.hpp:86] Loading credential for
> authentication from '/tmp/Endpoint_SlaveEndpointTest_
> NoAuthorizer_1_G73jXt/credential'
> I0629 05:38:29.428700 31680 slave.cpp:264] Agent using credential for:
> test-principal
> I0629 05:38:29.428711 31680 credentials.hpp:37] Loading credentials for
> authentication from '/tmp/Endpoint_SlaveEndpointTest_
> NoAuthorizer_1_G73jXt/http_credentials'
> I0629 05:38:29.428841 31680 http.cpp:975] Creating default 'basic' HTTP
> authenticator for realm 'mesos-agent-executor'
> I0629 05:38:29.428889 31680 http.cpp:996] Creating default 'jwt' HTTP
> authenticator for realm 'mesos-agent-executor'
> I0629 05:38:29.428948 31680 http.cpp:975] Creating default 'basic' HTTP
> authenticator for realm 'mesos-agent-readonly'
> I0629 05:38:29.428978 31680 http.cpp:996] Creating default 'jwt' HTTP
> authenticator for realm 'mesos-agent-readonly'
> I0629 05:38:29.429006 31680 http.cpp:975] Creating default 'basic' HTTP
> authenticator for realm 'mesos-agent-readwrite'
> I0629 05:38:29.429021 31680 http.cpp:996] Creating default 'jwt' HTTP
> authenticator for realm 'mesos-agent-readwrite'
> I0629 05:38:29.429399 31680 slave.cpp:531] Agent resources: cpus(*):2;
> mem(*):1024; disk(*):1024; ports(*):[31000-32000]
> I0629 05:38:29.429430 31680 slave.cpp:539] Agent attributes: [  ]
> I0629 05:38:29.429435 31680 slave.cpp:544] Agent hostname: 0e3805988b41
> I0629 05:38:29.429502 31684 status_update_manager.cpp:177] Pausing sending
> status updates
> I0629 05:38:29.429828 31669 state.cpp:62] Recovering state from
> '/tmp/Endpoint_SlaveEndpointTest_NoAuthorizer_1_xUJjDP/meta'
> I0629 05:38:29.429973 31683 status_update_manager.cpp:203] Recovering
> status update manager
> I0629 05:38:29.430093 31682 containerizer.cpp:608] Recovering containerizer
> I0629 05:38:29.430548 31676 provisioner.cpp:410] Provisioner recovery
> complete
> I0629 05:38:29.430804 31670 slave.cpp:6075] Finished recovery
> I0629 05:38:29.431159 31670 slave.cpp:6257] Querying resource estimator
> for oversubscribable resources
> I0629 05:38:29.431254 31676 slave.cpp:6271] Received oversubscribable
> resources {} from the resource estimator
> I0629 05:38:29.431972 31675 process.cpp:3731] Handling HTTP event for
> process 'slave(748)' with path: '/slave(748)/monitor/statistics.json'
> I0629 05:38:29.432502 31673 http.cpp:1115] HTTP GET for
> /slave(748)/monitor/statistics.json from 172.17.0.2:51738
> I0629 05:38:29.432543 31673 http.cpp:936] Authorizing principal
> 'test-principal' to GET the '/monitor/statistics.json' endpoint
> I0629 05:38:29.433805 31684 slave.cpp:796] Agent terminating
> [       OK ] Endpoint/SlaveEndpointTest.NoAuthorizer/1 (17 ms)
> [ RUN      ] Endpoint/SlaveEndpointTest.NoAuthorizer/2
> I0629 05:38:29.445540 25997 containerizer.cpp:221] Using isolation:
> posix/cpu,posix/mem,filesystem/posix,network/cni
> W0629 05:38:29.445885 25997 backend.cpp:76] Failed to create 'aufs'
> backend: AufsBackend requires root privileges
> W0629 05:38:29.445930 25997 backend.cpp:76] Failed to create 'bind'
> backend: BindBackend requires root privileges
> I0629 05:38:29.445947 25997 provisioner.cpp:249] Using default backend
> 'copy'
> I0629 05:38:29.446578 25997 cluster.cpp:448] Creating default 'local'
> authorizer
> I0629 05:38:29.447196 31684 slave.cpp:231] Mesos agent started on (749)@
> 172.17.0.2:39522
> I0629 05:38:29.447221 31684 slave.cpp:232] Flags at startup: --acls=""
> --appc_simple_discovery_uri_prefix="http://" --appc_store_dir="/tmp/mesos/store/appc"
> --authenticate_http_executors="true" --authenticate_http_readonly="true"
> --authenticate_http_readwrite="true" --authenticatee="crammd5"
> --authentication_backoff_factor="1secs" --authorizer="local"
> --cgroups_cpu_enable_pids_and_tids_count="false"
> --cgroups_enable_cfs="false" --cgroups_hierarchy="/sys/fs/cgroup"
> --cgroups_limit_swap="false" --cgroups_root="mesos" --container_disk_watch_interval="15secs"
> --containerizers="mesos" --credential="/tmp/Endpoint_SlaveEndpointTest_
> NoAuthorizer_2_g2KKo5/credential" --default_role="*"
> --disk_watch_interval="1mins" --docker="docker"
> --docker_kill_orphans="true" --docker_registry="https://
> registry-1.docker.io" --docker_remove_delay="6hrs"
> --docker_socket="/var/run/docker.sock" --docker_stop_timeout="0ns"
> --docker_store_dir="/tmp/mesos/store/docker" --docker_volume_checkpoint_
> dir="/var/run/mesos/isolators/docker/volume" --enforce_container_disk_quota="false"
> --executor_registration_timeout="1mins" --executor_reregistration_timeout="2secs"
> --executor_secret_key="/tmp/Endpoint_SlaveEndpointTest_
> NoAuthorizer_2_g2KKo5/executor_secret_key" --executor_shutdown_grace_period="5secs"
> --fetcher_cache_dir="/tmp/Endpoint_SlaveEndpointTest_NoAuthorizer_2_g2KKo5/fetch"
> --fetcher_cache_size="2GB" --frameworks_home="" --gc_delay="1weeks"
> --gc_disk_headroom="0.1" --hadoop_home="" --help="false"
> --hostname_lookup="true" --http_command_executor="false"
> --http_credentials="/tmp/Endpoint_SlaveEndpointTest_
> NoAuthorizer_2_g2KKo5/http_credentials" --http_heartbeat_interval="30secs"
> --initialize_driver_logging="true" --isolation="posix/cpu,posix/mem"
> --launcher="posix" --launcher_dir="/mesos/build/src" --logbufsecs="0"
> --logging_level="INFO" --max_completed_executors_per_framework="150"
> --oversubscribed_resources_interval="15secs" --perf_duration="10secs"
> --perf_interval="1mins" --port="5051" --qos_correction_interval_min="0ns"
> --quiet="false" --recover="reconnect" --recovery_timeout="15mins"
> --registration_backoff_factor="10ms" --resources="cpus:2;gpus:0;
> mem:1024;disk:1024;ports:[31000-32000]" --revocable_cpu_low_priority="true"
> --runtime_dir="/tmp/Endpoint_SlaveEndpointTest_NoAuthorizer_2_g2KKo5"
> --sandbox_directory="/mnt/mesos/sandbox" --strict="true"
> --switch_user="true" --systemd_enable_support="true"
> --systemd_runtime_directory="/run/systemd/system" --version="false"
> --work_dir="/tmp/Endpoint_SlaveEndpointTest_NoAuthorizer_2_iyjP1q"
> I0629 05:38:29.447377 31684 credentials.hpp:86] Loading credential for
> authentication from '/tmp/Endpoint_SlaveEndpointTest_
> NoAuthorizer_2_g2KKo5/credential'
> I0629 05:38:29.447537 31684 slave.cpp:264] Agent using credential for:
> test-principal
> I0629 05:38:29.447552 31684 credentials.hpp:37] Loading credentials for
> authentication from '/tmp/Endpoint_SlaveEndpointTest_
> NoAuthorizer_2_g2KKo5/http_credentials'
> I0629 05:38:29.447686 31684 http.cpp:975] Creating default 'basic' HTTP
> authenticator for realm 'mesos-agent-executor'
> I0629 05:38:29.447758 31684 http.cpp:996] Creating default 'jwt' HTTP
> authenticator for realm 'mesos-agent-executor'
> I0629 05:38:29.447908 31684 http.cpp:975] Creating default 'basic' HTTP
> authenticator for realm 'mesos-agent-readonly'
> I0629 05:38:29.447968 31684 http.cpp:996] Creating default 'jwt' HTTP
> authenticator for realm 'mesos-agent-readonly'
> I0629 05:38:29.448025 31684 http.cpp:975] Creating default 'basic' HTTP
> authenticator for realm 'mesos-agent-readwrite'
> I0629 05:38:29.448065 31684 http.cpp:996] Creating default 'jwt' HTTP
> authenticator for realm 'mesos-agent-readwrite'
> I0629 05:38:29.448472 31684 slave.cpp:531] Agent resources: cpus(*):2;
> mem(*):1024; disk(*):1024; ports(*):[31000-32000]
> I0629 05:38:29.448503 31684 slave.cpp:539] Agent attributes: [  ]
> I0629 05:38:29.448508 31684 slave.cpp:544] Agent hostname: 0e3805988b41
> I0629 05:38:29.448575 31671 status_update_manager.cpp:177] Pausing sending
> status updates
> I0629 05:38:29.448899 31679 state.cpp:62] Recovering state from
> '/tmp/Endpoint_SlaveEndpointTest_NoAuthorizer_2_iyjP1q/meta'
> I0629 05:38:29.449059 31672 status_update_manager.cpp:203] Recovering
> status update manager
> I0629 05:38:29.449162 31684 containerizer.cpp:608] Recovering containerizer
> I0629 05:38:29.449784 31669 provisioner.cpp:410] Provisioner recovery
> complete
> I0629 05:38:29.449998 31669 slave.cpp:6075] Finished recovery
> I0629 05:38:29.450453 31669 slave.cpp:6257] Querying resource estimator
> for oversubscribable resources
> I0629 05:38:29.450579 31672 slave.cpp:6271] Received oversubscribable
> resources {} from the resource estimator
> I0629 05:38:29.451323 31681 process.cpp:3731] Handling HTTP event for
> process 'slave(749)' with path: '/slave(749)/containers'
> I0629 05:38:29.451791 31681 http.cpp:1115] HTTP GET for
> /slave(749)/containers from 172.17.0.2:51739
> I0629 05:38:29.451827 31681 http.cpp:936] Authorizing principal
> 'test-principal' to GET the '/containers' endpoint
> I0629 05:38:29.452927 31684 slave.cpp:796] Agent terminating
> [       OK ] Endpoint/SlaveEndpointTest.NoAuthorizer/2 (13 ms)
> [----------] 9 tests from Endpoint/SlaveEndpointTest (196 ms total)
>
> [----------] Global test environment tear-down
> [==========] 1528 tests from 169 test cases ran. (273723 ms total)
> [  PASSED  ] 1527 tests.
> [  FAILED  ] 1 test, listed below:
> [  FAILED  ] HierarchicalAllocatorTest.NestedRoleQuota
>
>  1 FAILED TEST
>   YOU HAVE 22 DISABLED TESTS
>
> E0629 05:38:29.524490 31685 process.cpp:951] Failed to accept socket:
> future discarded
> make[3]: *** [CMakeFiles/check] Error 1
> make[3]: Leaving directory `/mesos/build'
> make[2]: Leaving directory `/mesos/build'
> make[2]: *** [CMakeFiles/check.dir/all] Error 2
> make[1]: *** [CMakeFiles/check.dir/rule] Error 2
> make[1]: Leaving directory `/mesos/build'
> make: *** [check] Error 2
> + docker rmi mesos-1498711811-8208
> Untagged: mesos-1498711811-8208:latest
> Deleted: sha256:c3bdf8ca0d6c4085c1b3aca95e9cf7
> 1cb64653320bd95a82af0a78943e7eb758
> Deleted: sha256:d9820876861b7f2b509f8d247d5f17
> 46e130cb21a2ae6ca2c6eed51b593b7e7d
> Deleted: sha256:d72133a75cdedc201d87f2329c524b
> 7d9cd5aea85003703042ddb6dc2ff5b068
> Deleted: sha256:b7fee9cedeaab713d4091f1ad63fe1
> 63b68e195643e60d109e516eb59cb01954
> Deleted: sha256:0545154daf08c77e87471ecb939656
> 1a3f945cbdc43fe13876391718e06c8dea
> Deleted: sha256:8d4a60e6d01574eb3be39b9bfe98c6
> 880352a05f7eb31331196eb23db52716da
> Deleted: sha256:8ff6393874bfe81a80c7e6cd94fa4c
> a3980f220843298f959ad180a851048c9b
> Deleted: sha256:ab4ec3caa7a6e22496c93bd3978b60
> c50fb0cce1493c773eeeff65973837b467
> Deleted: sha256:a9c023ff360df7fa65200ac2336850
> ec154f74fc3774ce52fe786e6495882e1f
> Deleted: sha256:9c907d0a925c601be379b02187ba18
> cab896a4a888f4ece4a61a904f18956459
> Deleted: sha256:3a9675fedb0ab6ac2d74e41f9dff9e
> 20d44049de24f86188e2ebb21904534ce1
> Deleted: sha256:221d45620898e83b5a1f15711e2359
> e9b43a8f5ff6e49bc6e435f5dccc5c52cb
> Deleted: sha256:d7acce26deed1da1ec20cd33972ef5
> 2755c7d46f2551b1d67254eff392845c08
> Deleted: sha256:0163fe50af13330b0e78fd44d944f3
> 4ad54b9e6de6246912b6ba195c7ce8f62a
> Deleted: sha256:7bb15e0d16fa1788c5b71b5e927f27
> f3037f0338e5328d028117f5f70c91cbe3
> Deleted: sha256:808cd1afb2a29dbb42b0bbf4f15520
> 8a4875aa9fb0e9d12bc69ea547dabc11e6
> Deleted: sha256:d8d7fcf83d7a3c7bc9056ff32a1939
> 2a303683214052920423c4de0a8a542be2
> Deleted: sha256:b99538154fc3fc502a50caa1156063
> c3259dd848bbb41b25f164c65767d7b367
> Deleted: sha256:1cb4bd13c56aef09d047ebf506d8ef
> 3403c22b277293fc2eb783295e94d3717c
> Deleted: sha256:1580f2f19d49da6651c6f538728ee3
> 77f636ec88b6a0ea11127c7c32c974231d
> Deleted: sha256:4136bb4fd24ad2e3fd1cf7b0854f9b
> 49784de6c587149a4879a213bb0812fb13
> Deleted: sha256:0d69960cad5be6a5687a03b1957e92
> 4784345a4260de9500e71c2c4b5bf4eeb1
> Deleted: sha256:ec5f794ca2a7a3c917dd4866ae6f31
> a0f030f14611af37529206ae93715441ec
> Deleted: sha256:9c41dfd8732c92b8ec11485703c32d
> 1272b6f4b505f6c41292e7e8a48634dfcb
> Build step 'Execute shell' marked build as failure
>

Mime
  • Unnamed multipart/alternative (inline, None, 0 bytes)
View raw message