mesos-builds mailing list archives

Site index · List index
Message view « Date » · « Thread »
Top « Date » · « Thread »
From Apache Jenkins Server <jenk...@builds.apache.org>
Subject Build failed in Jenkins: Mesos-Reviewbot #18389
Date Thu, 15 Jun 2017 04:30:41 GMT
See <https://builds.apache.org/job/Mesos-Reviewbot/18389/display/redirect>

------------------------------------------
[...truncated 28.49 MB...]
I0615 04:30:34.370540  4573 containerizer.cpp:230] Using isolation: posix/cpu,posix/mem,filesystem/posix,network/cni,environment_secret
W0615 04:30:34.372010  4573 backend.cpp:76] Failed to create 'overlay' backend: OverlayBackend
requires root privileges
W0615 04:30:34.372328  4573 backend.cpp:76] Failed to create 'bind' backend: BindBackend requires
root privileges
I0615 04:30:34.372390  4573 provisioner.cpp:255] Using default backend 'copy'
I0615 04:30:34.377429  4598 slave.cpp:248] Mesos agent started on (763)@172.17.0.2:35069
I0615 04:30:34.377514  4598 slave.cpp:249] Flags at startup: --acls="" --appc_simple_discovery_uri_prefix="http://"
--appc_store_dir="/tmp/Endpoint_SlaveEndpointTest_AuthorizedRequest_2_ucVzCb/store/appc" --authenticate_http_readonly="true"
--authenticate_http_readwrite="true" --authenticatee="crammd5" --authentication_backoff_factor="1secs"
--authorizer="local" --cgroups_cpu_enable_pids_and_tids_count="false" --cgroups_enable_cfs="false"
--cgroups_hierarchy="/sys/fs/cgroup" --cgroups_limit_swap="false" --cgroups_root="mesos" --container_disk_watch_interval="15secs"
--containerizers="mesos" --credential="/tmp/Endpoint_SlaveEndpointTest_AuthorizedRequest_2_ucVzCb/credential"
--default_role="*" --disk_watch_interval="1mins" --docker="docker" --docker_kill_orphans="true"
--docker_registry="https://registry-1.docker.io" --docker_remove_delay="6hrs" --docker_socket="/var/run/docker.sock"
--docker_stop_timeout="0ns" --docker_store_dir="/tmp/Endpoint_SlaveEndpointTest_AuthorizedRequest_2_ucVzCb/store/docker"
--docker_volume_checkpoint_dir="/var/run/mesos/isolators/docker/volume" --enforce_container_disk_quota="false"
--executor_registration_timeout="1mins" --executor_reregistration_timeout="2secs" --executor_shutdown_grace_period="5secs"
--fetcher_cache_dir="/tmp/Endpoint_SlaveEndpointTest_AuthorizedRequest_2_ucVzCb/fetch" --fetcher_cache_size="2GB"
--frameworks_home="" --gc_delay="1weeks" --gc_disk_headroom="0.1" --hadoop_home="" --help="false"
--hostname_lookup="true" --http_command_executor="false" --http_credentials="/tmp/Endpoint_SlaveEndpointTest_AuthorizedRequest_2_ucVzCb/http_credentials"
--http_heartbeat_interval="30secs" --initialize_driver_logging="true" --isolation="posix/cpu,posix/mem"
--launcher="posix" --launcher_dir="/mesos/mesos-1.4.0/_build/src" --logbufsecs="0" --logging_level="INFO"
--max_completed_executors_per_framework="150" --oversubscribed_resources_interval="15secs"
--perf_duration="10secs" --perf_interval="1mins" --port="5051" --qos_correction_interval_min="0ns"
--quiet="false" --recover="reconnect" --recovery_timeout="15mins" --registration_backoff_factor="10ms"
--resources="cpus:2;gpus:0;mem:1024;disk:1024;ports:[31000-32000]" --revocable_cpu_low_priority="true"
--runtime_dir="/tmp/Endpoint_SlaveEndpointTest_AuthorizedRequest_2_ucVzCb" --sandbox_directory="/mnt/mesos/sandbox"
--strict="true" --switch_user="true" --systemd_enable_support="true" --systemd_runtime_directory="/run/systemd/system"
--version="false" --work_dir="/tmp/Endpoint_SlaveEndpointTest_AuthorizedRequest_2_NCAaLH"
I0615 04:30:34.378793  4598 credentials.hpp:86] Loading credential for authentication from
'/tmp/Endpoint_SlaveEndpointTest_AuthorizedRequest_2_ucVzCb/credential'
I0615 04:30:34.379223  4598 slave.cpp:281] Agent using credential for: test-principal
I0615 04:30:34.379439  4598 credentials.hpp:37] Loading credentials for authentication from
'/tmp/Endpoint_SlaveEndpointTest_AuthorizedRequest_2_ucVzCb/http_credentials'
I0615 04:30:34.380187  4598 http.cpp:975] Creating default 'basic' HTTP authenticator for
realm 'mesos-agent-readonly'
I0615 04:30:34.380628  4598 http.cpp:975] Creating default 'basic' HTTP authenticator for
realm 'mesos-agent-readwrite'
I0615 04:30:34.383235  4598 slave.cpp:552] Agent resources: cpus(*):2; mem(*):1024; disk(*):1024;
ports(*):[31000-32000]
I0615 04:30:34.383427  4598 slave.cpp:560] Agent attributes: [  ]
I0615 04:30:34.383633  4598 slave.cpp:565] Agent hostname: e720efbe8436
I0615 04:30:34.384161  4597 status_update_manager.cpp:177] Pausing sending status updates
I0615 04:30:34.386543  4598 state.cpp:62] Recovering state from '/tmp/Endpoint_SlaveEndpointTest_AuthorizedRequest_2_NCAaLH/meta'
I0615 04:30:34.387259  4595 status_update_manager.cpp:203] Recovering status update manager
I0615 04:30:34.387887  4597 containerizer.cpp:582] Recovering containerizer
I0615 04:30:34.390210  4594 provisioner.cpp:416] Provisioner recovery complete
I0615 04:30:34.390946  4592 slave.cpp:6127] Finished recovery
I0615 04:30:34.391957  4592 slave.cpp:6309] Querying resource estimator for oversubscribable
resources
I0615 04:30:34.392856  4592 slave.cpp:6323] Received oversubscribable resources {} from the
resource estimator
I0615 04:30:34.397436  4596 process.cpp:3778] Handling HTTP event for process 'slave(763)'
with path: '/slave(763)/containers'
I0615 04:30:34.400024  4596 http.cpp:1115] HTTP GET for /slave(763)/containers from 172.17.0.2:60476
I0615 04:30:34.400148  4596 http.cpp:936] Authorizing principal 'test-principal' to GET the
'/containers' endpoint
I0615 04:30:34.407166  4573 slave.cpp:817] Agent terminating
[       OK ] Endpoint/SlaveEndpointTest.AuthorizedRequest/2 (51 ms)
[ RUN      ] Endpoint/SlaveEndpointTest.UnauthorizedRequest/0
I0615 04:30:34.421913  4573 containerizer.cpp:230] Using isolation: posix/cpu,posix/mem,filesystem/posix,network/cni,environment_secret
W0615 04:30:34.422808  4573 backend.cpp:76] Failed to create 'overlay' backend: OverlayBackend
requires root privileges
W0615 04:30:34.423040  4573 backend.cpp:76] Failed to create 'bind' backend: BindBackend requires
root privileges
I0615 04:30:34.423084  4573 provisioner.cpp:255] Using default backend 'copy'
I0615 04:30:34.429234  4599 slave.cpp:248] Mesos agent started on (764)@172.17.0.2:35069
I0615 04:30:34.429564  4599 slave.cpp:249] Flags at startup: --acls="" --appc_simple_discovery_uri_prefix="http://"
--appc_store_dir="/tmp/Endpoint_SlaveEndpointTest_UnauthorizedRequest_0_4A32w7/store/appc"
--authenticate_http_readonly="true" --authenticate_http_readwrite="true" --authenticatee="crammd5"
--authentication_backoff_factor="1secs" --authorizer="local" --cgroups_cpu_enable_pids_and_tids_count="false"
--cgroups_enable_cfs="false" --cgroups_hierarchy="/sys/fs/cgroup" --cgroups_limit_swap="false"
--cgroups_root="mesos" --container_disk_watch_interval="15secs" --containerizers="mesos" --credential="/tmp/Endpoint_SlaveEndpointTest_UnauthorizedRequest_0_4A32w7/credential"
--default_role="*" --disk_watch_interval="1mins" --docker="docker" --docker_kill_orphans="true"
--docker_registry="https://registry-1.docker.io" --docker_remove_delay="6hrs" --docker_socket="/var/run/docker.sock"
--docker_stop_timeout="0ns" --docker_store_dir="/tmp/Endpoint_SlaveEndpointTest_UnauthorizedRequest_0_4A32w7/store/docker"
--docker_volume_checkpoint_dir="/var/run/mesos/isolators/docker/volume" --enforce_container_disk_quota="false"
--executor_registration_timeout="1mins" --executor_reregistration_timeout="2secs" --executor_shutdown_grace_period="5secs"
--fetcher_cache_dir="/tmp/Endpoint_SlaveEndpointTest_UnauthorizedRequest_0_4A32w7/fetch" --fetcher_cache_size="2GB"
--frameworks_home="" --gc_delay="1weeks" --gc_disk_headroom="0.1" --hadoop_home="" --help="false"
--hostname_lookup="true" --http_command_executor="false" --http_credentials="/tmp/Endpoint_SlaveEndpointTest_UnauthorizedRequest_0_4A32w7/http_credentials"
--http_heartbeat_interval="30secs" --initialize_driver_logging="true" --isolation="posix/cpu,posix/mem"
--launcher="posix" --launcher_dir="/mesos/mesos-1.4.0/_build/src" --logbufsecs="0" --logging_level="INFO"
--max_completed_executors_per_framework="150" --oversubscribed_resources_interval="15secs"
--perf_duration="10secs" --perf_interval="1mins" --port="5051" --qos_correction_interval_min="0ns"
--quiet="false" --recover="reconnect" --recovery_timeout="15mins" --registration_backoff_factor="10ms"
--resources="cpus:2;gpus:0;mem:1024;disk:1024;ports:[31000-32000]" --revocable_cpu_low_priority="true"
--runtime_dir="/tmp/Endpoint_SlaveEndpointTest_UnauthorizedRequest_0_4A32w7" --sandbox_directory="/mnt/mesos/sandbox"
--strict="true" --switch_user="true" --systemd_enable_support="true" --systemd_runtime_directory="/run/systemd/system"
--version="false" --work_dir="/tmp/Endpoint_SlaveEndpointTest_UnauthorizedRequest_0_lYbfxD"
I0615 04:30:34.430498  4599 credentials.hpp:86] Loading credential for authentication from
'/tmp/Endpoint_SlaveEndpointTest_UnauthorizedRequest_0_4A32w7/credential'
I0615 04:30:34.430939  4599 slave.cpp:281] Agent using credential for: test-principal
I0615 04:30:34.431063  4599 credentials.hpp:37] Loading credentials for authentication from
'/tmp/Endpoint_SlaveEndpointTest_UnauthorizedRequest_0_4A32w7/http_credentials'
I0615 04:30:34.431608  4599 http.cpp:975] Creating default 'basic' HTTP authenticator for
realm 'mesos-agent-readonly'
I0615 04:30:34.432042  4599 http.cpp:975] Creating default 'basic' HTTP authenticator for
realm 'mesos-agent-readwrite'
I0615 04:30:34.434588  4599 slave.cpp:552] Agent resources: cpus(*):2; mem(*):1024; disk(*):1024;
ports(*):[31000-32000]
I0615 04:30:34.434792  4599 slave.cpp:560] Agent attributes: [  ]
I0615 04:30:34.434907  4599 slave.cpp:565] Agent hostname: e720efbe8436
I0615 04:30:34.435348  4597 status_update_manager.cpp:177] Pausing sending status updates
I0615 04:30:34.437554  4597 state.cpp:62] Recovering state from '/tmp/Endpoint_SlaveEndpointTest_UnauthorizedRequest_0_lYbfxD/meta'
I0615 04:30:34.438293  4599 status_update_manager.cpp:203] Recovering status update manager
I0615 04:30:34.438740  4597 containerizer.cpp:582] Recovering containerizer
I0615 04:30:34.442812  4593 provisioner.cpp:416] Provisioner recovery complete
I0615 04:30:34.444018  4594 slave.cpp:6127] Finished recovery
I0615 04:30:34.444857  4594 slave.cpp:6309] Querying resource estimator for oversubscribable
resources
I0615 04:30:34.446030  4594 slave.cpp:6323] Received oversubscribable resources {} from the
resource estimator
I0615 04:30:34.450618  4597 process.cpp:3778] Handling HTTP event for process 'slave(764)'
with path: '/slave(764)/monitor/statistics'
I0615 04:30:34.453130  4597 http.cpp:1115] HTTP GET for /slave(764)/monitor/statistics from
172.17.0.2:60478
I0615 04:30:34.453251  4597 http.cpp:936] Authorizing principal 'test-principal' to GET the
'/monitor/statistics' endpoint
I0615 04:30:34.456962  4592 slave.cpp:817] Agent terminating
[       OK ] Endpoint/SlaveEndpointTest.UnauthorizedRequest/0 (49 ms)
[ RUN      ] Endpoint/SlaveEndpointTest.UnauthorizedRequest/1
I0615 04:30:34.472000  4573 containerizer.cpp:230] Using isolation: posix/cpu,posix/mem,filesystem/posix,network/cni,environment_secret
W0615 04:30:34.472949  4573 backend.cpp:76] Failed to create 'overlay' backend: OverlayBackend
requires root privileges
W0615 04:30:34.473131  4573 backend.cpp:76] Failed to create 'bind' backend: BindBackend requires
root privileges
I0615 04:30:34.473247  4573 provisioner.cpp:255] Using default backend 'copy'
I0615 04:30:34.479724  4592 slave.cpp:248] Mesos agent started on (765)@172.17.0.2:35069
I0615 04:30:34.479807  4592 slave.cpp:249] Flags at startup: --acls="" --appc_simple_discovery_uri_prefix="http://"
--appc_store_dir="/tmp/Endpoint_SlaveEndpointTest_UnauthorizedRequest_1_wNvpY3/store/appc"
--authenticate_http_readonly="true" --authenticate_http_readwrite="true" --authenticatee="crammd5"
--authentication_backoff_factor="1secs" --authorizer="local" --cgroups_cpu_enable_pids_and_tids_count="false"
--cgroups_enable_cfs="false" --cgroups_hierarchy="/sys/fs/cgroup" --cgroups_limit_swap="false"
--cgroups_root="mesos" --container_disk_watch_interval="15secs" --containerizers="mesos" --credential="/tmp/Endpoint_SlaveEndpointTest_UnauthorizedRequest_1_wNvpY3/credential"
--default_role="*" --disk_watch_interval="1mins" --docker="docker" --docker_kill_orphans="true"
--docker_registry="https://registry-1.docker.io" --docker_remove_delay="6hrs" --docker_socket="/var/run/docker.sock"
--docker_stop_timeout="0ns" --docker_store_dir="/tmp/Endpoint_SlaveEndpointTest_UnauthorizedRequest_1_wNvpY3/store/docker"
--docker_volume_checkpoint_dir="/var/run/mesos/isolators/docker/volume" --enforce_container_disk_quota="false"
--executor_registration_timeout="1mins" --executor_reregistration_timeout="2secs" --executor_shutdown_grace_period="5secs"
--fetcher_cache_dir="/tmp/Endpoint_SlaveEndpointTest_UnauthorizedRequest_1_wNvpY3/fetch" --fetcher_cache_size="2GB"
--frameworks_home="" --gc_delay="1weeks" --gc_disk_headroom="0.1" --hadoop_home="" --help="false"
--hostname_lookup="true" --http_command_executor="false" --http_credentials="/tmp/Endpoint_SlaveEndpointTest_UnauthorizedRequest_1_wNvpY3/http_credentials"
--http_heartbeat_interval="30secs" --initialize_driver_logging="true" --isolation="posix/cpu,posix/mem"
--launcher="posix" --launcher_dir="/mesos/mesos-1.4.0/_build/src" --logbufsecs="0" --logging_level="INFO"
--max_completed_executors_per_framework="150" --oversubscribed_resources_interval="15secs"
--perf_duration="10secs" --perf_interval="1mins" --port="5051" --qos_correction_interval_min="0ns"
--quiet="false" --recover="reconnect" --recovery_timeout="15mins" --registration_backoff_factor="10ms"
--resources="cpus:2;gpus:0;mem:1024;disk:1024;ports:[31000-32000]" --revocable_cpu_low_priority="true"
--runtime_dir="/tmp/Endpoint_SlaveEndpointTest_UnauthorizedRequest_1_wNvpY3" --sandbox_directory="/mnt/mesos/sandbox"
--strict="true" --switch_user="true" --systemd_enable_support="true" --systemd_runtime_directory="/run/systemd/system"
--version="false" --work_dir="/tmp/Endpoint_SlaveEndpointTest_UnauthorizedRequest_1_vByuQz"
I0615 04:30:34.480659  4592 credentials.hpp:86] Loading credential for authentication from
'/tmp/Endpoint_SlaveEndpointTest_UnauthorizedRequest_1_wNvpY3/credential'
I0615 04:30:34.481084  4592 slave.cpp:281] Agent using credential for: test-principal
I0615 04:30:34.481159  4592 credentials.hpp:37] Loading credentials for authentication from
'/tmp/Endpoint_SlaveEndpointTest_UnauthorizedRequest_1_wNvpY3/http_credentials'
I0615 04:30:34.481698  4592 http.cpp:975] Creating default 'basic' HTTP authenticator for
realm 'mesos-agent-readonly'
I0615 04:30:34.482316  4592 http.cpp:975] Creating default 'basic' HTTP authenticator for
realm 'mesos-agent-readwrite'
I0615 04:30:34.485280  4592 slave.cpp:552] Agent resources: cpus(*):2; mem(*):1024; disk(*):1024;
ports(*):[31000-32000]
I0615 04:30:34.485471  4592 slave.cpp:560] Agent attributes: [  ]
I0615 04:30:34.485584  4592 slave.cpp:565] Agent hostname: e720efbe8436
I0615 04:30:34.488049  4592 status_update_manager.cpp:177] Pausing sending status updates
I0615 04:30:34.489341  4599 state.cpp:62] Recovering state from '/tmp/Endpoint_SlaveEndpointTest_UnauthorizedRequest_1_vByuQz/meta'
I0615 04:30:34.490099  4599 status_update_manager.cpp:203] Recovering status update manager
I0615 04:30:34.490618  4599 containerizer.cpp:582] Recovering containerizer
I0615 04:30:34.493010  4599 provisioner.cpp:416] Provisioner recovery complete
I0615 04:30:34.493952  4595 slave.cpp:6127] Finished recovery
I0615 04:30:34.494941  4595 slave.cpp:6309] Querying resource estimator for oversubscribable
resources
I0615 04:30:34.495573  4595 slave.cpp:6323] Received oversubscribable resources {} from the
resource estimator
I0615 04:30:34.500116  4594 process.cpp:3778] Handling HTTP event for process 'slave(765)'
with path: '/slave(765)/monitor/statistics.json'
I0615 04:30:34.502707  4594 http.cpp:1115] HTTP GET for /slave(765)/monitor/statistics.json
from 172.17.0.2:60480
I0615 04:30:34.502825  4594 http.cpp:936] Authorizing principal 'test-principal' to GET the
'/monitor/statistics.json' endpoint
I0615 04:30:34.506621  4573 slave.cpp:817] Agent terminating
[       OK ] Endpoint/SlaveEndpointTest.UnauthorizedRequest/1 (49 ms)
[ RUN      ] Endpoint/SlaveEndpointTest.UnauthorizedRequest/2
I0615 04:30:34.521548  4573 containerizer.cpp:230] Using isolation: posix/cpu,posix/mem,filesystem/posix,network/cni,environment_secret
W0615 04:30:34.522447  4573 backend.cpp:76] Failed to create 'overlay' backend: OverlayBackend
requires root privileges
W0615 04:30:34.522685  4573 backend.cpp:76] Failed to create 'bind' backend: BindBackend requires
root privileges
I0615 04:30:34.522728  4573 provisioner.cpp:255] Using default backend 'copy'
I0615 04:30:34.527660  4597 slave.cpp:248] Mesos agent started on (766)@172.17.0.2:35069
I0615 04:30:34.527704  4597 slave.cpp:249] Flags at startup: --acls="" --appc_simple_discovery_uri_prefix="http://"
--appc_store_dir="/tmp/Endpoint_SlaveEndpointTest_UnauthorizedRequest_2_egMWV0/store/appc"
--authenticate_http_readonly="true" --authenticate_http_readwrite="true" --authenticatee="crammd5"
--authentication_backoff_factor="1secs" --authorizer="local" --cgroups_cpu_enable_pids_and_tids_count="false"
--cgroups_enable_cfs="false" --cgroups_hierarchy="/sys/fs/cgroup" --cgroups_limit_swap="false"
--cgroups_root="mesos" --container_disk_watch_interval="15secs" --containerizers="mesos" --credential="/tmp/Endpoint_SlaveEndpointTest_UnauthorizedRequest_2_egMWV0/credential"
--default_role="*" --disk_watch_interval="1mins" --docker="docker" --docker_kill_orphans="true"
--docker_registry="https://registry-1.docker.io" --docker_remove_delay="6hrs" --docker_socket="/var/run/docker.sock"
--docker_stop_timeout="0ns" --docker_store_dir="/tmp/Endpoint_SlaveEndpointTest_UnauthorizedRequest_2_egMWV0/store/docker"
--docker_volume_checkpoint_dir="/var/run/mesos/isolators/docker/volume" --enforce_container_disk_quota="false"
--executor_registration_timeout="1mins" --executor_reregistration_timeout="2secs" --executor_shutdown_grace_period="5secs"
--fetcher_cache_dir="/tmp/Endpoint_SlaveEndpointTest_UnauthorizedRequest_2_egMWV0/fetch" --fetcher_cache_size="2GB"
--frameworks_home="" --gc_delay="1weeks" --gc_disk_headroom="0.1" --hadoop_home="" --help="false"
--hostname_lookup="true" --http_command_executor="false" --http_credentials="/tmp/Endpoint_SlaveEndpointTest_UnauthorizedRequest_2_egMWV0/http_credentials"
--http_heartbeat_interval="30secs" --initialize_driver_logging="true" --isolation="posix/cpu,posix/mem"
--launcher="posix" --launcher_dir="/mesos/mesos-1.4.0/_build/src" --logbufsecs="0" --logging_level="INFO"
--max_completed_executors_per_framework="150" --oversubscribed_resources_interval="15secs"
--perf_duration="10secs" --perf_interval="1mins" --port="5051" --qos_correction_interval_min="0ns"
--quiet="false" --recover="reconnect" --recovery_timeout="15mins" --registration_backoff_factor="10ms"
--resources="cpus:2;gpus:0;mem:1024;disk:1024;ports:[31000-32000]" --revocable_cpu_low_priority="true"
--runtime_dir="/tmp/Endpoint_SlaveEndpointTest_UnauthorizedRequest_2_egMWV0" --sandbox_directory="/mnt/mesos/sandbox"
--strict="true" --switch_user="true" --systemd_enable_support="true" --systemd_runtime_directory="/run/systemd/system"
--version="false" --work_dir="/tmp/Endpoint_SlaveEndpointTest_UnauthorizedRequest_2_bNY0Fw"
I0615 04:30:34.528586  4597 credentials.hpp:86] Loading credential for authentication from
'/tmp/Endpoint_SlaveEndpointTest_UnauthorizedRequest_2_egMWV0/credential'
I0615 04:30:34.529028  4597 slave.cpp:281] Agent using credential for: test-principal
I0615 04:30:34.529067  4597 credentials.hpp:37] Loading credentials for authentication from
'/tmp/Endpoint_SlaveEndpointTest_UnauthorizedRequest_2_egMWV0/http_credentials'
I0615 04:30:34.529646  4597 http.cpp:975] Creating default 'basic' HTTP authenticator for
realm 'mesos-agent-readonly'
I0615 04:30:34.530074  4597 http.cpp:975] Creating default 'basic' HTTP authenticator for
realm 'mesos-agent-readwrite'
I0615 04:30:34.532497  4597 slave.cpp:552] Agent resources: cpus(*):2; mem(*):1024; disk(*):1024;
ports(*):[31000-32000]
I0615 04:30:34.532644  4597 slave.cpp:560] Agent attributes: [  ]
I0615 04:30:34.532665  4597 slave.cpp:565] Agent hostname: e720efbe8436
I0615 04:30:34.533083  4594 status_update_manager.cpp:177] Pausing sending status updates
I0615 04:30:34.536308  4597 state.cpp:62] Recovering state from '/tmp/Endpoint_SlaveEndpointTest_UnauthorizedRequest_2_bNY0Fw/meta'
I0615 04:30:34.537041  4595 status_update_manager.cpp:203] Recovering status update manager
I0615 04:30:34.537542  4594 containerizer.cpp:582] Recovering containerizer
I0615 04:30:34.540220  4592 provisioner.cpp:416] Provisioner recovery complete
I0615 04:30:34.541478  4594 slave.cpp:6127] Finished recovery
I0615 04:30:34.542857  4594 slave.cpp:6309] Querying resource estimator for oversubscribable
resources
I0615 04:30:34.543419  4598 slave.cpp:6323] Received oversubscribable resources {} from the
resource estimator
I0615 04:30:34.548219  4593 process.cpp:3778] Handling HTTP event for process 'slave(766)'
with path: '/slave(766)/containers'
I0615 04:30:34.551048  4593 http.cpp:1115] HTTP GET for /slave(766)/containers from 172.17.0.2:60482
I0615 04:30:34.551168  4593 http.cpp:936] Authorizing principal 'test-principal' to GET the
'/containers' endpoint
I0615 04:30:34.555797  4596 slave.cpp:817] Agent terminating
[       OK ] Endpoint/SlaveEndpointTest.UnauthorizedRequest/2 (49 ms)
[ RUN      ] Endpoint/SlaveEndpointTest.NoAuthorizer/0
I0615 04:30:34.572124  4573 containerizer.cpp:230] Using isolation: posix/cpu,posix/mem,filesystem/posix,network/cni,environment_secret
W0615 04:30:34.572999  4573 backend.cpp:76] Failed to create 'overlay' backend: OverlayBackend
requires root privileges
W0615 04:30:34.573237  4573 backend.cpp:76] Failed to create 'bind' backend: BindBackend requires
root privileges
I0615 04:30:34.573288  4573 provisioner.cpp:255] Using default backend 'copy'
I0615 04:30:34.575615  4573 cluster.cpp:448] Creating default 'local' authorizer
I0615 04:30:34.578318  4598 slave.cpp:248] Mesos agent started on (767)@172.17.0.2:35069
I0615 04:30:34.578439  4598 slave.cpp:249] Flags at startup: --acls="" --appc_simple_discovery_uri_prefix="http://"
--appc_store_dir="/tmp/Endpoint_SlaveEndpointTest_NoAuthorizer_0_SERDpY/store/appc" --authenticate_http_readonly="true"
--authenticate_http_readwrite="true" --authenticatee="crammd5" --authentication_backoff_factor="1secs"
--authorizer="local" --cgroups_cpu_enable_pids_and_tids_count="false" --cgroups_enable_cfs="false"
--cgroups_hierarchy="/sys/fs/cgroup" --cgroups_limit_swap="false" --cgroups_root="mesos" --container_disk_watch_interval="15secs"
--containerizers="mesos" --credential="/tmp/Endpoint_SlaveEndpointTest_NoAuthorizer_0_SERDpY/credential"
--default_role="*" --disk_watch_interval="1mins" --docker="docker" --docker_kill_orphans="true"
--docker_registry="https://registry-1.docker.io" --docker_remove_delay="6hrs" --docker_socket="/var/run/docker.sock"
--docker_stop_timeout="0ns" --docker_store_dir="/tmp/Endpoint_SlaveEndpointTest_NoAuthorizer_0_SERDpY/store/docker"
--docker_volume_checkpoint_dir="/var/run/mesos/isolators/docker/volume" --enforce_container_disk_quota="false"
--executor_registration_timeout="1mins" --executor_reregistration_timeout="2secs" --executor_shutdown_grace_period="5secs"
--fetcher_cache_dir="/tmp/Endpoint_SlaveEndpointTest_NoAuthorizer_0_SERDpY/fetch" --fetcher_cache_size="2GB"
--frameworks_home="" --gc_delay="1weeks" --gc_disk_headroom="0.1" --hadoop_home="" --help="false"
--hostname_lookup="true" --http_command_executor="false" --http_credentials="/tmp/Endpoint_SlaveEndpointTest_NoAuthorizer_0_SERDpY/http_credentials"
--http_heartbeat_interval="30secs" --initialize_driver_logging="true" --isolation="posix/cpu,posix/mem"
--launcher="posix" --launcher_dir="/mesos/mesos-1.4.0/_build/src" --logbufsecs="0" --logging_level="INFO"
--max_completed_executors_per_framework="150" --oversubscribed_resources_interval="15secs"
--perf_duration="10secs" --perf_interval="1mins" --port="5051" --qos_correction_interval_min="0ns"
--quiet="false" --recover="reconnect" --recovery_timeout="15mins" --registration_backoff_factor="10ms"
--resources="cpus:2;gpus:0;mem:1024;disk:1024;ports:[31000-32000]" --revocable_cpu_low_priority="true"
--runtime_dir="/tmp/Endpoint_SlaveEndpointTest_NoAuthorizer_0_SERDpY" --sandbox_directory="/mnt/mesos/sandbox"
--strict="true" --switch_user="true" --systemd_enable_support="true" --systemd_runtime_directory="/run/systemd/system"
--version="false" --work_dir="/tmp/Endpoint_SlaveEndpointTest_NoAuthorizer_0_7A2y1t"
I0615 04:30:34.579315  4598 credentials.hpp:86] Loading credential for authentication from
'/tmp/Endpoint_SlaveEndpointTest_NoAuthorizer_0_SERDpY/credential'
I0615 04:30:34.579681  4598 slave.cpp:281] Agent using credential for: test-principal
I0615 04:30:34.579802  4598 credentials.hpp:37] Loading credentials for authentication from
'/tmp/Endpoint_SlaveEndpointTest_NoAuthorizer_0_SERDpY/http_credentials'
I0615 04:30:34.580322  4598 http.cpp:975] Creating default 'basic' HTTP authenticator for
realm 'mesos-agent-readonly'
I0615 04:30:34.580672  4598 http.cpp:975] Creating default 'basic' HTTP authenticator for
realm 'mesos-agent-readwrite'
I0615 04:30:34.582924  4598 slave.cpp:552] Agent resources: cpus(*):2; mem(*):1024; disk(*):1024;
ports(*):[31000-32000]
I0615 04:30:34.583371  4598 slave.cpp:560] Agent attributes: [  ]
I0615 04:30:34.583461  4598 slave.cpp:565] Agent hostname: e720efbe8436
I0615 04:30:34.583919  4596 status_update_manager.cpp:177] Pausing sending status updates
I0615 04:30:34.586443  4596 state.cpp:62] Recovering state from '/tmp/Endpoint_SlaveEndpointTest_NoAuthorizer_0_7A2y1t/meta'
I0615 04:30:34.586915  4598 status_update_manager.cpp:203] Recovering status update manager
I0615 04:30:34.587442  4598 containerizer.cpp:582] Recovering containerizer
I0615 04:30:34.589951  4596 provisioner.cpp:416] Provisioner recovery complete
I0615 04:30:34.590656  4595 slave.cpp:6127] Finished recovery
I0615 04:30:34.591650  4595 slave.cpp:6309] Querying resource estimator for oversubscribable
resources
I0615 04:30:34.592269  4595 slave.cpp:6323] Received oversubscribable resources {} from the
resource estimator
I0615 04:30:34.597096  4593 process.cpp:3778] Handling HTTP event for process 'slave(767)'
with path: '/slave(767)/monitor/statistics'
I0615 04:30:34.600057  4597 http.cpp:1115] HTTP GET for /slave(767)/monitor/statistics from
172.17.0.2:60484
I0615 04:30:34.600235  4597 http.cpp:936] Authorizing principal 'test-principal' to GET the
'/monitor/statistics' endpoint
I0615 04:30:34.606310  4573 slave.cpp:817] Agent terminating
[       OK ] Endpoint/SlaveEndpointTest.NoAuthorizer/0 (49 ms)
[ RUN      ] Endpoint/SlaveEndpointTest.NoAuthorizer/1
I0615 04:30:34.621421  4573 containerizer.cpp:230] Using isolation: posix/cpu,posix/mem,filesystem/posix,network/cni,environment_secret
W0615 04:30:34.622305  4573 backend.cpp:76] Failed to create 'overlay' backend: OverlayBackend
requires root privileges
W0615 04:30:34.622545  4573 backend.cpp:76] Failed to create 'bind' backend: BindBackend requires
root privileges
I0615 04:30:34.622596  4573 provisioner.cpp:255] Using default backend 'copy'
I0615 04:30:34.624944  4573 cluster.cpp:448] Creating default 'local' authorizer
I0615 04:30:34.628868  4597 slave.cpp:248] Mesos agent started on (768)@172.17.0.2:35069
I0615 04:30:34.628909  4597 slave.cpp:249] Flags at startup: --acls="" --appc_simple_discovery_uri_prefix="http://"
--appc_store_dir="/tmp/Endpoint_SlaveEndpointTest_NoAuthorizer_1_UjxfpW/store/appc" --authenticate_http_readonly="true"
--authenticate_http_readwrite="true" --authenticatee="crammd5" --authentication_backoff_factor="1secs"
--authorizer="local" --cgroups_cpu_enable_pids_and_tids_count="false" --cgroups_enable_cfs="false"
--cgroups_hierarchy="/sys/fs/cgroup" --cgroups_limit_swap="false" --cgroups_root="mesos" --container_disk_watch_interval="15secs"
--containerizers="mesos" --credential="/tmp/Endpoint_SlaveEndpointTest_NoAuthorizer_1_UjxfpW/credential"
--default_role="*" --disk_watch_interval="1mins" --docker="docker" --docker_kill_orphans="true"
--docker_registry="https://registry-1.docker.io" --docker_remove_delay="6hrs" --docker_socket="/var/run/docker.sock"
--docker_stop_timeout="0ns" --docker_store_dir="/tmp/Endpoint_SlaveEndpointTest_NoAuthorizer_1_UjxfpW/store/docker"
--docker_volume_checkpoint_dir="/var/run/mesos/isolators/docker/volume" --enforce_container_disk_quota="false"
--executor_registration_timeout="1mins" --executor_reregistration_timeout="2secs" --executor_shutdown_grace_period="5secs"
--fetcher_cache_dir="/tmp/Endpoint_SlaveEndpointTest_NoAuthorizer_1_UjxfpW/fetch" --fetcher_cache_size="2GB"
--frameworks_home="" --gc_delay="1weeks" --gc_disk_headroom="0.1" --hadoop_home="" --help="false"
--hostname_lookup="true" --http_command_executor="false" --http_credentials="/tmp/Endpoint_SlaveEndpointTest_NoAuthorizer_1_UjxfpW/http_credentials"
--http_heartbeat_interval="30secs" --initialize_driver_logging="true" --isolation="posix/cpu,posix/mem"
--launcher="posix" --launcher_dir="/mesos/mesos-1.4.0/_build/src" --logbufsecs="0" --logging_level="INFO"
--max_completed_executors_per_framework="150" --oversubscribed_resources_interval="15secs"
--perf_duration="10secs" --perf_interval="1mins" --port="5051" --qos_correction_interval_min="0ns"
--quiet="false" --recover="reconnect" --recovery_timeout="15mins" --registration_backoff_factor="10ms"
--resources="cpus:2;gpus:0;mem:1024;disk:1024;ports:[31000-32000]" --revocable_cpu_low_priority="true"
--runtime_dir="/tmp/Endpoint_SlaveEndpointTest_NoAuthorizer_1_UjxfpW" --sandbox_directory="/mnt/mesos/sandbox"
--strict="true" --switch_user="true" --systemd_enable_support="true" --systemd_runtime_directory="/run/systemd/system"
--version="false" --work_dir="/tmp/Endpoint_SlaveEndpointTest_NoAuthorizer_1_P1vbTr"
I0615 04:30:34.629937  4597 credentials.hpp:86] Loading credential for authentication from
'/tmp/Endpoint_SlaveEndpointTest_NoAuthorizer_1_UjxfpW/credential'
I0615 04:30:34.630372  4597 slave.cpp:281] Agent using credential for: test-principal
I0615 04:30:34.630405  4597 credentials.hpp:37] Loading credentials for authentication from
'/tmp/Endpoint_SlaveEndpointTest_NoAuthorizer_1_UjxfpW/http_credentials'
I0615 04:30:34.630924  4597 http.cpp:975] Creating default 'basic' HTTP authenticator for
realm 'mesos-agent-readonly'
I0615 04:30:34.631330  4597 http.cpp:975] Creating default 'basic' HTTP authenticator for
realm 'mesos-agent-readwrite'
I0615 04:30:34.633761  4597 slave.cpp:552] Agent resources: cpus(*):2; mem(*):1024; disk(*):1024;
ports(*):[31000-32000]
I0615 04:30:34.633937  4597 slave.cpp:560] Agent attributes: [  ]
I0615 04:30:34.633957  4597 slave.cpp:565] Agent hostname: e720efbe8436
I0615 04:30:34.634213  4592 status_update_manager.cpp:177] Pausing sending status updates
I0615 04:30:34.636914  4592 state.cpp:62] Recovering state from '/tmp/Endpoint_SlaveEndpointTest_NoAuthorizer_1_P1vbTr/meta'
I0615 04:30:34.637584  4596 status_update_manager.cpp:203] Recovering status update manager
I0615 04:30:34.637962  4594 containerizer.cpp:582] Recovering containerizer
I0615 04:30:34.640249  4594 provisioner.cpp:416] Provisioner recovery complete
I0615 04:30:34.640764  4595 slave.cpp:6127] Finished recovery
I0615 04:30:34.641683  4595 slave.cpp:6309] Querying resource estimator for oversubscribable
resources
I0615 04:30:34.642380  4599 slave.cpp:6323] Received oversubscribable resources {} from the
resource estimator
I0615 04:30:34.647300  4594 process.cpp:3778] Handling HTTP event for process 'slave(768)'
with path: '/slave(768)/monitor/statistics.json'
I0615 04:30:34.649580  4594 http.cpp:1115] HTTP GET for /slave(768)/monitor/statistics.json
from 172.17.0.2:60486
I0615 04:30:34.649709  4594 http.cpp:936] Authorizing principal 'test-principal' to GET the
'/monitor/statistics.json' endpoint
I0615 04:30:34.655310  4592 slave.cpp:817] Agent terminating
[       OK ] Endpoint/SlaveEndpointTest.NoAuthorizer/1 (49 ms)
[ RUN      ] Endpoint/SlaveEndpointTest.NoAuthorizer/2
I0615 04:30:34.670727  4573 containerizer.cpp:230] Using isolation: posix/cpu,posix/mem,filesystem/posix,network/cni,environment_secret
W0615 04:30:34.671618  4573 backend.cpp:76] Failed to create 'overlay' backend: OverlayBackend
requires root privileges
W0615 04:30:34.671792  4573 backend.cpp:76] Failed to create 'bind' backend: BindBackend requires
root privileges
I0615 04:30:34.671900  4573 provisioner.cpp:255] Using default backend 'copy'
I0615 04:30:34.674247  4573 cluster.cpp:448] Creating default 'local' authorizer
I0615 04:30:34.678184  4594 slave.cpp:248] Mesos agent started on (769)@172.17.0.2:35069
I0615 04:30:34.678226  4594 slave.cpp:249] Flags at startup: --acls="" --appc_simple_discovery_uri_prefix="http://"
--appc_store_dir="/tmp/Endpoint_SlaveEndpointTest_NoAuthorizer_2_GylUUU/store/appc" --authenticate_http_readonly="true"
--authenticate_http_readwrite="true" --authenticatee="crammd5" --authentication_backoff_factor="1secs"
--authorizer="local" --cgroups_cpu_enable_pids_and_tids_count="false" --cgroups_enable_cfs="false"
--cgroups_hierarchy="/sys/fs/cgroup" --cgroups_limit_swap="false" --cgroups_root="mesos" --container_disk_watch_interval="15secs"
--containerizers="mesos" --credential="/tmp/Endpoint_SlaveEndpointTest_NoAuthorizer_2_GylUUU/credential"
--default_role="*" --disk_watch_interval="1mins" --docker="docker" --docker_kill_orphans="true"
--docker_registry="https://registry-1.docker.io" --docker_remove_delay="6hrs" --docker_socket="/var/run/docker.sock"
--docker_stop_timeout="0ns" --docker_store_dir="/tmp/Endpoint_SlaveEndpointTest_NoAuthorizer_2_GylUUU/store/docker"
--docker_volume_checkpoint_dir="/var/run/mesos/isolators/docker/volume" --enforce_container_disk_quota="false"
--executor_registration_timeout="1mins" --executor_reregistration_timeout="2secs" --executor_shutdown_grace_period="5secs"
--fetcher_cache_dir="/tmp/Endpoint_SlaveEndpointTest_NoAuthorizer_2_GylUUU/fetch" --fetcher_cache_size="2GB"
--frameworks_home="" --gc_delay="1weeks" --gc_disk_headroom="0.1" --hadoop_home="" --help="false"
--hostname_lookup="true" --http_command_executor="false" --http_credentials="/tmp/Endpoint_SlaveEndpointTest_NoAuthorizer_2_GylUUU/http_credentials"
--http_heartbeat_interval="30secs" --initialize_driver_logging="true" --isolation="posix/cpu,posix/mem"
--launcher="posix" --launcher_dir="/mesos/mesos-1.4.0/_build/src" --logbufsecs="0" --logging_level="INFO"
--max_completed_executors_per_framework="150" --oversubscribed_resources_interval="15secs"
--perf_duration="10secs" --perf_interval="1mins" --port="5051" --qos_correction_interval_min="0ns"
--quiet="false" --recover="reconnect" --recovery_timeout="15mins" --registration_backoff_factor="10ms"
--resources="cpus:2;gpus:0;mem:1024;disk:1024;ports:[31000-32000]" --revocable_cpu_low_priority="true"
--runtime_dir="/tmp/Endpoint_SlaveEndpointTest_NoAuthorizer_2_GylUUU" --sandbox_directory="/mnt/mesos/sandbox"
--strict="true" --switch_user="true" --systemd_enable_support="true" --systemd_runtime_directory="/run/systemd/system"
--version="false" --work_dir="/tmp/Endpoint_SlaveEndpointTest_NoAuthorizer_2_5lhRgq"
I0615 04:30:34.679271  4594 credentials.hpp:86] Loading credential for authentication from
'/tmp/Endpoint_SlaveEndpointTest_NoAuthorizer_2_GylUUU/credential'
I0615 04:30:34.679697  4594 slave.cpp:281] Agent using credential for: test-principal
I0615 04:30:34.679728  4594 credentials.hpp:37] Loading credentials for authentication from
'/tmp/Endpoint_SlaveEndpointTest_NoAuthorizer_2_GylUUU/http_credentials'
I0615 04:30:34.680224  4594 http.cpp:975] Creating default 'basic' HTTP authenticator for
realm 'mesos-agent-readonly'
I0615 04:30:34.680761  4594 http.cpp:975] Creating default 'basic' HTTP authenticator for
realm 'mesos-agent-readwrite'
I0615 04:30:34.683037  4594 slave.cpp:552] Agent resources: cpus(*):2; mem(*):1024; disk(*):1024;
ports(*):[31000-32000]
I0615 04:30:34.683290  4594 slave.cpp:560] Agent attributes: [  ]
I0615 04:30:34.683315  4594 slave.cpp:565] Agent hostname: e720efbe8436
I0615 04:30:34.683670  4595 status_update_manager.cpp:177] Pausing sending status updates
I0615 04:30:34.686187  4598 state.cpp:62] Recovering state from '/tmp/Endpoint_SlaveEndpointTest_NoAuthorizer_2_5lhRgq/meta'
I0615 04:30:34.687233  4598 status_update_manager.cpp:203] Recovering status update manager
I0615 04:30:34.687659  4598 containerizer.cpp:582] Recovering containerizer
I0615 04:30:34.690116  4593 provisioner.cpp:416] Provisioner recovery complete
I0615 04:30:34.690672  4599 slave.cpp:6127] Finished recovery
I0615 04:30:34.691998  4599 slave.cpp:6309] Querying resource estimator for oversubscribable
resources
I0615 04:30:34.692648  4599 slave.cpp:6323] Received oversubscribable resources {} from the
resource estimator
I0615 04:30:34.697042  4596 process.cpp:3778] Handling HTTP event for process 'slave(769)'
with path: '/slave(769)/containers'
I0615 04:30:34.699653  4593 http.cpp:1115] HTTP GET for /slave(769)/containers from 172.17.0.2:60488
I0615 04:30:34.699779  4593 http.cpp:936] Authorizing principal 'test-principal' to GET the
'/containers' endpoint
I0615 04:30:34.710220  4593 slave.cpp:817] Agent terminating
[       OK ] Endpoint/SlaveEndpointTest.NoAuthorizer/2 (54 ms)
[----------] 9 tests from Endpoint/SlaveEndpointTest (478 ms total)

[----------] Global test environment tear-down
[==========] 1596 tests from 176 test cases ran. (781991 ms total)
[  PASSED  ] 1592 tests.
[  FAILED  ] 4 tests, listed below:
[  FAILED  ] DefaultExecutorCheckTest.CommandCheckDeliveredAndReconciled
[  FAILED  ] DefaultExecutorCheckTest.CommandCheckStatusChange
[  FAILED  ] DefaultExecutorCheckTest.CommandCheckSeesParentsEnv
[  FAILED  ] DefaultExecutorCheckTest.CommandCheckSharesWorkDirWithTask

 4 FAILED TESTS
  YOU HAVE 19 DISABLED TESTS

E0615 04:30:34.852030  4600 process.cpp:968] Failed to accept socket: future discarded
make[4]: *** [check-local] Error 1
make[4]: Leaving directory `/mesos/mesos-1.4.0/_build/src'
make[3]: *** [check-am] Error 2
make[3]: Leaving directory `/mesos/mesos-1.4.0/_build/src'
make[2]: *** [check] Error 2
make[2]: Leaving directory `/mesos/mesos-1.4.0/_build/src'
make[1]: *** [check-recursive] Error 1
make[1]: Leaving directory `/mesos/mesos-1.4.0/_build'
make: *** [distcheck] Error 1
+ docker rmi mesos-1497494663-31174
Untagged: mesos-1497494663-31174:latest
Deleted: sha256:77cd32a7f298046d8d462803534134b949646832db6740f3e4b4c3b8e55ca673
Deleted: sha256:c4da8138ffb926d4d68fbd7ec88608315a0ce639e71bbd79aaa5905d201a57b9
Deleted: sha256:3c067c81ea2af3d4fcd6fc756d7811274244210b6afa59f9dd5a9789e7c6042b
Deleted: sha256:29679209ea70e51f36f0870f86a5d52b12610d6759e55a34b6f199fed87e27ad
Deleted: sha256:3fec74347679807d6085d28d9dad01632b6c9485b4ed6decd8f2e631bb5cedb3
Deleted: sha256:ee8cc388c26dfb8705c46644fb46d3cfabff2fb7293a62d27f3c437a0b3e3b28
Deleted: sha256:eb87aaf7a70fc27fd5ca3e1d907aa6e730af989073d6a342882fd7b8abcd67ff
Deleted: sha256:846a8b06ce4915568a7d9dd7e98b1aba1d343cdd8d325b20222fbc2fa9cd929a
Deleted: sha256:4d9282a19e784fbd9f25c7e1ada7b8725e05c88dec62b0f029f1f4b278d04fdf
Deleted: sha256:9b9069d8b7c162fbbf4532281629e9ef44eb72690541e4aa6b61825f83a22a5a
Deleted: sha256:550fceeec3c21c0e3ef89a15f208aa8c657fb82e482786321e0ca80f77d42bdb
Deleted: sha256:0963acf09076c56bda8841719986730503449baf8b15b81ad72c6a4a03221fe4
Deleted: sha256:36493a95cf06b065b648d64f30bb0f1a7ca6b7dcbfedd19c952a811be4ee3b02
Deleted: sha256:063246e935f991a816a5633650791c8069f7e0809aea9b7e3c02a714313a83e7
Deleted: sha256:8913a64ec81b7676633acd4366ed2af4ac719e390cdfeb81e75df3a3be76c8b3
Deleted: sha256:95535f64c924a913a2a089dabc5b5f02543d324262f00ab6a48d18486e94f12b
Deleted: sha256:1214b49906b6072b97ed0666c677ceab6bbba59f3504619cf86ae6e29ee93a97
Deleted: sha256:daa96040d710081cf7b711ffd8fe6869f304f173f2fe47ae15dc5c6edc5d149d
Deleted: sha256:390458042d21486a5023a09b42e0f98a37c5998a320b1c05e190d8438bb799cd
Deleted: sha256:0e91b506c881781bd960a768d4700768243d874f01a5ea6f5113869549862e9c
Deleted: sha256:d2f28cb3199311a0b940e30055e7cd1f93b0bbcb729141db39bb647121e38ab6
Deleted: sha256:7e059658eaf0d1977a4f307ecd537c93634f029cf1c9a20f1acd9107d8c78e8a
Deleted: sha256:da4f889a2cb18fa7226a6a3956072e71852854072d5865dec124369ddb989f1d
Deleted: sha256:87a504e46c7f02717a566ef3181319ab6e080ce61f01238dc9bf6ac284c1ad9a
Build step 'Execute shell' marked build as failure

Mime
View raw message