mesos-builds mailing list archives

Site index · List index
Message view « Date » · « Thread »
Top « Date » · « Thread »
From Apache Jenkins Server <jenk...@builds.apache.org>
Subject Build failed in Jenkins: Mesos-Reviewbot #18318
Date Fri, 09 Jun 2017 07:26:28 GMT
See <https://builds.apache.org/job/Mesos-Reviewbot/18318/display/redirect>

------------------------------------------
[...truncated 28.26 MB...]
I0609 07:26:17.852227  4510 containerizer.cpp:230] Using isolation: posix/cpu,posix/mem,filesystem/posix,network/cni,environment_secret
W0609 07:26:17.853338  4510 backend.cpp:76] Failed to create 'overlay' backend: OverlayBackend
requires root privileges
W0609 07:26:17.853545  4510 backend.cpp:76] Failed to create 'bind' backend: BindBackend requires
root privileges
I0609 07:26:17.853659  4510 provisioner.cpp:255] Using default backend 'copy'
I0609 07:26:17.861552  4534 slave.cpp:248] Mesos agent started on (756)@172.17.0.2:36263
I0609 07:26:17.861601  4534 slave.cpp:249] Flags at startup: --acls="" --appc_simple_discovery_uri_prefix="http://"
--appc_store_dir="/tmp/Endpoint_SlaveEndpointTest_AuthorizedRequest_2_ahIvPq/store/appc" --authenticate_http_readonly="true"
--authenticate_http_readwrite="true" --authenticatee="crammd5" --authentication_backoff_factor="1secs"
--authorizer="local" --cgroups_cpu_enable_pids_and_tids_count="false" --cgroups_enable_cfs="false"
--cgroups_hierarchy="/sys/fs/cgroup" --cgroups_limit_swap="false" --cgroups_root="mesos" --container_disk_watch_interval="15secs"
--containerizers="mesos" --credential="/tmp/Endpoint_SlaveEndpointTest_AuthorizedRequest_2_ahIvPq/credential"
--default_role="*" --disk_watch_interval="1mins" --docker="docker" --docker_kill_orphans="true"
--docker_registry="https://registry-1.docker.io" --docker_remove_delay="6hrs" --docker_socket="/var/run/docker.sock"
--docker_stop_timeout="0ns" --docker_store_dir="/tmp/Endpoint_SlaveEndpointTest_AuthorizedRequest_2_ahIvPq/store/docker"
--docker_volume_checkpoint_dir="/var/run/mesos/isolators/docker/volume" --enforce_container_disk_quota="false"
--executor_registration_timeout="1mins" --executor_reregistration_timeout="2secs" --executor_shutdown_grace_period="5secs"
--fetcher_cache_dir="/tmp/Endpoint_SlaveEndpointTest_AuthorizedRequest_2_ahIvPq/fetch" --fetcher_cache_size="2GB"
--frameworks_home="" --gc_delay="1weeks" --gc_disk_headroom="0.1" --hadoop_home="" --help="false"
--hostname_lookup="true" --http_command_executor="false" --http_credentials="/tmp/Endpoint_SlaveEndpointTest_AuthorizedRequest_2_ahIvPq/http_credentials"
--http_heartbeat_interval="30secs" --initialize_driver_logging="true" --isolation="posix/cpu,posix/mem"
--launcher="posix" --launcher_dir="/mesos/mesos-1.4.0/_build/src" --logbufsecs="0" --logging_level="INFO"
--max_completed_executors_per_framework="150" --oversubscribed_resources_interval="15secs"
--perf_duration="10secs" --perf_interval="1mins" --port="5051" --qos_correction_interval_min="0ns"
--quiet="false" --recover="reconnect" --recovery_timeout="15mins" --registration_backoff_factor="10ms"
--resources="cpus:2;gpus:0;mem:1024;disk:1024;ports:[31000-32000]" --revocable_cpu_low_priority="true"
--runtime_dir="/tmp/Endpoint_SlaveEndpointTest_AuthorizedRequest_2_ahIvPq" --sandbox_directory="/mnt/mesos/sandbox"
--strict="true" --switch_user="true" --systemd_enable_support="true" --systemd_runtime_directory="/run/systemd/system"
--version="false" --work_dir="/tmp/Endpoint_SlaveEndpointTest_AuthorizedRequest_2_qMkP1u"
I0609 07:26:17.862473  4534 credentials.hpp:86] Loading credential for authentication from
'/tmp/Endpoint_SlaveEndpointTest_AuthorizedRequest_2_ahIvPq/credential'
I0609 07:26:17.862875  4534 slave.cpp:281] Agent using credential for: test-principal
I0609 07:26:17.862910  4534 credentials.hpp:37] Loading credentials for authentication from
'/tmp/Endpoint_SlaveEndpointTest_AuthorizedRequest_2_ahIvPq/http_credentials'
I0609 07:26:17.863420  4534 http.cpp:975] Creating default 'basic' HTTP authenticator for
realm 'mesos-agent-readonly'
I0609 07:26:17.863834  4534 http.cpp:975] Creating default 'basic' HTTP authenticator for
realm 'mesos-agent-readwrite'
I0609 07:26:17.866174  4534 slave.cpp:552] Agent resources: cpus(*):2; mem(*):1024; disk(*):1024;
ports(*):[31000-32000]
I0609 07:26:17.866327  4534 slave.cpp:560] Agent attributes: [  ]
I0609 07:26:17.866348  4534 slave.cpp:565] Agent hostname: 165adef78ac1
I0609 07:26:17.867032  4529 status_update_manager.cpp:177] Pausing sending status updates
I0609 07:26:17.870370  4536 state.cpp:62] Recovering state from '/tmp/Endpoint_SlaveEndpointTest_AuthorizedRequest_2_qMkP1u/meta'
I0609 07:26:17.871568  4536 status_update_manager.cpp:203] Recovering status update manager
I0609 07:26:17.872285  4536 containerizer.cpp:582] Recovering containerizer
I0609 07:26:17.877602  4536 provisioner.cpp:416] Provisioner recovery complete
I0609 07:26:17.882479  4530 slave.cpp:6127] Finished recovery
I0609 07:26:17.883427  4530 slave.cpp:6309] Querying resource estimator for oversubscribable
resources
I0609 07:26:17.884138  4530 slave.cpp:6323] Received oversubscribable resources {} from the
resource estimator
I0609 07:26:17.894659  4529 process.cpp:3778] Handling HTTP event for process 'slave(756)'
with path: '/slave(756)/containers'
I0609 07:26:17.897747  4529 http.cpp:1115] HTTP GET for /slave(756)/containers from 172.17.0.2:55272
I0609 07:26:17.897883  4529 http.cpp:936] Authorizing principal 'test-principal' to GET the
'/containers' endpoint
I0609 07:26:17.914139  4510 slave.cpp:817] Agent terminating
[       OK ] Endpoint/SlaveEndpointTest.AuthorizedRequest/2 (96 ms)
[ RUN      ] Endpoint/SlaveEndpointTest.UnauthorizedRequest/0
I0609 07:26:17.943022  4510 containerizer.cpp:230] Using isolation: posix/cpu,posix/mem,filesystem/posix,network/cni,environment_secret
W0609 07:26:17.946523  4510 backend.cpp:76] Failed to create 'overlay' backend: OverlayBackend
requires root privileges
W0609 07:26:17.946764  4510 backend.cpp:76] Failed to create 'bind' backend: BindBackend requires
root privileges
I0609 07:26:17.946821  4510 provisioner.cpp:255] Using default backend 'copy'
I0609 07:26:17.955885  4535 slave.cpp:248] Mesos agent started on (757)@172.17.0.2:36263
I0609 07:26:17.955937  4535 slave.cpp:249] Flags at startup: --acls="" --appc_simple_discovery_uri_prefix="http://"
--appc_store_dir="/tmp/Endpoint_SlaveEndpointTest_UnauthorizedRequest_0_guHASa/store/appc"
--authenticate_http_readonly="true" --authenticate_http_readwrite="true" --authenticatee="crammd5"
--authentication_backoff_factor="1secs" --authorizer="local" --cgroups_cpu_enable_pids_and_tids_count="false"
--cgroups_enable_cfs="false" --cgroups_hierarchy="/sys/fs/cgroup" --cgroups_limit_swap="false"
--cgroups_root="mesos" --container_disk_watch_interval="15secs" --containerizers="mesos" --credential="/tmp/Endpoint_SlaveEndpointTest_UnauthorizedRequest_0_guHASa/credential"
--default_role="*" --disk_watch_interval="1mins" --docker="docker" --docker_kill_orphans="true"
--docker_registry="https://registry-1.docker.io" --docker_remove_delay="6hrs" --docker_socket="/var/run/docker.sock"
--docker_stop_timeout="0ns" --docker_store_dir="/tmp/Endpoint_SlaveEndpointTest_UnauthorizedRequest_0_guHASa/store/docker"
--docker_volume_checkpoint_dir="/var/run/mesos/isolators/docker/volume" --enforce_container_disk_quota="false"
--executor_registration_timeout="1mins" --executor_reregistration_timeout="2secs" --executor_shutdown_grace_period="5secs"
--fetcher_cache_dir="/tmp/Endpoint_SlaveEndpointTest_UnauthorizedRequest_0_guHASa/fetch" --fetcher_cache_size="2GB"
--frameworks_home="" --gc_delay="1weeks" --gc_disk_headroom="0.1" --hadoop_home="" --help="false"
--hostname_lookup="true" --http_command_executor="false" --http_credentials="/tmp/Endpoint_SlaveEndpointTest_UnauthorizedRequest_0_guHASa/http_credentials"
--http_heartbeat_interval="30secs" --initialize_driver_logging="true" --isolation="posix/cpu,posix/mem"
--launcher="posix" --launcher_dir="/mesos/mesos-1.4.0/_build/src" --logbufsecs="0" --logging_level="INFO"
--max_completed_executors_per_framework="150" --oversubscribed_resources_interval="15secs"
--perf_duration="10secs" --perf_interval="1mins" --port="5051" --qos_correction_interval_min="0ns"
--quiet="false" --recover="reconnect" --recovery_timeout="15mins" --registration_backoff_factor="10ms"
--resources="cpus:2;gpus:0;mem:1024;disk:1024;ports:[31000-32000]" --revocable_cpu_low_priority="true"
--runtime_dir="/tmp/Endpoint_SlaveEndpointTest_UnauthorizedRequest_0_guHASa" --sandbox_directory="/mnt/mesos/sandbox"
--strict="true" --switch_user="true" --systemd_enable_support="true" --systemd_runtime_directory="/run/systemd/system"
--version="false" --work_dir="/tmp/Endpoint_SlaveEndpointTest_UnauthorizedRequest_0_WCHwPe"
I0609 07:26:17.956984  4535 credentials.hpp:86] Loading credential for authentication from
'/tmp/Endpoint_SlaveEndpointTest_UnauthorizedRequest_0_guHASa/credential'
I0609 07:26:17.957657  4535 slave.cpp:281] Agent using credential for: test-principal
I0609 07:26:17.957711  4535 credentials.hpp:37] Loading credentials for authentication from
'/tmp/Endpoint_SlaveEndpointTest_UnauthorizedRequest_0_guHASa/http_credentials'
I0609 07:26:17.958482  4535 http.cpp:975] Creating default 'basic' HTTP authenticator for
realm 'mesos-agent-readonly'
I0609 07:26:17.959272  4535 http.cpp:975] Creating default 'basic' HTTP authenticator for
realm 'mesos-agent-readwrite'
I0609 07:26:17.962694  4535 slave.cpp:552] Agent resources: cpus(*):2; mem(*):1024; disk(*):1024;
ports(*):[31000-32000]
I0609 07:26:17.962872  4535 slave.cpp:560] Agent attributes: [  ]
I0609 07:26:17.962894  4535 slave.cpp:565] Agent hostname: 165adef78ac1
I0609 07:26:17.963474  4533 status_update_manager.cpp:177] Pausing sending status updates
I0609 07:26:17.967509  4531 state.cpp:62] Recovering state from '/tmp/Endpoint_SlaveEndpointTest_UnauthorizedRequest_0_WCHwPe/meta'
I0609 07:26:17.971738  4534 status_update_manager.cpp:203] Recovering status update manager
I0609 07:26:17.972251  4532 containerizer.cpp:582] Recovering containerizer
I0609 07:26:17.979930  4534 provisioner.cpp:416] Provisioner recovery complete
I0609 07:26:17.981010  4531 slave.cpp:6127] Finished recovery
I0609 07:26:17.981889  4531 slave.cpp:6309] Querying resource estimator for oversubscribable
resources
I0609 07:26:17.984550  4529 slave.cpp:6323] Received oversubscribable resources {} from the
resource estimator
I0609 07:26:17.994187  4530 process.cpp:3778] Handling HTTP event for process 'slave(757)'
with path: '/slave(757)/monitor/statistics'
I0609 07:26:17.997216  4530 http.cpp:1115] HTTP GET for /slave(757)/monitor/statistics from
172.17.0.2:55274
I0609 07:26:17.997359  4530 http.cpp:936] Authorizing principal 'test-principal' to GET the
'/monitor/statistics' endpoint
I0609 07:26:18.006893  4510 slave.cpp:817] Agent terminating
[       OK ] Endpoint/SlaveEndpointTest.UnauthorizedRequest/0 (85 ms)
[ RUN      ] Endpoint/SlaveEndpointTest.UnauthorizedRequest/1
I0609 07:26:18.027434  4510 containerizer.cpp:230] Using isolation: posix/cpu,posix/mem,filesystem/posix,network/cni,environment_secret
W0609 07:26:18.028702  4510 backend.cpp:76] Failed to create 'overlay' backend: OverlayBackend
requires root privileges
W0609 07:26:18.028914  4510 backend.cpp:76] Failed to create 'bind' backend: BindBackend requires
root privileges
I0609 07:26:18.028971  4510 provisioner.cpp:255] Using default backend 'copy'
I0609 07:26:18.038404  4532 slave.cpp:248] Mesos agent started on (758)@172.17.0.2:36263
I0609 07:26:18.038462  4532 slave.cpp:249] Flags at startup: --acls="" --appc_simple_discovery_uri_prefix="http://"
--appc_store_dir="/tmp/Endpoint_SlaveEndpointTest_UnauthorizedRequest_1_KRf2QV/store/appc"
--authenticate_http_readonly="true" --authenticate_http_readwrite="true" --authenticatee="crammd5"
--authentication_backoff_factor="1secs" --authorizer="local" --cgroups_cpu_enable_pids_and_tids_count="false"
--cgroups_enable_cfs="false" --cgroups_hierarchy="/sys/fs/cgroup" --cgroups_limit_swap="false"
--cgroups_root="mesos" --container_disk_watch_interval="15secs" --containerizers="mesos" --credential="/tmp/Endpoint_SlaveEndpointTest_UnauthorizedRequest_1_KRf2QV/credential"
--default_role="*" --disk_watch_interval="1mins" --docker="docker" --docker_kill_orphans="true"
--docker_registry="https://registry-1.docker.io" --docker_remove_delay="6hrs" --docker_socket="/var/run/docker.sock"
--docker_stop_timeout="0ns" --docker_store_dir="/tmp/Endpoint_SlaveEndpointTest_UnauthorizedRequest_1_KRf2QV/store/docker"
--docker_volume_checkpoint_dir="/var/run/mesos/isolators/docker/volume" --enforce_container_disk_quota="false"
--executor_registration_timeout="1mins" --executor_reregistration_timeout="2secs" --executor_shutdown_grace_period="5secs"
--fetcher_cache_dir="/tmp/Endpoint_SlaveEndpointTest_UnauthorizedRequest_1_KRf2QV/fetch" --fetcher_cache_size="2GB"
--frameworks_home="" --gc_delay="1weeks" --gc_disk_headroom="0.1" --hadoop_home="" --help="false"
--hostname_lookup="true" --http_command_executor="false" --http_credentials="/tmp/Endpoint_SlaveEndpointTest_UnauthorizedRequest_1_KRf2QV/http_credentials"
--http_heartbeat_interval="30secs" --initialize_driver_logging="true" --isolation="posix/cpu,posix/mem"
--launcher="posix" --launcher_dir="/mesos/mesos-1.4.0/_build/src" --logbufsecs="0" --logging_level="INFO"
--max_completed_executors_per_framework="150" --oversubscribed_resources_interval="15secs"
--perf_duration="10secs" --perf_interval="1mins" --port="5051" --qos_correction_interval_min="0ns"
--quiet="false" --recover="reconnect" --recovery_timeout="15mins" --registration_backoff_factor="10ms"
--resources="cpus:2;gpus:0;mem:1024;disk:1024;ports:[31000-32000]" --revocable_cpu_low_priority="true"
--runtime_dir="/tmp/Endpoint_SlaveEndpointTest_UnauthorizedRequest_1_KRf2QV" --sandbox_directory="/mnt/mesos/sandbox"
--strict="true" --switch_user="true" --systemd_enable_support="true" --systemd_runtime_directory="/run/systemd/system"
--version="false" --work_dir="/tmp/Endpoint_SlaveEndpointTest_UnauthorizedRequest_1_ma89zZ"
I0609 07:26:18.039476  4532 credentials.hpp:86] Loading credential for authentication from
'/tmp/Endpoint_SlaveEndpointTest_UnauthorizedRequest_1_KRf2QV/credential'
I0609 07:26:18.039892  4532 slave.cpp:281] Agent using credential for: test-principal
I0609 07:26:18.039927  4532 credentials.hpp:37] Loading credentials for authentication from
'/tmp/Endpoint_SlaveEndpointTest_UnauthorizedRequest_1_KRf2QV/http_credentials'
I0609 07:26:18.040396  4532 http.cpp:975] Creating default 'basic' HTTP authenticator for
realm 'mesos-agent-readonly'
I0609 07:26:18.040710  4532 http.cpp:975] Creating default 'basic' HTTP authenticator for
realm 'mesos-agent-readwrite'
I0609 07:26:18.054582  4532 slave.cpp:552] Agent resources: cpus(*):2; mem(*):1024; disk(*):1024;
ports(*):[31000-32000]
I0609 07:26:18.054740  4532 slave.cpp:560] Agent attributes: [  ]
I0609 07:26:18.054838  4532 slave.cpp:565] Agent hostname: 165adef78ac1
I0609 07:26:18.057179  4532 status_update_manager.cpp:177] Pausing sending status updates
I0609 07:26:18.062016  4535 state.cpp:62] Recovering state from '/tmp/Endpoint_SlaveEndpointTest_UnauthorizedRequest_1_ma89zZ/meta'
I0609 07:26:18.062975  4535 status_update_manager.cpp:203] Recovering status update manager
I0609 07:26:18.063400  4535 containerizer.cpp:582] Recovering containerizer
I0609 07:26:18.067284  4535 provisioner.cpp:416] Provisioner recovery complete
I0609 07:26:18.068269  4534 slave.cpp:6127] Finished recovery
I0609 07:26:18.069105  4534 slave.cpp:6309] Querying resource estimator for oversubscribable
resources
I0609 07:26:18.069716  4529 slave.cpp:6323] Received oversubscribable resources {} from the
resource estimator
I0609 07:26:18.079388  4530 process.cpp:3778] Handling HTTP event for process 'slave(758)'
with path: '/slave(758)/monitor/statistics.json'
I0609 07:26:18.082682  4533 http.cpp:1115] HTTP GET for /slave(758)/monitor/statistics.json
from 172.17.0.2:55276
I0609 07:26:18.082830  4533 http.cpp:936] Authorizing principal 'test-principal' to GET the
'/monitor/statistics.json' endpoint
I0609 07:26:18.087826  4529 slave.cpp:817] Agent terminating
[       OK ] Endpoint/SlaveEndpointTest.UnauthorizedRequest/1 (80 ms)
[ RUN      ] Endpoint/SlaveEndpointTest.UnauthorizedRequest/2
I0609 07:26:18.106889  4510 containerizer.cpp:230] Using isolation: posix/cpu,posix/mem,filesystem/posix,network/cni,environment_secret
W0609 07:26:18.107925  4510 backend.cpp:76] Failed to create 'overlay' backend: OverlayBackend
requires root privileges
W0609 07:26:18.108222  4510 backend.cpp:76] Failed to create 'bind' backend: BindBackend requires
root privileges
I0609 07:26:18.108340  4510 provisioner.cpp:255] Using default backend 'copy'
I0609 07:26:18.115399  4533 slave.cpp:248] Mesos agent started on (759)@172.17.0.2:36263
I0609 07:26:18.115453  4533 slave.cpp:249] Flags at startup: --acls="" --appc_simple_discovery_uri_prefix="http://"
--appc_store_dir="/tmp/Endpoint_SlaveEndpointTest_UnauthorizedRequest_2_AiqBGH/store/appc"
--authenticate_http_readonly="true" --authenticate_http_readwrite="true" --authenticatee="crammd5"
--authentication_backoff_factor="1secs" --authorizer="local" --cgroups_cpu_enable_pids_and_tids_count="false"
--cgroups_enable_cfs="false" --cgroups_hierarchy="/sys/fs/cgroup" --cgroups_limit_swap="false"
--cgroups_root="mesos" --container_disk_watch_interval="15secs" --containerizers="mesos" --credential="/tmp/Endpoint_SlaveEndpointTest_UnauthorizedRequest_2_AiqBGH/credential"
--default_role="*" --disk_watch_interval="1mins" --docker="docker" --docker_kill_orphans="true"
--docker_registry="https://registry-1.docker.io" --docker_remove_delay="6hrs" --docker_socket="/var/run/docker.sock"
--docker_stop_timeout="0ns" --docker_store_dir="/tmp/Endpoint_SlaveEndpointTest_UnauthorizedRequest_2_AiqBGH/store/docker"
--docker_volume_checkpoint_dir="/var/run/mesos/isolators/docker/volume" --enforce_container_disk_quota="false"
--executor_registration_timeout="1mins" --executor_reregistration_timeout="2secs" --executor_shutdown_grace_period="5secs"
--fetcher_cache_dir="/tmp/Endpoint_SlaveEndpointTest_UnauthorizedRequest_2_AiqBGH/fetch" --fetcher_cache_size="2GB"
--frameworks_home="" --gc_delay="1weeks" --gc_disk_headroom="0.1" --hadoop_home="" --help="false"
--hostname_lookup="true" --http_command_executor="false" --http_credentials="/tmp/Endpoint_SlaveEndpointTest_UnauthorizedRequest_2_AiqBGH/http_credentials"
--http_heartbeat_interval="30secs" --initialize_driver_logging="true" --isolation="posix/cpu,posix/mem"
--launcher="posix" --launcher_dir="/mesos/mesos-1.4.0/_build/src" --logbufsecs="0" --logging_level="INFO"
--max_completed_executors_per_framework="150" --oversubscribed_resources_interval="15secs"
--perf_duration="10secs" --perf_interval="1mins" --port="5051" --qos_correction_interval_min="0ns"
--quiet="false" --recover="reconnect" --recovery_timeout="15mins" --registration_backoff_factor="10ms"
--resources="cpus:2;gpus:0;mem:1024;disk:1024;ports:[31000-32000]" --revocable_cpu_low_priority="true"
--runtime_dir="/tmp/Endpoint_SlaveEndpointTest_UnauthorizedRequest_2_AiqBGH" --sandbox_directory="/mnt/mesos/sandbox"
--strict="true" --switch_user="true" --systemd_enable_support="true" --systemd_runtime_directory="/run/systemd/system"
--version="false" --work_dir="/tmp/Endpoint_SlaveEndpointTest_UnauthorizedRequest_2_eCQJcL"
I0609 07:26:18.116210  4533 credentials.hpp:86] Loading credential for authentication from
'/tmp/Endpoint_SlaveEndpointTest_UnauthorizedRequest_2_AiqBGH/credential'
I0609 07:26:18.116506  4533 slave.cpp:281] Agent using credential for: test-principal
I0609 07:26:18.116544  4533 credentials.hpp:37] Loading credentials for authentication from
'/tmp/Endpoint_SlaveEndpointTest_UnauthorizedRequest_2_AiqBGH/http_credentials'
I0609 07:26:18.117002  4533 http.cpp:975] Creating default 'basic' HTTP authenticator for
realm 'mesos-agent-readonly'
I0609 07:26:18.117291  4533 http.cpp:975] Creating default 'basic' HTTP authenticator for
realm 'mesos-agent-readwrite'
I0609 07:26:18.120730  4533 slave.cpp:552] Agent resources: cpus(*):2; mem(*):1024; disk(*):1024;
ports(*):[31000-32000]
I0609 07:26:18.120909  4533 slave.cpp:560] Agent attributes: [  ]
I0609 07:26:18.120949  4533 slave.cpp:565] Agent hostname: 165adef78ac1
I0609 07:26:18.121728  4531 status_update_manager.cpp:177] Pausing sending status updates
I0609 07:26:18.125062  4536 state.cpp:62] Recovering state from '/tmp/Endpoint_SlaveEndpointTest_UnauthorizedRequest_2_eCQJcL/meta'
I0609 07:26:18.125669  4533 status_update_manager.cpp:203] Recovering status update manager
I0609 07:26:18.126161  4532 containerizer.cpp:582] Recovering containerizer
I0609 07:26:18.129745  4533 provisioner.cpp:416] Provisioner recovery complete
I0609 07:26:18.130645  4531 slave.cpp:6127] Finished recovery
I0609 07:26:18.131750  4531 slave.cpp:6309] Querying resource estimator for oversubscribable
resources
I0609 07:26:18.132210  4533 slave.cpp:6323] Received oversubscribable resources {} from the
resource estimator
I0609 07:26:18.141975  4533 process.cpp:3778] Handling HTTP event for process 'slave(759)'
with path: '/slave(759)/containers'
I0609 07:26:18.145553  4534 http.cpp:1115] HTTP GET for /slave(759)/containers from 172.17.0.2:55278
I0609 07:26:18.145711  4534 http.cpp:936] Authorizing principal 'test-principal' to GET the
'/containers' endpoint
I0609 07:26:18.157536  4510 slave.cpp:817] Agent terminating
[       OK ] Endpoint/SlaveEndpointTest.UnauthorizedRequest/2 (78 ms)
[ RUN      ] Endpoint/SlaveEndpointTest.NoAuthorizer/0
I0609 07:26:18.197257  4510 containerizer.cpp:230] Using isolation: posix/cpu,posix/mem,filesystem/posix,network/cni,environment_secret
W0609 07:26:18.198593  4510 backend.cpp:76] Failed to create 'overlay' backend: OverlayBackend
requires root privileges
W0609 07:26:18.198900  4510 backend.cpp:76] Failed to create 'bind' backend: BindBackend requires
root privileges
I0609 07:26:18.199003  4510 provisioner.cpp:255] Using default backend 'copy'
I0609 07:26:18.204810  4510 cluster.cpp:448] Creating default 'local' authorizer
I0609 07:26:18.209328  4531 slave.cpp:248] Mesos agent started on (760)@172.17.0.2:36263
I0609 07:26:18.209378  4531 slave.cpp:249] Flags at startup: --acls="" --appc_simple_discovery_uri_prefix="http://"
--appc_store_dir="/tmp/Endpoint_SlaveEndpointTest_NoAuthorizer_0_AqmXiu/store/appc" --authenticate_http_readonly="true"
--authenticate_http_readwrite="true" --authenticatee="crammd5" --authentication_backoff_factor="1secs"
--authorizer="local" --cgroups_cpu_enable_pids_and_tids_count="false" --cgroups_enable_cfs="false"
--cgroups_hierarchy="/sys/fs/cgroup" --cgroups_limit_swap="false" --cgroups_root="mesos" --container_disk_watch_interval="15secs"
--containerizers="mesos" --credential="/tmp/Endpoint_SlaveEndpointTest_NoAuthorizer_0_AqmXiu/credential"
--default_role="*" --disk_watch_interval="1mins" --docker="docker" --docker_kill_orphans="true"
--docker_registry="https://registry-1.docker.io" --docker_remove_delay="6hrs" --docker_socket="/var/run/docker.sock"
--docker_stop_timeout="0ns" --docker_store_dir="/tmp/Endpoint_SlaveEndpointTest_NoAuthorizer_0_AqmXiu/store/docker"
--docker_volume_checkpoint_dir="/var/run/mesos/isolators/docker/volume" --enforce_container_disk_quota="false"
--executor_registration_timeout="1mins" --executor_reregistration_timeout="2secs" --executor_shutdown_grace_period="5secs"
--fetcher_cache_dir="/tmp/Endpoint_SlaveEndpointTest_NoAuthorizer_0_AqmXiu/fetch" --fetcher_cache_size="2GB"
--frameworks_home="" --gc_delay="1weeks" --gc_disk_headroom="0.1" --hadoop_home="" --help="false"
--hostname_lookup="true" --http_command_executor="false" --http_credentials="/tmp/Endpoint_SlaveEndpointTest_NoAuthorizer_0_AqmXiu/http_credentials"
--http_heartbeat_interval="30secs" --initialize_driver_logging="true" --isolation="posix/cpu,posix/mem"
--launcher="posix" --launcher_dir="/mesos/mesos-1.4.0/_build/src" --logbufsecs="0" --logging_level="INFO"
--max_completed_executors_per_framework="150" --oversubscribed_resources_interval="15secs"
--perf_duration="10secs" --perf_interval="1mins" --port="5051" --qos_correction_interval_min="0ns"
--quiet="false" --recover="reconnect" --recovery_timeout="15mins" --registration_backoff_factor="10ms"
--resources="cpus:2;gpus:0;mem:1024;disk:1024;ports:[31000-32000]" --revocable_cpu_low_priority="true"
--runtime_dir="/tmp/Endpoint_SlaveEndpointTest_NoAuthorizer_0_AqmXiu" --sandbox_directory="/mnt/mesos/sandbox"
--strict="true" --switch_user="true" --systemd_enable_support="true" --systemd_runtime_directory="/run/systemd/system"
--version="false" --work_dir="/tmp/Endpoint_SlaveEndpointTest_NoAuthorizer_0_GAS3Bx"
I0609 07:26:18.210515  4531 credentials.hpp:86] Loading credential for authentication from
'/tmp/Endpoint_SlaveEndpointTest_NoAuthorizer_0_AqmXiu/credential'
I0609 07:26:18.210832  4531 slave.cpp:281] Agent using credential for: test-principal
I0609 07:26:18.210875  4531 credentials.hpp:37] Loading credentials for authentication from
'/tmp/Endpoint_SlaveEndpointTest_NoAuthorizer_0_AqmXiu/http_credentials'
I0609 07:26:18.211596  4531 http.cpp:975] Creating default 'basic' HTTP authenticator for
realm 'mesos-agent-readonly'
I0609 07:26:18.211895  4531 http.cpp:975] Creating default 'basic' HTTP authenticator for
realm 'mesos-agent-readwrite'
I0609 07:26:18.217181  4531 slave.cpp:552] Agent resources: cpus(*):2; mem(*):1024; disk(*):1024;
ports(*):[31000-32000]
I0609 07:26:18.217339  4531 slave.cpp:560] Agent attributes: [  ]
I0609 07:26:18.217360  4531 slave.cpp:565] Agent hostname: 165adef78ac1
I0609 07:26:18.217782  4535 status_update_manager.cpp:177] Pausing sending status updates
I0609 07:26:18.221410  4533 state.cpp:62] Recovering state from '/tmp/Endpoint_SlaveEndpointTest_NoAuthorizer_0_GAS3Bx/meta'
I0609 07:26:18.230908  4531 status_update_manager.cpp:203] Recovering status update manager
I0609 07:26:18.231603  4531 containerizer.cpp:582] Recovering containerizer
I0609 07:26:18.236107  4534 provisioner.cpp:416] Provisioner recovery complete
I0609 07:26:18.237293  4534 slave.cpp:6127] Finished recovery
I0609 07:26:18.238975  4534 slave.cpp:6309] Querying resource estimator for oversubscribable
resources
I0609 07:26:18.239917  4534 slave.cpp:6323] Received oversubscribable resources {} from the
resource estimator
I0609 07:26:18.248579  4532 process.cpp:3778] Handling HTTP event for process 'slave(760)'
with path: '/slave(760)/monitor/statistics'
I0609 07:26:18.251937  4532 http.cpp:1115] HTTP GET for /slave(760)/monitor/statistics from
172.17.0.2:55280
I0609 07:26:18.252076  4532 http.cpp:936] Authorizing principal 'test-principal' to GET the
'/monitor/statistics' endpoint
I0609 07:26:18.263237  4510 slave.cpp:817] Agent terminating
[       OK ] Endpoint/SlaveEndpointTest.NoAuthorizer/0 (99 ms)
[ RUN      ] Endpoint/SlaveEndpointTest.NoAuthorizer/1
I0609 07:26:18.286113  4510 containerizer.cpp:230] Using isolation: posix/cpu,posix/mem,filesystem/posix,network/cni,environment_secret
W0609 07:26:18.287502  4510 backend.cpp:76] Failed to create 'overlay' backend: OverlayBackend
requires root privileges
W0609 07:26:18.287720  4510 backend.cpp:76] Failed to create 'bind' backend: BindBackend requires
root privileges
I0609 07:26:18.287776  4510 provisioner.cpp:255] Using default backend 'copy'
I0609 07:26:18.292932  4510 cluster.cpp:448] Creating default 'local' authorizer
I0609 07:26:18.297745  4529 slave.cpp:248] Mesos agent started on (761)@172.17.0.2:36263
I0609 07:26:18.297907  4529 slave.cpp:249] Flags at startup: --acls="" --appc_simple_discovery_uri_prefix="http://"
--appc_store_dir="/tmp/Endpoint_SlaveEndpointTest_NoAuthorizer_1_genaYh/store/appc" --authenticate_http_readonly="true"
--authenticate_http_readwrite="true" --authenticatee="crammd5" --authentication_backoff_factor="1secs"
--authorizer="local" --cgroups_cpu_enable_pids_and_tids_count="false" --cgroups_enable_cfs="false"
--cgroups_hierarchy="/sys/fs/cgroup" --cgroups_limit_swap="false" --cgroups_root="mesos" --container_disk_watch_interval="15secs"
--containerizers="mesos" --credential="/tmp/Endpoint_SlaveEndpointTest_NoAuthorizer_1_genaYh/credential"
--default_role="*" --disk_watch_interval="1mins" --docker="docker" --docker_kill_orphans="true"
--docker_registry="https://registry-1.docker.io" --docker_remove_delay="6hrs" --docker_socket="/var/run/docker.sock"
--docker_stop_timeout="0ns" --docker_store_dir="/tmp/Endpoint_SlaveEndpointTest_NoAuthorizer_1_genaYh/store/docker"
--docker_volume_checkpoint_dir="/var/run/mesos/isolators/docker/volume" --enforce_container_disk_quota="false"
--executor_registration_timeout="1mins" --executor_reregistration_timeout="2secs" --executor_shutdown_grace_period="5secs"
--fetcher_cache_dir="/tmp/Endpoint_SlaveEndpointTest_NoAuthorizer_1_genaYh/fetch" --fetcher_cache_size="2GB"
--frameworks_home="" --gc_delay="1weeks" --gc_disk_headroom="0.1" --hadoop_home="" --help="false"
--hostname_lookup="true" --http_command_executor="false" --http_credentials="/tmp/Endpoint_SlaveEndpointTest_NoAuthorizer_1_genaYh/http_credentials"
--http_heartbeat_interval="30secs" --initialize_driver_logging="true" --isolation="posix/cpu,posix/mem"
--launcher="posix" --launcher_dir="/mesos/mesos-1.4.0/_build/src" --logbufsecs="0" --logging_level="INFO"
--max_completed_executors_per_framework="150" --oversubscribed_resources_interval="15secs"
--perf_duration="10secs" --perf_interval="1mins" --port="5051" --qos_correction_interval_min="0ns"
--quiet="false" --recover="reconnect" --recovery_timeout="15mins" --registration_backoff_factor="10ms"
--resources="cpus:2;gpus:0;mem:1024;disk:1024;ports:[31000-32000]" --revocable_cpu_low_priority="true"
--runtime_dir="/tmp/Endpoint_SlaveEndpointTest_NoAuthorizer_1_genaYh" --sandbox_directory="/mnt/mesos/sandbox"
--strict="true" --switch_user="true" --systemd_enable_support="true" --systemd_runtime_directory="/run/systemd/system"
--version="false" --work_dir="/tmp/Endpoint_SlaveEndpointTest_NoAuthorizer_1_KY5w1k"
I0609 07:26:18.299077  4529 credentials.hpp:86] Loading credential for authentication from
'/tmp/Endpoint_SlaveEndpointTest_NoAuthorizer_1_genaYh/credential'
I0609 07:26:18.299386  4529 slave.cpp:281] Agent using credential for: test-principal
I0609 07:26:18.299448  4529 credentials.hpp:37] Loading credentials for authentication from
'/tmp/Endpoint_SlaveEndpointTest_NoAuthorizer_1_genaYh/http_credentials'
I0609 07:26:18.299865  4529 http.cpp:975] Creating default 'basic' HTTP authenticator for
realm 'mesos-agent-readonly'
I0609 07:26:18.300411  4529 http.cpp:975] Creating default 'basic' HTTP authenticator for
realm 'mesos-agent-readwrite'
I0609 07:26:18.302542  4529 slave.cpp:552] Agent resources: cpus(*):2; mem(*):1024; disk(*):1024;
ports(*):[31000-32000]
I0609 07:26:18.308919  4529 slave.cpp:560] Agent attributes: [  ]
I0609 07:26:18.308993  4529 slave.cpp:565] Agent hostname: 165adef78ac1
I0609 07:26:18.309340  4536 status_update_manager.cpp:177] Pausing sending status updates
I0609 07:26:18.312721  4529 state.cpp:62] Recovering state from '/tmp/Endpoint_SlaveEndpointTest_NoAuthorizer_1_KY5w1k/meta'
I0609 07:26:18.313468  4529 status_update_manager.cpp:203] Recovering status update manager
I0609 07:26:18.313941  4536 containerizer.cpp:582] Recovering containerizer
I0609 07:26:18.316721  4531 provisioner.cpp:416] Provisioner recovery complete
I0609 07:26:18.317965  4531 slave.cpp:6127] Finished recovery
I0609 07:26:18.319192  4531 slave.cpp:6309] Querying resource estimator for oversubscribable
resources
I0609 07:26:18.319797  4531 slave.cpp:6323] Received oversubscribable resources {} from the
resource estimator
I0609 07:26:18.326437  4531 process.cpp:3778] Handling HTTP event for process 'slave(761)'
with path: '/slave(761)/monitor/statistics.json'
I0609 07:26:18.330390  4532 http.cpp:1115] HTTP GET for /slave(761)/monitor/statistics.json
from 172.17.0.2:55290
I0609 07:26:18.330569  4532 http.cpp:936] Authorizing principal 'test-principal' to GET the
'/monitor/statistics.json' endpoint
I0609 07:26:18.351191  4510 slave.cpp:817] Agent terminating
[       OK ] Endpoint/SlaveEndpointTest.NoAuthorizer/1 (112 ms)
[ RUN      ] Endpoint/SlaveEndpointTest.NoAuthorizer/2
I0609 07:26:18.402526  4510 containerizer.cpp:230] Using isolation: posix/cpu,posix/mem,filesystem/posix,network/cni,environment_secret
W0609 07:26:18.403736  4510 backend.cpp:76] Failed to create 'overlay' backend: OverlayBackend
requires root privileges
W0609 07:26:18.404358  4510 backend.cpp:76] Failed to create 'bind' backend: BindBackend requires
root privileges
I0609 07:26:18.404431  4510 provisioner.cpp:255] Using default backend 'copy'
I0609 07:26:18.407596  4510 cluster.cpp:448] Creating default 'local' authorizer
I0609 07:26:18.414173  4534 slave.cpp:248] Mesos agent started on (762)@172.17.0.2:36263
I0609 07:26:18.414218  4534 slave.cpp:249] Flags at startup: --acls="" --appc_simple_discovery_uri_prefix="http://"
--appc_store_dir="/tmp/Endpoint_SlaveEndpointTest_NoAuthorizer_2_AaIYJ6/store/appc" --authenticate_http_readonly="true"
--authenticate_http_readwrite="true" --authenticatee="crammd5" --authentication_backoff_factor="1secs"
--authorizer="local" --cgroups_cpu_enable_pids_and_tids_count="false" --cgroups_enable_cfs="false"
--cgroups_hierarchy="/sys/fs/cgroup" --cgroups_limit_swap="false" --cgroups_root="mesos" --container_disk_watch_interval="15secs"
--containerizers="mesos" --credential="/tmp/Endpoint_SlaveEndpointTest_NoAuthorizer_2_AaIYJ6/credential"
--default_role="*" --disk_watch_interval="1mins" --docker="docker" --docker_kill_orphans="true"
--docker_registry="https://registry-1.docker.io" --docker_remove_delay="6hrs" --docker_socket="/var/run/docker.sock"
--docker_stop_timeout="0ns" --docker_store_dir="/tmp/Endpoint_SlaveEndpointTest_NoAuthorizer_2_AaIYJ6/store/docker"
--docker_volume_checkpoint_dir="/var/run/mesos/isolators/docker/volume" --enforce_container_disk_quota="false"
--executor_registration_timeout="1mins" --executor_reregistration_timeout="2secs" --executor_shutdown_grace_period="5secs"
--fetcher_cache_dir="/tmp/Endpoint_SlaveEndpointTest_NoAuthorizer_2_AaIYJ6/fetch" --fetcher_cache_size="2GB"
--frameworks_home="" --gc_delay="1weeks" --gc_disk_headroom="0.1" --hadoop_home="" --help="false"
--hostname_lookup="true" --http_command_executor="false" --http_credentials="/tmp/Endpoint_SlaveEndpointTest_NoAuthorizer_2_AaIYJ6/http_credentials"
--http_heartbeat_interval="30secs" --initialize_driver_logging="true" --isolation="posix/cpu,posix/mem"
--launcher="posix" --launcher_dir="/mesos/mesos-1.4.0/_build/src" --logbufsecs="0" --logging_level="INFO"
--max_completed_executors_per_framework="150" --oversubscribed_resources_interval="15secs"
--perf_duration="10secs" --perf_interval="1mins" --port="5051" --qos_correction_interval_min="0ns"
--quiet="false" --recover="reconnect" --recovery_timeout="15mins" --registration_backoff_factor="10ms"
--resources="cpus:2;gpus:0;mem:1024;disk:1024;ports:[31000-32000]" --revocable_cpu_low_priority="true"
--runtime_dir="/tmp/Endpoint_SlaveEndpointTest_NoAuthorizer_2_AaIYJ6" --sandbox_directory="/mnt/mesos/sandbox"
--strict="true" --switch_user="true" --systemd_enable_support="true" --systemd_runtime_directory="/run/systemd/system"
--version="false" --work_dir="/tmp/Endpoint_SlaveEndpointTest_NoAuthorizer_2_MJdHu9"
I0609 07:26:18.415107  4534 credentials.hpp:86] Loading credential for authentication from
'/tmp/Endpoint_SlaveEndpointTest_NoAuthorizer_2_AaIYJ6/credential'
I0609 07:26:18.415441  4534 slave.cpp:281] Agent using credential for: test-principal
I0609 07:26:18.415509  4534 credentials.hpp:37] Loading credentials for authentication from
'/tmp/Endpoint_SlaveEndpointTest_NoAuthorizer_2_AaIYJ6/http_credentials'
I0609 07:26:18.415932  4534 http.cpp:975] Creating default 'basic' HTTP authenticator for
realm 'mesos-agent-readonly'
I0609 07:26:18.417227  4534 http.cpp:975] Creating default 'basic' HTTP authenticator for
realm 'mesos-agent-readwrite'
I0609 07:26:18.419579  4534 slave.cpp:552] Agent resources: cpus(*):2; mem(*):1024; disk(*):1024;
ports(*):[31000-32000]
I0609 07:26:18.419733  4534 slave.cpp:560] Agent attributes: [  ]
I0609 07:26:18.419880  4534 slave.cpp:565] Agent hostname: 165adef78ac1
I0609 07:26:18.422183  4534 status_update_manager.cpp:177] Pausing sending status updates
I0609 07:26:18.422613  4529 state.cpp:62] Recovering state from '/tmp/Endpoint_SlaveEndpointTest_NoAuthorizer_2_MJdHu9/meta'
I0609 07:26:18.423360  4529 status_update_manager.cpp:203] Recovering status update manager
I0609 07:26:18.424810  4530 containerizer.cpp:582] Recovering containerizer
I0609 07:26:18.428560  4529 provisioner.cpp:416] Provisioner recovery complete
I0609 07:26:18.429563  4529 slave.cpp:6127] Finished recovery
I0609 07:26:18.430830  4529 slave.cpp:6309] Querying resource estimator for oversubscribable
resources
I0609 07:26:18.431329  4529 slave.cpp:6323] Received oversubscribable resources {} from the
resource estimator
I0609 07:26:18.439610  4532 process.cpp:3778] Handling HTTP event for process 'slave(762)'
with path: '/slave(762)/containers'
I0609 07:26:18.442004  4533 http.cpp:1115] HTTP GET for /slave(762)/containers from 172.17.0.2:55294
I0609 07:26:18.442191  4533 http.cpp:936] Authorizing principal 'test-principal' to GET the
'/containers' endpoint
I0609 07:26:18.449641  4510 slave.cpp:817] Agent terminating
[       OK ] Endpoint/SlaveEndpointTest.NoAuthorizer/2 (72 ms)
[----------] 9 tests from Endpoint/SlaveEndpointTest (795 ms total)

[----------] Global test environment tear-down
[==========] 1589 tests from 176 test cases ran. (793766 ms total)
[  PASSED  ] 1585 tests.
[  FAILED  ] 4 tests, listed below:
[  FAILED  ] DefaultExecutorCheckTest.CommandCheckDeliveredAndReconciled
[  FAILED  ] DefaultExecutorCheckTest.CommandCheckStatusChange
[  FAILED  ] DefaultExecutorCheckTest.CommandCheckSeesParentsEnv
[  FAILED  ] DefaultExecutorCheckTest.CommandCheckSharesWorkDirWithTask

 4 FAILED TESTS
  YOU HAVE 22 DISABLED TESTS

E0609 07:26:18.610108  4537 process.cpp:968] Failed to accept socket: future discarded
make[4]: *** [check-local] Error 1
make[4]: Leaving directory `/mesos/mesos-1.4.0/_build/src'
make[3]: *** [check-am] Error 2
make[3]: Leaving directory `/mesos/mesos-1.4.0/_build/src'
make[2]: *** [check] Error 2
make[2]: Leaving directory `/mesos/mesos-1.4.0/_build/src'
make[1]: *** [check-recursive] Error 1
make[1]: Leaving directory `/mesos/mesos-1.4.0/_build'
make: *** [distcheck] Error 1
+ docker rmi mesos-1496986514-22606
Untagged: mesos-1496986514-22606:latest
Deleted: sha256:77f2b8268258ff1ae17c0a7a20fe63abe360df439bee0519b618ee7bc31e3cdb
Deleted: sha256:22b2d14c5219803b75a5c0bded65f3260905bdc4f599108c09772333ce7729ed
Deleted: sha256:48251e636c927f516643e64194518b2de44d7abf1e7b271fbf74ec8c2f33448f
Deleted: sha256:ed7769636568e0ca1626377f8b4a5ba1e86dcd469ec5003ca5dbf6f07d8d671e
Deleted: sha256:3c8ae3d0bff494b67b63e727726d75170da9d0e90a9ab9b726beb30c0557f484
Deleted: sha256:b930cc978939127b5566e1bf00fae80f0dbfa2f63773a8bf36d35ceeefeb37a2
Deleted: sha256:67bd391fcec0eaa14f7a2f69abf3a0201866cc484fd43f3880313735ad372ce3
Deleted: sha256:9165e1b62ac3515382aaaeaa51b8c4c538c59cd2da6151ab13d49fdcff6bd331
Deleted: sha256:45dbe9600fdebbd6b3a74e3f57ee930649799a10837bc0d7f6052780ccd4a05c
Deleted: sha256:b4324c1d53cf6904bc4c260f9a78c29673ca91bc69dae26246d5cd9dd2af5bed
Deleted: sha256:3c9d04e76a7dc5028979c73917aed3e536e396465ebbbcde3c691799407a7e1b
Deleted: sha256:fa1b3110536c4d6840e63012e078549298468ef66100279eba8af40734cfc17b
Deleted: sha256:7b7a1d883a4fa0c60b6279500be36ff2f6aca62223d02002417f245bb978ec21
Deleted: sha256:9200dfb457aea8cd7f0c99f5131b71c311e7147d18fa9715f6a9dbf904a3e30d
Deleted: sha256:1a400fb1141dd5a15d6043ac3991ff0e40201d20830060c9f8f544ad959f9b9d
Deleted: sha256:2ba49d591be8635aa122be860ce5cd2f5823454ec4f90da45f93047148e3f003
Deleted: sha256:2a8521d3c9d68a2158466a051c1e31f7514aabea157ccfecd896dd8b0211f7cd
Deleted: sha256:6648e46d578a4ce61f0dc6c0424528e7ee98fbed9956085b77e9365dc06dd633
Deleted: sha256:7845ed584b5fbba19e82fd1e26599d2dd86e6b84000ab09ac309f8154343f4ec
Deleted: sha256:b22868ee1a9789807a7e70a359e1207c610787731541559adc62263fa9e05a2f
Deleted: sha256:0a1a5244ee025577d94b3a84e5ec347b28f9561ff52c10643ddf15190aec19a2
Deleted: sha256:3d931e565af9103b3156ab727e554639389f673aed9e45f5f85c6f49b7eab1cc
Deleted: sha256:4684c8cccde98c84afb61d38edf2eb029fd51927937daa05a6e5fdf04bfaa45f
Deleted: sha256:641b8a9d2e58a7b24d0427e23e9d55b7fc5f9af755b0df58e9307c96cd466c0b
Build step 'Execute shell' marked build as failure

Mime
View raw message