mesos-builds mailing list archives

Site index · List index
Message view « Date » · « Thread »
Top « Date » · « Thread »
From Apache Jenkins Server <jenk...@builds.apache.org>
Subject Build failed in Jenkins: Mesos-Buildbot » autotools,gcc,--verbose --enable-libevent --enable-ssl,GLOG_v=1 MESOS_VERBOSE=1,centos:7,(ubuntu)&&(!ubuntu-us1)&&(!ubuntu-eu2) #3844
Date Tue, 27 Jun 2017 17:20:03 GMT
See <https://builds.apache.org/job/Mesos-Buildbot/BUILDTOOL=autotools,COMPILER=gcc,CONFIGURATION=--verbose%20--enable-libevent%20--enable-ssl,ENVIRONMENT=GLOG_v=1%20MESOS_VERBOSE=1,OS=centos%3A7,label_exp=(ubuntu)&&(!ubuntu-us1)&&(!ubuntu-eu2)/3844/display/redirect>

------------------------------------------
[...truncated 30.59 MB...]
[       OK ] Endpoint/SlaveEndpointTest.AuthorizedRequest/2 (34 ms)
[ RUN      ] Endpoint/SlaveEndpointTest.UnauthorizedRequest/0
I0627 17:19:53.857952  8813 containerizer.cpp:230] Using isolation: posix/cpu,posix/mem,filesystem/posix,network/cni,environment_secret
W0627 17:19:53.858465  8813 backend.cpp:76] Failed to create 'aufs' backend: AufsBackend requires
root privileges
W0627 17:19:53.858567  8813 backend.cpp:76] Failed to create 'bind' backend: BindBackend requires
root privileges
I0627 17:19:53.858598  8813 provisioner.cpp:255] Using default backend 'copy'
I0627 17:19:53.861752 29529 slave.cpp:249] Mesos agent started on (774)@172.17.0.3:46853
I0627 17:19:53.861773 29529 slave.cpp:250] Flags at startup: --acls="" --appc_simple_discovery_uri_prefix="http://"
--appc_store_dir="/tmp/Endpoint_SlaveEndpointTest_UnauthorizedRequest_0_vEjWtE/store/appc"
--authenticate_http_executors="true" --authenticate_http_readonly="true" --authenticate_http_readwrite="true"
--authenticatee="crammd5" --authentication_backoff_factor="1secs" --authorizer="local" --cgroups_cpu_enable_pids_and_tids_count="false"
--cgroups_enable_cfs="false" --cgroups_hierarchy="/sys/fs/cgroup" --cgroups_limit_swap="false"
--cgroups_root="mesos" --container_disk_watch_interval="15secs" --containerizers="mesos" --credential="/tmp/Endpoint_SlaveEndpointTest_UnauthorizedRequest_0_vEjWtE/credential"
--default_role="*" --disk_watch_interval="1mins" --docker="docker" --docker_kill_orphans="true"
--docker_registry="https://registry-1.docker.io" --docker_remove_delay="6hrs" --docker_socket="/var/run/docker.sock"
--docker_stop_timeout="0ns" --docker_store_dir="/tmp/Endpoint_SlaveEndpointTest_UnauthorizedRequest_0_vEjWtE/store/docker"
--docker_volume_checkpoint_dir="/var/run/mesos/isolators/docker/volume" --enforce_container_disk_quota="false"
--executor_registration_timeout="1mins" --executor_reregistration_timeout="2secs" --executor_secret_key="/tmp/Endpoint_SlaveEndpointTest_UnauthorizedRequest_0_vEjWtE/executor_secret_key"
--executor_shutdown_grace_period="5secs" --fetcher_cache_dir="/tmp/Endpoint_SlaveEndpointTest_UnauthorizedRequest_0_vEjWtE/fetch"
--fetcher_cache_size="2GB" --frameworks_home="" --gc_delay="1weeks" --gc_disk_headroom="0.1"
--hadoop_home="" --help="false" --hostname_lookup="true" --http_command_executor="false" --http_credentials="/tmp/Endpoint_SlaveEndpointTest_UnauthorizedRequest_0_vEjWtE/http_credentials"
--http_heartbeat_interval="30secs" --initialize_driver_logging="true" --isolation="posix/cpu,posix/mem"
--launcher="posix" --launcher_dir="/mesos/mesos-1.4.0/_build/src" --logbufsecs="0" --logging_level="INFO"
--max_completed_executors_per_framework="150" --oversubscribed_resources_interval="15secs"
--perf_duration="10secs" --perf_interval="1mins" --port="5051" --qos_correction_interval_min="0ns"
--quiet="false" --recover="reconnect" --recovery_timeout="15mins" --registration_backoff_factor="10ms"
--resources="cpus:2;gpus:0;mem:1024;disk:1024;ports:[31000-32000]" --revocable_cpu_low_priority="true"
--runtime_dir="/tmp/Endpoint_SlaveEndpointTest_UnauthorizedRequest_0_vEjWtE" --sandbox_directory="/mnt/mesos/sandbox"
--strict="true" --switch_user="true" --systemd_enable_support="true" --systemd_runtime_directory="/run/systemd/system"
--version="false" --work_dir="/tmp/Endpoint_SlaveEndpointTest_UnauthorizedRequest_0_QsMISq"
I0627 17:19:53.862202 29529 credentials.hpp:86] Loading credential for authentication from
'/tmp/Endpoint_SlaveEndpointTest_UnauthorizedRequest_0_vEjWtE/credential'
I0627 17:19:53.862365 29529 slave.cpp:282] Agent using credential for: test-principal
I0627 17:19:53.862385 29529 credentials.hpp:37] Loading credentials for authentication from
'/tmp/Endpoint_SlaveEndpointTest_UnauthorizedRequest_0_vEjWtE/http_credentials'
I0627 17:19:53.862665 29529 http.cpp:974] Creating default 'basic' HTTP authenticator for
realm 'mesos-agent-executor'
I0627 17:19:53.862768 29529 http.cpp:995] Creating default 'jwt' HTTP authenticator for realm
'mesos-agent-executor'
I0627 17:19:53.863044 29529 http.cpp:974] Creating default 'basic' HTTP authenticator for
realm 'mesos-agent-readonly'
I0627 17:19:53.863145 29529 http.cpp:995] Creating default 'jwt' HTTP authenticator for realm
'mesos-agent-readonly'
I0627 17:19:53.863608 29529 http.cpp:974] Creating default 'basic' HTTP authenticator for
realm 'mesos-agent-readwrite'
I0627 17:19:53.863708 29529 http.cpp:995] Creating default 'jwt' HTTP authenticator for realm
'mesos-agent-readwrite'
I0627 17:19:53.865182 29529 slave.cpp:553] Agent resources: [{"name":"cpus","scalar":{"value":2.0},"type":"SCALAR"},{"name":"mem","scalar":{"value":1024.0},"type":"SCALAR"},{"name":"disk","scalar":{"value":1024.0},"type":"SCALAR"},{"name":"ports","ranges":{"range":[{"begin":31000,"end":32000}]},"type":"RANGES"}]
I0627 17:19:53.865417 29529 slave.cpp:561] Agent attributes: [  ]
I0627 17:19:53.865432 29529 slave.cpp:566] Agent hostname: 085d01f316cb
I0627 17:19:53.865571 29530 status_update_manager.cpp:177] Pausing sending status updates
I0627 17:19:53.867105 29522 state.cpp:64] Recovering state from '/tmp/Endpoint_SlaveEndpointTest_UnauthorizedRequest_0_QsMISq/meta'
I0627 17:19:53.867578 29540 status_update_manager.cpp:203] Recovering status update manager
I0627 17:19:53.867880 29528 containerizer.cpp:582] Recovering containerizer
I0627 17:19:53.869448 29529 provisioner.cpp:416] Provisioner recovery complete
I0627 17:19:53.869923 29531 slave.cpp:6168] Finished recovery
I0627 17:19:53.870347 29531 slave.cpp:6350] Querying resource estimator for oversubscribable
resources
I0627 17:19:53.870625 29526 slave.cpp:6364] Received oversubscribable resources {} from the
resource estimator
I0627 17:19:53.872668 29538 process.cpp:3779] Handling HTTP event for process 'slave(774)'
with path: '/slave(774)/monitor/statistics'
I0627 17:19:53.874413 29523 http.cpp:1114] HTTP GET for /slave(774)/monitor/statistics from
172.17.0.3:33494
I0627 17:19:53.874492 29523 http.cpp:935] Authorizing principal 'test-principal' to GET the
'/monitor/statistics' endpoint
I0627 17:19:53.876940 29528 slave.cpp:818] Agent terminating
[       OK ] Endpoint/SlaveEndpointTest.UnauthorizedRequest/0 (30 ms)
[ RUN      ] Endpoint/SlaveEndpointTest.UnauthorizedRequest/1
I0627 17:19:53.889935  8813 containerizer.cpp:230] Using isolation: posix/cpu,posix/mem,filesystem/posix,network/cni,environment_secret
W0627 17:19:53.890480  8813 backend.cpp:76] Failed to create 'aufs' backend: AufsBackend requires
root privileges
W0627 17:19:53.890592  8813 backend.cpp:76] Failed to create 'bind' backend: BindBackend requires
root privileges
I0627 17:19:53.890638  8813 provisioner.cpp:255] Using default backend 'copy'
I0627 17:19:53.894059 29519 slave.cpp:249] Mesos agent started on (775)@172.17.0.3:46853
I0627 17:19:53.894079 29519 slave.cpp:250] Flags at startup: --acls="" --appc_simple_discovery_uri_prefix="http://"
--appc_store_dir="/tmp/Endpoint_SlaveEndpointTest_UnauthorizedRequest_1_D0HN8w/store/appc"
--authenticate_http_executors="true" --authenticate_http_readonly="true" --authenticate_http_readwrite="true"
--authenticatee="crammd5" --authentication_backoff_factor="1secs" --authorizer="local" --cgroups_cpu_enable_pids_and_tids_count="false"
--cgroups_enable_cfs="false" --cgroups_hierarchy="/sys/fs/cgroup" --cgroups_limit_swap="false"
--cgroups_root="mesos" --container_disk_watch_interval="15secs" --containerizers="mesos" --credential="/tmp/Endpoint_SlaveEndpointTest_UnauthorizedRequest_1_D0HN8w/credential"
--default_role="*" --disk_watch_interval="1mins" --docker="docker" --docker_kill_orphans="true"
--docker_registry="https://registry-1.docker.io" --docker_remove_delay="6hrs" --docker_socket="/var/run/docker.sock"
--docker_stop_timeout="0ns" --docker_store_dir="/tmp/Endpoint_SlaveEndpointTest_UnauthorizedRequest_1_D0HN8w/store/docker"
--docker_volume_checkpoint_dir="/var/run/mesos/isolators/docker/volume" --enforce_container_disk_quota="false"
--executor_registration_timeout="1mins" --executor_reregistration_timeout="2secs" --executor_secret_key="/tmp/Endpoint_SlaveEndpointTest_UnauthorizedRequest_1_D0HN8w/executor_secret_key"
--executor_shutdown_grace_period="5secs" --fetcher_cache_dir="/tmp/Endpoint_SlaveEndpointTest_UnauthorizedRequest_1_D0HN8w/fetch"
--fetcher_cache_size="2GB" --frameworks_home="" --gc_delay="1weeks" --gc_disk_headroom="0.1"
--hadoop_home="" --help="false" --hostname_lookup="true" --http_command_executor="false" --http_credentials="/tmp/Endpoint_SlaveEndpointTest_UnauthorizedRequest_1_D0HN8w/http_credentials"
--http_heartbeat_interval="30secs" --initialize_driver_logging="true" --isolation="posix/cpu,posix/mem"
--launcher="posix" --launcher_dir="/mesos/mesos-1.4.0/_build/src" --logbufsecs="0" --logging_level="INFO"
--max_completed_executors_per_framework="150" --oversubscribed_resources_interval="15secs"
--perf_duration="10secs" --perf_interval="1mins" --port="5051" --qos_correction_interval_min="0ns"
--quiet="false" --recover="reconnect" --recovery_timeout="15mins" --registration_backoff_factor="10ms"
--resources="cpus:2;gpus:0;mem:1024;disk:1024;ports:[31000-32000]" --revocable_cpu_low_priority="true"
--runtime_dir="/tmp/Endpoint_SlaveEndpointTest_UnauthorizedRequest_1_D0HN8w" --sandbox_directory="/mnt/mesos/sandbox"
--strict="true" --switch_user="true" --systemd_enable_support="true" --systemd_runtime_directory="/run/systemd/system"
--version="false" --work_dir="/tmp/Endpoint_SlaveEndpointTest_UnauthorizedRequest_1_S33Rsj"
I0627 17:19:53.894462 29519 credentials.hpp:86] Loading credential for authentication from
'/tmp/Endpoint_SlaveEndpointTest_UnauthorizedRequest_1_D0HN8w/credential'
I0627 17:19:53.894616 29519 slave.cpp:282] Agent using credential for: test-principal
I0627 17:19:53.894639 29519 credentials.hpp:37] Loading credentials for authentication from
'/tmp/Endpoint_SlaveEndpointTest_UnauthorizedRequest_1_D0HN8w/http_credentials'
I0627 17:19:53.894915 29519 http.cpp:974] Creating default 'basic' HTTP authenticator for
realm 'mesos-agent-executor'
I0627 17:19:53.895020 29519 http.cpp:995] Creating default 'jwt' HTTP authenticator for realm
'mesos-agent-executor'
I0627 17:19:53.895262 29519 http.cpp:974] Creating default 'basic' HTTP authenticator for
realm 'mesos-agent-readonly'
I0627 17:19:53.895359 29519 http.cpp:995] Creating default 'jwt' HTTP authenticator for realm
'mesos-agent-readonly'
I0627 17:19:53.895522 29519 http.cpp:974] Creating default 'basic' HTTP authenticator for
realm 'mesos-agent-readwrite'
I0627 17:19:53.895614 29519 http.cpp:995] Creating default 'jwt' HTTP authenticator for realm
'mesos-agent-readwrite'
I0627 17:19:53.897045 29519 slave.cpp:553] Agent resources: [{"name":"cpus","scalar":{"value":2.0},"type":"SCALAR"},{"name":"mem","scalar":{"value":1024.0},"type":"SCALAR"},{"name":"disk","scalar":{"value":1024.0},"type":"SCALAR"},{"name":"ports","ranges":{"range":[{"begin":31000,"end":32000}]},"type":"RANGES"}]
I0627 17:19:53.897284 29519 slave.cpp:561] Agent attributes: [  ]
I0627 17:19:53.897300 29519 slave.cpp:566] Agent hostname: 085d01f316cb
I0627 17:19:53.897423 29521 status_update_manager.cpp:177] Pausing sending status updates
I0627 17:19:53.898864 29532 state.cpp:64] Recovering state from '/tmp/Endpoint_SlaveEndpointTest_UnauthorizedRequest_1_S33Rsj/meta'
I0627 17:19:53.899335 29533 status_update_manager.cpp:203] Recovering status update manager
I0627 17:19:53.899528 29520 containerizer.cpp:582] Recovering containerizer
I0627 17:19:53.901091 29518 provisioner.cpp:416] Provisioner recovery complete
I0627 17:19:53.901456 29536 slave.cpp:6168] Finished recovery
I0627 17:19:53.901981 29536 slave.cpp:6350] Querying resource estimator for oversubscribable
resources
I0627 17:19:53.902243 29533 slave.cpp:6364] Received oversubscribable resources {} from the
resource estimator
I0627 17:19:53.904403 29538 process.cpp:3779] Handling HTTP event for process 'slave(775)'
with path: '/slave(775)/monitor/statistics.json'
I0627 17:19:53.906272 29521 http.cpp:1114] HTTP GET for /slave(775)/monitor/statistics.json
from 172.17.0.3:33496
I0627 17:19:53.906342 29521 http.cpp:935] Authorizing principal 'test-principal' to GET the
'/monitor/statistics.json' endpoint
I0627 17:19:53.908927 29520 slave.cpp:818] Agent terminating
[       OK ] Endpoint/SlaveEndpointTest.UnauthorizedRequest/1 (30 ms)
[ RUN      ] Endpoint/SlaveEndpointTest.UnauthorizedRequest/2
I0627 17:19:53.920464  8813 containerizer.cpp:230] Using isolation: posix/cpu,posix/mem,filesystem/posix,network/cni,environment_secret
W0627 17:19:53.921147  8813 backend.cpp:76] Failed to create 'aufs' backend: AufsBackend requires
root privileges
W0627 17:19:53.921253  8813 backend.cpp:76] Failed to create 'bind' backend: BindBackend requires
root privileges
I0627 17:19:53.921288  8813 provisioner.cpp:255] Using default backend 'copy'
I0627 17:19:53.925388 29533 slave.cpp:249] Mesos agent started on (776)@172.17.0.3:46853
I0627 17:19:53.925413 29533 slave.cpp:250] Flags at startup: --acls="" --appc_simple_discovery_uri_prefix="http://"
--appc_store_dir="/tmp/Endpoint_SlaveEndpointTest_UnauthorizedRequest_2_5Lw55p/store/appc"
--authenticate_http_executors="true" --authenticate_http_readonly="true" --authenticate_http_readwrite="true"
--authenticatee="crammd5" --authentication_backoff_factor="1secs" --authorizer="local" --cgroups_cpu_enable_pids_and_tids_count="false"
--cgroups_enable_cfs="false" --cgroups_hierarchy="/sys/fs/cgroup" --cgroups_limit_swap="false"
--cgroups_root="mesos" --container_disk_watch_interval="15secs" --containerizers="mesos" --credential="/tmp/Endpoint_SlaveEndpointTest_UnauthorizedRequest_2_5Lw55p/credential"
--default_role="*" --disk_watch_interval="1mins" --docker="docker" --docker_kill_orphans="true"
--docker_registry="https://registry-1.docker.io" --docker_remove_delay="6hrs" --docker_socket="/var/run/docker.sock"
--docker_stop_timeout="0ns" --docker_store_dir="/tmp/Endpoint_SlaveEndpointTest_UnauthorizedRequest_2_5Lw55p/store/docker"
--docker_volume_checkpoint_dir="/var/run/mesos/isolators/docker/volume" --enforce_container_disk_quota="false"
--executor_registration_timeout="1mins" --executor_reregistration_timeout="2secs" --executor_secret_key="/tmp/Endpoint_SlaveEndpointTest_UnauthorizedRequest_2_5Lw55p/executor_secret_key"
--executor_shutdown_grace_period="5secs" --fetcher_cache_dir="/tmp/Endpoint_SlaveEndpointTest_UnauthorizedRequest_2_5Lw55p/fetch"
--fetcher_cache_size="2GB" --frameworks_home="" --gc_delay="1weeks" --gc_disk_headroom="0.1"
--hadoop_home="" --help="false" --hostname_lookup="true" --http_command_executor="false" --http_credentials="/tmp/Endpoint_SlaveEndpointTest_UnauthorizedRequest_2_5Lw55p/http_credentials"
--http_heartbeat_interval="30secs" --initialize_driver_logging="true" --isolation="posix/cpu,posix/mem"
--launcher="posix" --launcher_dir="/mesos/mesos-1.4.0/_build/src" --logbufsecs="0" --logging_level="INFO"
--max_completed_executors_per_framework="150" --oversubscribed_resources_interval="15secs"
--perf_duration="10secs" --perf_interval="1mins" --port="5051" --qos_correction_interval_min="0ns"
--quiet="false" --recover="reconnect" --recovery_timeout="15mins" --registration_backoff_factor="10ms"
--resources="cpus:2;gpus:0;mem:1024;disk:1024;ports:[31000-32000]" --revocable_cpu_low_priority="true"
--runtime_dir="/tmp/Endpoint_SlaveEndpointTest_UnauthorizedRequest_2_5Lw55p" --sandbox_directory="/mnt/mesos/sandbox"
--strict="true" --switch_user="true" --systemd_enable_support="true" --systemd_runtime_directory="/run/systemd/system"
--version="false" --work_dir="/tmp/Endpoint_SlaveEndpointTest_UnauthorizedRequest_2_MU2Alc"
I0627 17:19:53.925899 29533 credentials.hpp:86] Loading credential for authentication from
'/tmp/Endpoint_SlaveEndpointTest_UnauthorizedRequest_2_5Lw55p/credential'
I0627 17:19:53.926126 29533 slave.cpp:282] Agent using credential for: test-principal
I0627 17:19:53.926149 29533 credentials.hpp:37] Loading credentials for authentication from
'/tmp/Endpoint_SlaveEndpointTest_UnauthorizedRequest_2_5Lw55p/http_credentials'
I0627 17:19:53.926486 29533 http.cpp:974] Creating default 'basic' HTTP authenticator for
realm 'mesos-agent-executor'
I0627 17:19:53.926610 29533 http.cpp:995] Creating default 'jwt' HTTP authenticator for realm
'mesos-agent-executor'
I0627 17:19:53.927050 29533 http.cpp:974] Creating default 'basic' HTTP authenticator for
realm 'mesos-agent-readonly'
I0627 17:19:53.927163 29533 http.cpp:995] Creating default 'jwt' HTTP authenticator for realm
'mesos-agent-readonly'
I0627 17:19:53.927381 29533 http.cpp:974] Creating default 'basic' HTTP authenticator for
realm 'mesos-agent-readwrite'
I0627 17:19:53.927484 29533 http.cpp:995] Creating default 'jwt' HTTP authenticator for realm
'mesos-agent-readwrite'
I0627 17:19:53.929319 29533 slave.cpp:553] Agent resources: [{"name":"cpus","scalar":{"value":2.0},"type":"SCALAR"},{"name":"mem","scalar":{"value":1024.0},"type":"SCALAR"},{"name":"disk","scalar":{"value":1024.0},"type":"SCALAR"},{"name":"ports","ranges":{"range":[{"begin":31000,"end":32000}]},"type":"RANGES"}]
I0627 17:19:53.929731 29533 slave.cpp:561] Agent attributes: [  ]
I0627 17:19:53.929759 29533 slave.cpp:566] Agent hostname: 085d01f316cb
I0627 17:19:53.929918 29526 status_update_manager.cpp:177] Pausing sending status updates
I0627 17:19:53.931519 29530 state.cpp:64] Recovering state from '/tmp/Endpoint_SlaveEndpointTest_UnauthorizedRequest_2_MU2Alc/meta'
I0627 17:19:53.931838 29522 status_update_manager.cpp:203] Recovering status update manager
I0627 17:19:53.932152 29523 containerizer.cpp:582] Recovering containerizer
I0627 17:19:53.933881 29537 provisioner.cpp:416] Provisioner recovery complete
I0627 17:19:53.934521 29535 slave.cpp:6168] Finished recovery
I0627 17:19:53.935011 29535 slave.cpp:6350] Querying resource estimator for oversubscribable
resources
I0627 17:19:53.935472 29521 slave.cpp:6364] Received oversubscribable resources {} from the
resource estimator
I0627 17:19:53.937427 29530 process.cpp:3779] Handling HTTP event for process 'slave(776)'
with path: '/slave(776)/containers'
I0627 17:19:53.939294 29532 http.cpp:1114] HTTP GET for /slave(776)/containers from 172.17.0.3:33498
I0627 17:19:53.939368 29532 http.cpp:935] Authorizing principal 'test-principal' to GET the
'/containers' endpoint
I0627 17:19:53.941817 29541 slave.cpp:818] Agent terminating
[       OK ] Endpoint/SlaveEndpointTest.UnauthorizedRequest/2 (33 ms)
[ RUN      ] Endpoint/SlaveEndpointTest.NoAuthorizer/0
I0627 17:19:53.954762  8813 containerizer.cpp:230] Using isolation: posix/cpu,posix/mem,filesystem/posix,network/cni,environment_secret
W0627 17:19:53.955292  8813 backend.cpp:76] Failed to create 'aufs' backend: AufsBackend requires
root privileges
W0627 17:19:53.955399  8813 backend.cpp:76] Failed to create 'bind' backend: BindBackend requires
root privileges
I0627 17:19:53.955432  8813 provisioner.cpp:255] Using default backend 'copy'
I0627 17:19:53.957352  8813 cluster.cpp:448] Creating default 'local' authorizer
I0627 17:19:53.959188 29537 slave.cpp:249] Mesos agent started on (777)@172.17.0.3:46853
I0627 17:19:53.959220 29537 slave.cpp:250] Flags at startup: --acls="" --appc_simple_discovery_uri_prefix="http://"
--appc_store_dir="/tmp/Endpoint_SlaveEndpointTest_NoAuthorizer_0_Xvfvnj/store/appc" --authenticate_http_executors="true"
--authenticate_http_readonly="true" --authenticate_http_readwrite="true" --authenticatee="crammd5"
--authentication_backoff_factor="1secs" --authorizer="local" --cgroups_cpu_enable_pids_and_tids_count="false"
--cgroups_enable_cfs="false" --cgroups_hierarchy="/sys/fs/cgroup" --cgroups_limit_swap="false"
--cgroups_root="mesos" --container_disk_watch_interval="15secs" --containerizers="mesos" --credential="/tmp/Endpoint_SlaveEndpointTest_NoAuthorizer_0_Xvfvnj/credential"
--default_role="*" --disk_watch_interval="1mins" --docker="docker" --docker_kill_orphans="true"
--docker_registry="https://registry-1.docker.io" --docker_remove_delay="6hrs" --docker_socket="/var/run/docker.sock"
--docker_stop_timeout="0ns" --docker_store_dir="/tmp/Endpoint_SlaveEndpointTest_NoAuthorizer_0_Xvfvnj/store/docker"
--docker_volume_checkpoint_dir="/var/run/mesos/isolators/docker/volume" --enforce_container_disk_quota="false"
--executor_registration_timeout="1mins" --executor_reregistration_timeout="2secs" --executor_secret_key="/tmp/Endpoint_SlaveEndpointTest_NoAuthorizer_0_Xvfvnj/executor_secret_key"
--executor_shutdown_grace_period="5secs" --fetcher_cache_dir="/tmp/Endpoint_SlaveEndpointTest_NoAuthorizer_0_Xvfvnj/fetch"
--fetcher_cache_size="2GB" --frameworks_home="" --gc_delay="1weeks" --gc_disk_headroom="0.1"
--hadoop_home="" --help="false" --hostname_lookup="true" --http_command_executor="false" --http_credentials="/tmp/Endpoint_SlaveEndpointTest_NoAuthorizer_0_Xvfvnj/http_credentials"
--http_heartbeat_interval="30secs" --initialize_driver_logging="true" --isolation="posix/cpu,posix/mem"
--launcher="posix" --launcher_dir="/mesos/mesos-1.4.0/_build/src" --logbufsecs="0" --logging_level="INFO"
--max_completed_executors_per_framework="150" --oversubscribed_resources_interval="15secs"
--perf_duration="10secs" --perf_interval="1mins" --port="5051" --qos_correction_interval_min="0ns"
--quiet="false" --recover="reconnect" --recovery_timeout="15mins" --registration_backoff_factor="10ms"
--resources="cpus:2;gpus:0;mem:1024;disk:1024;ports:[31000-32000]" --revocable_cpu_low_priority="true"
--runtime_dir="/tmp/Endpoint_SlaveEndpointTest_NoAuthorizer_0_Xvfvnj" --sandbox_directory="/mnt/mesos/sandbox"
--strict="true" --switch_user="true" --systemd_enable_support="true" --systemd_runtime_directory="/run/systemd/system"
--version="false" --work_dir="/tmp/Endpoint_SlaveEndpointTest_NoAuthorizer_0_0aCWx5"
I0627 17:19:53.959693 29537 credentials.hpp:86] Loading credential for authentication from
'/tmp/Endpoint_SlaveEndpointTest_NoAuthorizer_0_Xvfvnj/credential'
I0627 17:19:53.959888 29537 slave.cpp:282] Agent using credential for: test-principal
I0627 17:19:53.959910 29537 credentials.hpp:37] Loading credentials for authentication from
'/tmp/Endpoint_SlaveEndpointTest_NoAuthorizer_0_Xvfvnj/http_credentials'
I0627 17:19:53.960196 29537 http.cpp:974] Creating default 'basic' HTTP authenticator for
realm 'mesos-agent-executor'
I0627 17:19:53.960320 29537 http.cpp:995] Creating default 'jwt' HTTP authenticator for realm
'mesos-agent-executor'
I0627 17:19:53.960532 29537 http.cpp:974] Creating default 'basic' HTTP authenticator for
realm 'mesos-agent-readonly'
I0627 17:19:53.960752 29537 http.cpp:995] Creating default 'jwt' HTTP authenticator for realm
'mesos-agent-readonly'
I0627 17:19:53.961042 29537 http.cpp:974] Creating default 'basic' HTTP authenticator for
realm 'mesos-agent-readwrite'
I0627 17:19:53.961148 29537 http.cpp:995] Creating default 'jwt' HTTP authenticator for realm
'mesos-agent-readwrite'
I0627 17:19:53.962937 29537 slave.cpp:553] Agent resources: [{"name":"cpus","scalar":{"value":2.0},"type":"SCALAR"},{"name":"mem","scalar":{"value":1024.0},"type":"SCALAR"},{"name":"disk","scalar":{"value":1024.0},"type":"SCALAR"},{"name":"ports","ranges":{"range":[{"begin":31000,"end":32000}]},"type":"RANGES"}]
I0627 17:19:53.963176 29537 slave.cpp:561] Agent attributes: [  ]
I0627 17:19:53.963196 29537 slave.cpp:566] Agent hostname: 085d01f316cb
I0627 17:19:53.963366 29524 status_update_manager.cpp:177] Pausing sending status updates
I0627 17:19:53.964933 29527 state.cpp:64] Recovering state from '/tmp/Endpoint_SlaveEndpointTest_NoAuthorizer_0_0aCWx5/meta'
I0627 17:19:53.965346 29527 status_update_manager.cpp:203] Recovering status update manager
I0627 17:19:53.965611 29539 containerizer.cpp:582] Recovering containerizer
I0627 17:19:53.967407 29522 provisioner.cpp:416] Provisioner recovery complete
I0627 17:19:53.967797 29531 slave.cpp:6168] Finished recovery
I0627 17:19:53.968204 29531 slave.cpp:6350] Querying resource estimator for oversubscribable
resources
I0627 17:19:53.968493 29526 slave.cpp:6364] Received oversubscribable resources {} from the
resource estimator
I0627 17:19:53.970572 29524 process.cpp:3779] Handling HTTP event for process 'slave(777)'
with path: '/slave(777)/monitor/statistics'
I0627 17:19:53.972704 29533 http.cpp:1114] HTTP GET for /slave(777)/monitor/statistics from
172.17.0.3:33500
I0627 17:19:53.972805 29533 http.cpp:935] Authorizing principal 'test-principal' to GET the
'/monitor/statistics' endpoint
I0627 17:19:53.977809 29540 slave.cpp:818] Agent terminating
[       OK ] Endpoint/SlaveEndpointTest.NoAuthorizer/0 (35 ms)
[ RUN      ] Endpoint/SlaveEndpointTest.NoAuthorizer/1
I0627 17:19:53.990206  8813 containerizer.cpp:230] Using isolation: posix/cpu,posix/mem,filesystem/posix,network/cni,environment_secret
W0627 17:19:53.990772  8813 backend.cpp:76] Failed to create 'aufs' backend: AufsBackend requires
root privileges
W0627 17:19:53.990898  8813 backend.cpp:76] Failed to create 'bind' backend: BindBackend requires
root privileges
I0627 17:19:53.990942  8813 provisioner.cpp:255] Using default backend 'copy'
I0627 17:19:53.993311  8813 cluster.cpp:448] Creating default 'local' authorizer
I0627 17:19:53.995081 29518 slave.cpp:249] Mesos agent started on (778)@172.17.0.3:46853
I0627 17:19:53.995103 29518 slave.cpp:250] Flags at startup: --acls="" --appc_simple_discovery_uri_prefix="http://"
--appc_store_dir="/tmp/Endpoint_SlaveEndpointTest_NoAuthorizer_1_ZRcIZc/store/appc" --authenticate_http_executors="true"
--authenticate_http_readonly="true" --authenticate_http_readwrite="true" --authenticatee="crammd5"
--authentication_backoff_factor="1secs" --authorizer="local" --cgroups_cpu_enable_pids_and_tids_count="false"
--cgroups_enable_cfs="false" --cgroups_hierarchy="/sys/fs/cgroup" --cgroups_limit_swap="false"
--cgroups_root="mesos" --container_disk_watch_interval="15secs" --containerizers="mesos" --credential="/tmp/Endpoint_SlaveEndpointTest_NoAuthorizer_1_ZRcIZc/credential"
--default_role="*" --disk_watch_interval="1mins" --docker="docker" --docker_kill_orphans="true"
--docker_registry="https://registry-1.docker.io" --docker_remove_delay="6hrs" --docker_socket="/var/run/docker.sock"
--docker_stop_timeout="0ns" --docker_store_dir="/tmp/Endpoint_SlaveEndpointTest_NoAuthorizer_1_ZRcIZc/store/docker"
--docker_volume_checkpoint_dir="/var/run/mesos/isolators/docker/volume" --enforce_container_disk_quota="false"
--executor_registration_timeout="1mins" --executor_reregistration_timeout="2secs" --executor_secret_key="/tmp/Endpoint_SlaveEndpointTest_NoAuthorizer_1_ZRcIZc/executor_secret_key"
--executor_shutdown_grace_period="5secs" --fetcher_cache_dir="/tmp/Endpoint_SlaveEndpointTest_NoAuthorizer_1_ZRcIZc/fetch"
--fetcher_cache_size="2GB" --frameworks_home="" --gc_delay="1weeks" --gc_disk_headroom="0.1"
--hadoop_home="" --help="false" --hostname_lookup="true" --http_command_executor="false" --http_credentials="/tmp/Endpoint_SlaveEndpointTest_NoAuthorizer_1_ZRcIZc/http_credentials"
--http_heartbeat_interval="30secs" --initialize_driver_logging="true" --isolation="posix/cpu,posix/mem"
--launcher="posix" --launcher_dir="/mesos/mesos-1.4.0/_build/src" --logbufsecs="0" --logging_level="INFO"
--max_completed_executors_per_framework="150" --oversubscribed_resources_interval="15secs"
--perf_duration="10secs" --perf_interval="1mins" --port="5051" --qos_correction_interval_min="0ns"
--quiet="false" --recover="reconnect" --recovery_timeout="15mins" --registration_backoff_factor="10ms"
--resources="cpus:2;gpus:0;mem:1024;disk:1024;ports:[31000-32000]" --revocable_cpu_low_priority="true"
--runtime_dir="/tmp/Endpoint_SlaveEndpointTest_NoAuthorizer_1_ZRcIZc" --sandbox_directory="/mnt/mesos/sandbox"
--strict="true" --switch_user="true" --systemd_enable_support="true" --systemd_runtime_directory="/run/systemd/system"
--version="false" --work_dir="/tmp/Endpoint_SlaveEndpointTest_NoAuthorizer_1_qkCR4Y"
I0627 17:19:53.995553 29518 credentials.hpp:86] Loading credential for authentication from
'/tmp/Endpoint_SlaveEndpointTest_NoAuthorizer_1_ZRcIZc/credential'
I0627 17:19:53.995767 29518 slave.cpp:282] Agent using credential for: test-principal
I0627 17:19:53.995789 29518 credentials.hpp:37] Loading credentials for authentication from
'/tmp/Endpoint_SlaveEndpointTest_NoAuthorizer_1_ZRcIZc/http_credentials'
I0627 17:19:53.996069 29518 http.cpp:974] Creating default 'basic' HTTP authenticator for
realm 'mesos-agent-executor'
I0627 17:19:53.996177 29518 http.cpp:995] Creating default 'jwt' HTTP authenticator for realm
'mesos-agent-executor'
I0627 17:19:53.996500 29518 http.cpp:974] Creating default 'basic' HTTP authenticator for
realm 'mesos-agent-readonly'
I0627 17:19:53.996628 29518 http.cpp:995] Creating default 'jwt' HTTP authenticator for realm
'mesos-agent-readonly'
I0627 17:19:53.996865 29518 http.cpp:974] Creating default 'basic' HTTP authenticator for
realm 'mesos-agent-readwrite'
I0627 17:19:53.997094 29518 http.cpp:995] Creating default 'jwt' HTTP authenticator for realm
'mesos-agent-readwrite'
I0627 17:19:53.998791 29518 slave.cpp:553] Agent resources: [{"name":"cpus","scalar":{"value":2.0},"type":"SCALAR"},{"name":"mem","scalar":{"value":1024.0},"type":"SCALAR"},{"name":"disk","scalar":{"value":1024.0},"type":"SCALAR"},{"name":"ports","ranges":{"range":[{"begin":31000,"end":32000}]},"type":"RANGES"}]
I0627 17:19:53.999037 29518 slave.cpp:561] Agent attributes: [  ]
I0627 17:19:53.999053 29518 slave.cpp:566] Agent hostname: 085d01f316cb
I0627 17:19:53.999222 29530 status_update_manager.cpp:177] Pausing sending status updates
I0627 17:19:54.001054 29532 state.cpp:64] Recovering state from '/tmp/Endpoint_SlaveEndpointTest_NoAuthorizer_1_qkCR4Y/meta'
I0627 17:19:54.001579 29534 status_update_manager.cpp:203] Recovering status update manager
I0627 17:19:54.001796 29526 containerizer.cpp:582] Recovering containerizer
I0627 17:19:54.003501 29528 provisioner.cpp:416] Provisioner recovery complete
I0627 17:19:54.003998 29521 slave.cpp:6168] Finished recovery
I0627 17:19:54.004554 29521 slave.cpp:6350] Querying resource estimator for oversubscribable
resources
I0627 17:19:54.004912 29530 slave.cpp:6364] Received oversubscribable resources {} from the
resource estimator
I0627 17:19:54.007160 29521 process.cpp:3779] Handling HTTP event for process 'slave(778)'
with path: '/slave(778)/monitor/statistics.json'
I0627 17:19:54.009238 29539 http.cpp:1114] HTTP GET for /slave(778)/monitor/statistics.json
from 172.17.0.3:33502
I0627 17:19:54.009332 29539 http.cpp:935] Authorizing principal 'test-principal' to GET the
'/monitor/statistics.json' endpoint
I0627 17:19:54.013289 29538 slave.cpp:818] Agent terminating
[       OK ] Endpoint/SlaveEndpointTest.NoAuthorizer/1 (36 ms)
[ RUN      ] Endpoint/SlaveEndpointTest.NoAuthorizer/2
I0627 17:19:54.028549  8813 containerizer.cpp:230] Using isolation: posix/cpu,posix/mem,filesystem/posix,network/cni,environment_secret
W0627 17:19:54.029093  8813 backend.cpp:76] Failed to create 'aufs' backend: AufsBackend requires
root privileges
W0627 17:19:54.029196  8813 backend.cpp:76] Failed to create 'bind' backend: BindBackend requires
root privileges
I0627 17:19:54.029238  8813 provisioner.cpp:255] Using default backend 'copy'
I0627 17:19:54.030988  8813 cluster.cpp:448] Creating default 'local' authorizer
I0627 17:19:54.032871 29537 slave.cpp:249] Mesos agent started on (779)@172.17.0.3:46853
I0627 17:19:54.032896 29537 slave.cpp:250] Flags at startup: --acls="" --appc_simple_discovery_uri_prefix="http://"
--appc_store_dir="/tmp/Endpoint_SlaveEndpointTest_NoAuthorizer_2_zqYpR5/store/appc" --authenticate_http_executors="true"
--authenticate_http_readonly="true" --authenticate_http_readwrite="true" --authenticatee="crammd5"
--authentication_backoff_factor="1secs" --authorizer="local" --cgroups_cpu_enable_pids_and_tids_count="false"
--cgroups_enable_cfs="false" --cgroups_hierarchy="/sys/fs/cgroup" --cgroups_limit_swap="false"
--cgroups_root="mesos" --container_disk_watch_interval="15secs" --containerizers="mesos" --credential="/tmp/Endpoint_SlaveEndpointTest_NoAuthorizer_2_zqYpR5/credential"
--default_role="*" --disk_watch_interval="1mins" --docker="docker" --docker_kill_orphans="true"
--docker_registry="https://registry-1.docker.io" --docker_remove_delay="6hrs" --docker_socket="/var/run/docker.sock"
--docker_stop_timeout="0ns" --docker_store_dir="/tmp/Endpoint_SlaveEndpointTest_NoAuthorizer_2_zqYpR5/store/docker"
--docker_volume_checkpoint_dir="/var/run/mesos/isolators/docker/volume" --enforce_container_disk_quota="false"
--executor_registration_timeout="1mins" --executor_reregistration_timeout="2secs" --executor_secret_key="/tmp/Endpoint_SlaveEndpointTest_NoAuthorizer_2_zqYpR5/executor_secret_key"
--executor_shutdown_grace_period="5secs" --fetcher_cache_dir="/tmp/Endpoint_SlaveEndpointTest_NoAuthorizer_2_zqYpR5/fetch"
--fetcher_cache_size="2GB" --frameworks_home="" --gc_delay="1weeks" --gc_disk_headroom="0.1"
--hadoop_home="" --help="false" --hostname_lookup="true" --http_command_executor="false" --http_credentials="/tmp/Endpoint_SlaveEndpointTest_NoAuthorizer_2_zqYpR5/http_credentials"
--http_heartbeat_interval="30secs" --initialize_driver_logging="true" --isolation="posix/cpu,posix/mem"
--launcher="posix" --launcher_dir="/mesos/mesos-1.4.0/_build/src" --logbufsecs="0" --logging_level="INFO"
--max_completed_executors_per_framework="150" --oversubscribed_resources_interval="15secs"
--perf_duration="10secs" --perf_interval="1mins" --port="5051" --qos_correction_interval_min="0ns"
--quiet="false" --recover="reconnect" --recovery_timeout="15mins" --registration_backoff_factor="10ms"
--resources="cpus:2;gpus:0;mem:1024;disk:1024;ports:[31000-32000]" --revocable_cpu_low_priority="true"
--runtime_dir="/tmp/Endpoint_SlaveEndpointTest_NoAuthorizer_2_zqYpR5" --sandbox_directory="/mnt/mesos/sandbox"
--strict="true" --switch_user="true" --systemd_enable_support="true" --systemd_runtime_directory="/run/systemd/system"
--version="false" --work_dir="/tmp/Endpoint_SlaveEndpointTest_NoAuthorizer_2_RzygXS"
I0627 17:19:54.033303 29537 credentials.hpp:86] Loading credential for authentication from
'/tmp/Endpoint_SlaveEndpointTest_NoAuthorizer_2_zqYpR5/credential'
I0627 17:19:54.033468 29537 slave.cpp:282] Agent using credential for: test-principal
I0627 17:19:54.033490 29537 credentials.hpp:37] Loading credentials for authentication from
'/tmp/Endpoint_SlaveEndpointTest_NoAuthorizer_2_zqYpR5/http_credentials'
I0627 17:19:54.033952 29537 http.cpp:974] Creating default 'basic' HTTP authenticator for
realm 'mesos-agent-executor'
I0627 17:19:54.034132 29537 http.cpp:995] Creating default 'jwt' HTTP authenticator for realm
'mesos-agent-executor'
I0627 17:19:54.034466 29537 http.cpp:974] Creating default 'basic' HTTP authenticator for
realm 'mesos-agent-readonly'
I0627 17:19:54.034659 29537 http.cpp:995] Creating default 'jwt' HTTP authenticator for realm
'mesos-agent-readonly'
I0627 17:19:54.034874 29537 http.cpp:974] Creating default 'basic' HTTP authenticator for
realm 'mesos-agent-readwrite'
I0627 17:19:54.034983 29537 http.cpp:995] Creating default 'jwt' HTTP authenticator for realm
'mesos-agent-readwrite'
I0627 17:19:54.036357 29537 slave.cpp:553] Agent resources: [{"name":"cpus","scalar":{"value":2.0},"type":"SCALAR"},{"name":"mem","scalar":{"value":1024.0},"type":"SCALAR"},{"name":"disk","scalar":{"value":1024.0},"type":"SCALAR"},{"name":"ports","ranges":{"range":[{"begin":31000,"end":32000}]},"type":"RANGES"}]
I0627 17:19:54.036595 29537 slave.cpp:561] Agent attributes: [  ]
I0627 17:19:54.036609 29537 slave.cpp:566] Agent hostname: 085d01f316cb
I0627 17:19:54.036756 29525 status_update_manager.cpp:177] Pausing sending status updates
I0627 17:19:54.038182 29535 state.cpp:64] Recovering state from '/tmp/Endpoint_SlaveEndpointTest_NoAuthorizer_2_RzygXS/meta'
I0627 17:19:54.038468 29526 status_update_manager.cpp:203] Recovering status update manager
I0627 17:19:54.038736 29523 containerizer.cpp:582] Recovering containerizer
I0627 17:19:54.040385 29520 provisioner.cpp:416] Provisioner recovery complete
I0627 17:19:54.040813 29536 slave.cpp:6168] Finished recovery
I0627 17:19:54.041437 29536 slave.cpp:6350] Querying resource estimator for oversubscribable
resources
I0627 17:19:54.041762 29535 slave.cpp:6364] Received oversubscribable resources {} from the
resource estimator
I0627 17:19:54.043766 29538 process.cpp:3779] Handling HTTP event for process 'slave(779)'
with path: '/slave(779)/containers'
I0627 17:19:54.045537 29522 http.cpp:1114] HTTP GET for /slave(779)/containers from 172.17.0.3:33504
I0627 17:19:54.045624 29522 http.cpp:935] Authorizing principal 'test-principal' to GET the
'/containers' endpoint
I0627 17:19:54.048974 29537 slave.cpp:818] Agent terminating
[       OK ] Endpoint/SlaveEndpointTest.NoAuthorizer/2 (35 ms)
[----------] 9 tests from Endpoint/SlaveEndpointTest (303 ms total)

[----------] Global test environment tear-down
[==========] 1623 tests from 180 test cases ran. (582998 ms total)
[  PASSED  ] 1619 tests.
[  FAILED  ] 4 tests, listed below:
[  FAILED  ] DefaultExecutorCheckTest.CommandCheckDeliveredAndReconciled
[  FAILED  ] DefaultExecutorCheckTest.CommandCheckStatusChange
[  FAILED  ] DefaultExecutorCheckTest.CommandCheckSeesParentsEnv
[  FAILED  ] DefaultExecutorCheckTest.CommandCheckSharesWorkDirWithTask

 4 FAILED TESTS
  YOU HAVE 20 DISABLED TESTS

I0627 17:19:54.116149 29542 process.cpp:968] Failed to accept socket: future discarded
make[4]: *** [check-local] Error 1
make[4]: Leaving directory `/mesos/mesos-1.4.0/_build/src'
make[3]: *** [check-am] Error 2
make[3]: Leaving directory `/mesos/mesos-1.4.0/_build/src'
make[2]: *** [check] Error 2
make[2]: Leaving directory `/mesos/mesos-1.4.0/_build/src'
make[1]: *** [check-recursive] Error 1
make[1]: Leaving directory `/mesos/mesos-1.4.0/_build'
make: *** [distcheck] Error 1
+ docker rmi mesos-1498581383-21038
Untagged: mesos-1498581383-21038:latest
Deleted: sha256:0718f569adaa74955f96866f0b5e671e5b17d92d6df623aa6625e3f6c65560ba
Deleted: sha256:d17a1980652bb610f9703efc330371b63f0f0384e6574dfa62eec1dfffc4eac0
Deleted: sha256:ba7f91ee089dadcd3db3e0597f8a5e9b70600624800d01e635c79963a390fb86
Deleted: sha256:9870889a513ba195bc92f200f295375c3c1a83f731b829117d39f8c98a75e795
Deleted: sha256:882de59075cdd385baa296e345701cfc99990525f684adaf449afc9dde66eeee
Deleted: sha256:53daac4d334f17e109a19b98678391a53ed7ba71ba2826a7bc6133b44bc206a4
Deleted: sha256:cd61b083af5ec9ecafaff91c4a1f089750819b888d99ec8c76f8460421be5cee
Deleted: sha256:940b77a194ac7147e5d7efe122411ca47610db396892e1b6e6954c750c074576
Deleted: sha256:150283cc6e25c8eaa58bf23a5e93c473508706183f50531cc81ea1727272643a
Deleted: sha256:c4988dfb17b1c852070fc226e94c1ddd6e54cecdcef7d336562016241abaf720
Deleted: sha256:1acb3e8cc6a6726af89313c74fe9e64397839adb5ea0ce120792e2f0b6b27f3e
Deleted: sha256:5ccb7b7432aa9e84d1579fd63436e91c49b4ee8b342dffafdd4a3992f0340241
Deleted: sha256:e0bd2ad983643ea06221d7e7a8c290a09761d9fa80e98c90eaeb20897f3d14c9
Deleted: sha256:1824111b3094d038ab88b69be0d524ace436b603c377d2e51ce7ef13480687aa
Deleted: sha256:d8bebc15eb0e466423304693f46c49159e8adfe3ed0c10cb3966271e84efda92
Deleted: sha256:9a6775bf713a9fa472de242968f5ecbc40eddc9995e312bb9513fd82a7b835a1
Deleted: sha256:64b797d4c94fce34bd62b9a9e6d6bc935d581f25fc59298cf8af55b1693b8795
Deleted: sha256:4fc7285f1b5793445a8bd8c9d25e0c70761cc7ad3d9897b389e574a550fa9b79
Deleted: sha256:61a6198f310b4e56fd6d6948c10c937ba53f84c5910df0397cd75e5bb8e8c454
Deleted: sha256:ee9868db0acf1b1064eb61098d927b8dac667ee0a401f04b95c9317631d9e546
Deleted: sha256:396aeffad4ef66294aaf0d9c9177da14ff90415a8ef20eb3a7f27df76d79ab8d
Deleted: sha256:5224fa603e7b63d1446297b75642814acb654caa061f44d391bb7712163494ca
Deleted: sha256:559bbf67b41a53ae996bfaa4b14944e3a9d262a09ce53c49725d3dda564d55d4
Deleted: sha256:5a4a4a0216b8cf0f86cda19ba3d725f686c6e746c0b6a1e65ae7b6970ba35db1
Deleted: sha256:c24648b62a79f7d3e6903b0eced07337e481af1a508e36e30351a20a558a51bb
Build step 'Execute shell' marked build as failure
Not sending mail to unregistered user neil.conway@gmail.com

Mime
View raw message