mesos-builds mailing list archives

Site index · List index
Message view « Date » · « Thread »
Top « Date » · « Thread »
From Apache Jenkins Server <jenk...@builds.apache.org>
Subject Build failed in Jenkins: Mesos-Buildbot » cmake,gcc,--verbose --enable-libevent --enable-ssl,GLOG_v=1 MESOS_VERBOSE=1,centos:7,(ubuntu)&&(!ubuntu-us1)&&(!ubuntu-eu2) #3788
Date Tue, 13 Jun 2017 03:28:19 GMT
See <https://builds.apache.org/job/Mesos-Buildbot/BUILDTOOL=cmake,COMPILER=gcc,CONFIGURATION=--verbose%20--enable-libevent%20--enable-ssl,ENVIRONMENT=GLOG_v=1%20MESOS_VERBOSE=1,OS=centos%3A7,label_exp=(ubuntu)&&(!ubuntu-us1)&&(!ubuntu-eu2)/3788/display/redirect?page=changes>

Changes:

[toenshoff] Fixed Docker containerizer stdout/stderr ownership.

[toenshoff] Test confirming the Docker containerizer stdout/stderr ownership.

------------------------------------------
[...truncated 27.02 MB...]
I0613 03:28:15.389433  8948 slave.cpp:6323] Received oversubscribable resources {} from the
resource estimator
I0613 03:28:15.390955  8954 process.cpp:3778] Handling HTTP event for process 'slave(756)'
with path: '/slave(756)/containers'
I0613 03:28:15.392439  8951 http.cpp:1115] HTTP GET for /slave(756)/containers from 172.17.0.2:41558
I0613 03:28:15.392508  8951 http.cpp:936] Authorizing principal 'test-principal' to GET the
'/containers' endpoint
I0613 03:28:15.395560  8954 slave.cpp:817] Agent terminating
[       OK ] Endpoint/SlaveEndpointTest.AuthorizedRequest/2 (33 ms)
[ RUN      ] Endpoint/SlaveEndpointTest.UnauthorizedRequest/0
I0613 03:28:15.406563  1505 containerizer.cpp:230] Using isolation: posix/cpu,posix/mem,filesystem/posix,network/cni,environment_secret
W0613 03:28:15.407035  1505 backend.cpp:76] Failed to create 'aufs' backend: AufsBackend requires
root privileges
W0613 03:28:15.407117  1505 backend.cpp:76] Failed to create 'bind' backend: BindBackend requires
root privileges
I0613 03:28:15.407142  1505 provisioner.cpp:255] Using default backend 'copy'
I0613 03:28:15.410167  8945 slave.cpp:248] Mesos agent started on (757)@172.17.0.2:41106
I0613 03:28:15.410182  8945 slave.cpp:249] Flags at startup: --acls="" --appc_simple_discovery_uri_prefix="http://"
--appc_store_dir="/tmp/Endpoint_SlaveEndpointTest_UnauthorizedRequest_0_jDpVLb/store/appc"
--authenticate_http_executors="true" --authenticate_http_readonly="true" --authenticate_http_readwrite="true"
--authenticatee="crammd5" --authentication_backoff_factor="1secs" --authorizer="local" --cgroups_cpu_enable_pids_and_tids_count="false"
--cgroups_enable_cfs="false" --cgroups_hierarchy="/sys/fs/cgroup" --cgroups_limit_swap="false"
--cgroups_root="mesos" --container_disk_watch_interval="15secs" --containerizers="mesos" --credential="/tmp/Endpoint_SlaveEndpointTest_UnauthorizedRequest_0_jDpVLb/credential"
--default_role="*" --disk_watch_interval="1mins" --docker="docker" --docker_kill_orphans="true"
--docker_registry="https://registry-1.docker.io" --docker_remove_delay="6hrs" --docker_socket="/var/run/docker.sock"
--docker_stop_timeout="0ns" --docker_store_dir="/tmp/Endpoint_SlaveEndpointTest_UnauthorizedRequest_0_jDpVLb/store/docker"
--docker_volume_checkpoint_dir="/var/run/mesos/isolators/docker/volume" --enforce_container_disk_quota="false"
--executor_registration_timeout="1mins" --executor_reregistration_timeout="2secs" --executor_secret_key="/tmp/Endpoint_SlaveEndpointTest_UnauthorizedRequest_0_jDpVLb/executor_secret_key"
--executor_shutdown_grace_period="5secs" --fetcher_cache_dir="/tmp/Endpoint_SlaveEndpointTest_UnauthorizedRequest_0_jDpVLb/fetch"
--fetcher_cache_size="2GB" --frameworks_home="" --gc_delay="1weeks" --gc_disk_headroom="0.1"
--hadoop_home="" --help="false" --hostname_lookup="true" --http_command_executor="false" --http_credentials="/tmp/Endpoint_SlaveEndpointTest_UnauthorizedRequest_0_jDpVLb/http_credentials"
--http_heartbeat_interval="30secs" --initialize_driver_logging="true" --isolation="posix/cpu,posix/mem"
--launcher="posix" --launcher_dir="/mesos/build/src" --logbufsecs="0" --logging_level="INFO"
--max_completed_executors_per_framework="150" --oversubscribed_resources_interval="15secs"
--perf_duration="10secs" --perf_interval="1mins" --port="5051" --qos_correction_interval_min="0ns"
--quiet="false" --recover="reconnect" --recovery_timeout="15mins" --registration_backoff_factor="10ms"
--resources="cpus:2;gpus:0;mem:1024;disk:1024;ports:[31000-32000]" --revocable_cpu_low_priority="true"
--runtime_dir="/tmp/Endpoint_SlaveEndpointTest_UnauthorizedRequest_0_jDpVLb" --sandbox_directory="/mnt/mesos/sandbox"
--strict="true" --switch_user="true" --systemd_enable_support="true" --systemd_runtime_directory="/run/systemd/system"
--version="false" --work_dir="/tmp/Endpoint_SlaveEndpointTest_UnauthorizedRequest_0_wEzWe7"
I0613 03:28:15.410569  8945 credentials.hpp:86] Loading credential for authentication from
'/tmp/Endpoint_SlaveEndpointTest_UnauthorizedRequest_0_jDpVLb/credential'
I0613 03:28:15.410686  8945 slave.cpp:281] Agent using credential for: test-principal
I0613 03:28:15.410699  8945 credentials.hpp:37] Loading credentials for authentication from
'/tmp/Endpoint_SlaveEndpointTest_UnauthorizedRequest_0_jDpVLb/http_credentials'
I0613 03:28:15.410912  8945 http.cpp:975] Creating default 'basic' HTTP authenticator for
realm 'mesos-agent-executor'
I0613 03:28:15.410993  8945 http.cpp:996] Creating default 'jwt' HTTP authenticator for realm
'mesos-agent-executor'
I0613 03:28:15.411295  8945 http.cpp:975] Creating default 'basic' HTTP authenticator for
realm 'mesos-agent-readonly'
I0613 03:28:15.411419  8945 http.cpp:996] Creating default 'jwt' HTTP authenticator for realm
'mesos-agent-readonly'
I0613 03:28:15.411808  8945 http.cpp:975] Creating default 'basic' HTTP authenticator for
realm 'mesos-agent-readwrite'
I0613 03:28:15.411911  8945 http.cpp:996] Creating default 'jwt' HTTP authenticator for realm
'mesos-agent-readwrite'
I0613 03:28:15.413308  8945 slave.cpp:552] Agent resources: cpus(*):2; mem(*):1024; disk(*):1024;
ports(*):[31000-32000]
I0613 03:28:15.413378  8945 slave.cpp:560] Agent attributes: [  ]
I0613 03:28:15.413388  8945 slave.cpp:565] Agent hostname: 75ff5b5b9d5d
I0613 03:28:15.413530  8965 status_update_manager.cpp:177] Pausing sending status updates
I0613 03:28:15.414765  8952 state.cpp:62] Recovering state from '/tmp/Endpoint_SlaveEndpointTest_UnauthorizedRequest_0_wEzWe7/meta'
I0613 03:28:15.415139  8946 status_update_manager.cpp:203] Recovering status update manager
I0613 03:28:15.415313  8956 containerizer.cpp:582] Recovering containerizer
I0613 03:28:15.416551  8967 provisioner.cpp:416] Provisioner recovery complete
I0613 03:28:15.416925  8945 slave.cpp:6127] Finished recovery
I0613 03:28:15.417356  8945 slave.cpp:6309] Querying resource estimator for oversubscribable
resources
I0613 03:28:15.417614  8950 slave.cpp:6323] Received oversubscribable resources {} from the
resource estimator
I0613 03:28:15.419034  8954 process.cpp:3778] Handling HTTP event for process 'slave(757)'
with path: '/slave(757)/monitor/statistics'
I0613 03:28:15.420581  8967 http.cpp:1115] HTTP GET for /slave(757)/monitor/statistics from
172.17.0.2:41560
I0613 03:28:15.420646  8967 http.cpp:936] Authorizing principal 'test-principal' to GET the
'/monitor/statistics' endpoint
I0613 03:28:15.423013  8955 slave.cpp:817] Agent terminating
[       OK ] Endpoint/SlaveEndpointTest.UnauthorizedRequest/0 (26 ms)
[ RUN      ] Endpoint/SlaveEndpointTest.UnauthorizedRequest/1
I0613 03:28:15.433362  1505 containerizer.cpp:230] Using isolation: posix/cpu,posix/mem,filesystem/posix,network/cni,environment_secret
W0613 03:28:15.433856  1505 backend.cpp:76] Failed to create 'aufs' backend: AufsBackend requires
root privileges
W0613 03:28:15.433939  1505 backend.cpp:76] Failed to create 'bind' backend: BindBackend requires
root privileges
I0613 03:28:15.433966  1505 provisioner.cpp:255] Using default backend 'copy'
I0613 03:28:15.437364  8953 slave.cpp:248] Mesos agent started on (758)@172.17.0.2:41106
I0613 03:28:15.437381  8953 slave.cpp:249] Flags at startup: --acls="" --appc_simple_discovery_uri_prefix="http://"
--appc_store_dir="/tmp/Endpoint_SlaveEndpointTest_UnauthorizedRequest_1_JA4r7t/store/appc"
--authenticate_http_executors="true" --authenticate_http_readonly="true" --authenticate_http_readwrite="true"
--authenticatee="crammd5" --authentication_backoff_factor="1secs" --authorizer="local" --cgroups_cpu_enable_pids_and_tids_count="false"
--cgroups_enable_cfs="false" --cgroups_hierarchy="/sys/fs/cgroup" --cgroups_limit_swap="false"
--cgroups_root="mesos" --container_disk_watch_interval="15secs" --containerizers="mesos" --credential="/tmp/Endpoint_SlaveEndpointTest_UnauthorizedRequest_1_JA4r7t/credential"
--default_role="*" --disk_watch_interval="1mins" --docker="docker" --docker_kill_orphans="true"
--docker_registry="https://registry-1.docker.io" --docker_remove_delay="6hrs" --docker_socket="/var/run/docker.sock"
--docker_stop_timeout="0ns" --docker_store_dir="/tmp/Endpoint_SlaveEndpointTest_UnauthorizedRequest_1_JA4r7t/store/docker"
--docker_volume_checkpoint_dir="/var/run/mesos/isolators/docker/volume" --enforce_container_disk_quota="false"
--executor_registration_timeout="1mins" --executor_reregistration_timeout="2secs" --executor_secret_key="/tmp/Endpoint_SlaveEndpointTest_UnauthorizedRequest_1_JA4r7t/executor_secret_key"
--executor_shutdown_grace_period="5secs" --fetcher_cache_dir="/tmp/Endpoint_SlaveEndpointTest_UnauthorizedRequest_1_JA4r7t/fetch"
--fetcher_cache_size="2GB" --frameworks_home="" --gc_delay="1weeks" --gc_disk_headroom="0.1"
--hadoop_home="" --help="false" --hostname_lookup="true" --http_command_executor="false" --http_credentials="/tmp/Endpoint_SlaveEndpointTest_UnauthorizedRequest_1_JA4r7t/http_credentials"
--http_heartbeat_interval="30secs" --initialize_driver_logging="true" --isolation="posix/cpu,posix/mem"
--launcher="posix" --launcher_dir="/mesos/build/src" --logbufsecs="0" --logging_level="INFO"
--max_completed_executors_per_framework="150" --oversubscribed_resources_interval="15secs"
--perf_duration="10secs" --perf_interval="1mins" --port="5051" --qos_correction_interval_min="0ns"
--quiet="false" --recover="reconnect" --recovery_timeout="15mins" --registration_backoff_factor="10ms"
--resources="cpus:2;gpus:0;mem:1024;disk:1024;ports:[31000-32000]" --revocable_cpu_low_priority="true"
--runtime_dir="/tmp/Endpoint_SlaveEndpointTest_UnauthorizedRequest_1_JA4r7t" --sandbox_directory="/mnt/mesos/sandbox"
--strict="true" --switch_user="true" --systemd_enable_support="true" --systemd_runtime_directory="/run/systemd/system"
--version="false" --work_dir="/tmp/Endpoint_SlaveEndpointTest_UnauthorizedRequest_1_ebzuwp"
I0613 03:28:15.437794  8953 credentials.hpp:86] Loading credential for authentication from
'/tmp/Endpoint_SlaveEndpointTest_UnauthorizedRequest_1_JA4r7t/credential'
I0613 03:28:15.437925  8953 slave.cpp:281] Agent using credential for: test-principal
I0613 03:28:15.437940  8953 credentials.hpp:37] Loading credentials for authentication from
'/tmp/Endpoint_SlaveEndpointTest_UnauthorizedRequest_1_JA4r7t/http_credentials'
I0613 03:28:15.438179  8953 http.cpp:975] Creating default 'basic' HTTP authenticator for
realm 'mesos-agent-executor'
I0613 03:28:15.438284  8953 http.cpp:996] Creating default 'jwt' HTTP authenticator for realm
'mesos-agent-executor'
I0613 03:28:15.438622  8953 http.cpp:975] Creating default 'basic' HTTP authenticator for
realm 'mesos-agent-readonly'
I0613 03:28:15.438714  8953 http.cpp:996] Creating default 'jwt' HTTP authenticator for realm
'mesos-agent-readonly'
I0613 03:28:15.439041  8953 http.cpp:975] Creating default 'basic' HTTP authenticator for
realm 'mesos-agent-readwrite'
I0613 03:28:15.439137  8953 http.cpp:996] Creating default 'jwt' HTTP authenticator for realm
'mesos-agent-readwrite'
I0613 03:28:15.440464  8953 slave.cpp:552] Agent resources: cpus(*):2; mem(*):1024; disk(*):1024;
ports(*):[31000-32000]
I0613 03:28:15.440531  8953 slave.cpp:560] Agent attributes: [  ]
I0613 03:28:15.440539  8953 slave.cpp:565] Agent hostname: 75ff5b5b9d5d
I0613 03:28:15.440678  8966 status_update_manager.cpp:177] Pausing sending status updates
I0613 03:28:15.442073  8956 state.cpp:62] Recovering state from '/tmp/Endpoint_SlaveEndpointTest_UnauthorizedRequest_1_ebzuwp/meta'
I0613 03:28:15.442423  8959 status_update_manager.cpp:203] Recovering status update manager
I0613 03:28:15.442601  8967 containerizer.cpp:582] Recovering containerizer
I0613 03:28:15.444123  8964 provisioner.cpp:416] Provisioner recovery complete
I0613 03:28:15.444581  8947 slave.cpp:6127] Finished recovery
I0613 03:28:15.444950  8947 slave.cpp:6309] Querying resource estimator for oversubscribable
resources
I0613 03:28:15.445374  8965 slave.cpp:6323] Received oversubscribable resources {} from the
resource estimator
I0613 03:28:15.446925  8967 process.cpp:3778] Handling HTTP event for process 'slave(758)'
with path: '/slave(758)/monitor/statistics.json'
I0613 03:28:15.448567  8955 http.cpp:1115] HTTP GET for /slave(758)/monitor/statistics.json
from 172.17.0.2:41562
I0613 03:28:15.448635  8955 http.cpp:936] Authorizing principal 'test-principal' to GET the
'/monitor/statistics.json' endpoint
I0613 03:28:15.450549  8944 slave.cpp:817] Agent terminating
[       OK ] Endpoint/SlaveEndpointTest.UnauthorizedRequest/1 (28 ms)
[ RUN      ] Endpoint/SlaveEndpointTest.UnauthorizedRequest/2
I0613 03:28:15.461191  1505 containerizer.cpp:230] Using isolation: posix/cpu,posix/mem,filesystem/posix,network/cni,environment_secret
W0613 03:28:15.461706  1505 backend.cpp:76] Failed to create 'aufs' backend: AufsBackend requires
root privileges
W0613 03:28:15.461802  1505 backend.cpp:76] Failed to create 'bind' backend: BindBackend requires
root privileges
I0613 03:28:15.461835  1505 provisioner.cpp:255] Using default backend 'copy'
I0613 03:28:15.465037  8958 slave.cpp:248] Mesos agent started on (759)@172.17.0.2:41106
I0613 03:28:15.465054  8958 slave.cpp:249] Flags at startup: --acls="" --appc_simple_discovery_uri_prefix="http://"
--appc_store_dir="/tmp/Endpoint_SlaveEndpointTest_UnauthorizedRequest_2_iQstJM/store/appc"
--authenticate_http_executors="true" --authenticate_http_readonly="true" --authenticate_http_readwrite="true"
--authenticatee="crammd5" --authentication_backoff_factor="1secs" --authorizer="local" --cgroups_cpu_enable_pids_and_tids_count="false"
--cgroups_enable_cfs="false" --cgroups_hierarchy="/sys/fs/cgroup" --cgroups_limit_swap="false"
--cgroups_root="mesos" --container_disk_watch_interval="15secs" --containerizers="mesos" --credential="/tmp/Endpoint_SlaveEndpointTest_UnauthorizedRequest_2_iQstJM/credential"
--default_role="*" --disk_watch_interval="1mins" --docker="docker" --docker_kill_orphans="true"
--docker_registry="https://registry-1.docker.io" --docker_remove_delay="6hrs" --docker_socket="/var/run/docker.sock"
--docker_stop_timeout="0ns" --docker_store_dir="/tmp/Endpoint_SlaveEndpointTest_UnauthorizedRequest_2_iQstJM/store/docker"
--docker_volume_checkpoint_dir="/var/run/mesos/isolators/docker/volume" --enforce_container_disk_quota="false"
--executor_registration_timeout="1mins" --executor_reregistration_timeout="2secs" --executor_secret_key="/tmp/Endpoint_SlaveEndpointTest_UnauthorizedRequest_2_iQstJM/executor_secret_key"
--executor_shutdown_grace_period="5secs" --fetcher_cache_dir="/tmp/Endpoint_SlaveEndpointTest_UnauthorizedRequest_2_iQstJM/fetch"
--fetcher_cache_size="2GB" --frameworks_home="" --gc_delay="1weeks" --gc_disk_headroom="0.1"
--hadoop_home="" --help="false" --hostname_lookup="true" --http_command_executor="false" --http_credentials="/tmp/Endpoint_SlaveEndpointTest_UnauthorizedRequest_2_iQstJM/http_credentials"
--http_heartbeat_interval="30secs" --initialize_driver_logging="true" --isolation="posix/cpu,posix/mem"
--launcher="posix" --launcher_dir="/mesos/build/src" --logbufsecs="0" --logging_level="INFO"
--max_completed_executors_per_framework="150" --oversubscribed_resources_interval="15secs"
--perf_duration="10secs" --perf_interval="1mins" --port="5051" --qos_correction_interval_min="0ns"
--quiet="false" --recover="reconnect" --recovery_timeout="15mins" --registration_backoff_factor="10ms"
--resources="cpus:2;gpus:0;mem:1024;disk:1024;ports:[31000-32000]" --revocable_cpu_low_priority="true"
--runtime_dir="/tmp/Endpoint_SlaveEndpointTest_UnauthorizedRequest_2_iQstJM" --sandbox_directory="/mnt/mesos/sandbox"
--strict="true" --switch_user="true" --systemd_enable_support="true" --systemd_runtime_directory="/run/systemd/system"
--version="false" --work_dir="/tmp/Endpoint_SlaveEndpointTest_UnauthorizedRequest_2_BZdo4H"
I0613 03:28:15.465435  8958 credentials.hpp:86] Loading credential for authentication from
'/tmp/Endpoint_SlaveEndpointTest_UnauthorizedRequest_2_iQstJM/credential'
I0613 03:28:15.465577  8958 slave.cpp:281] Agent using credential for: test-principal
I0613 03:28:15.465593  8958 credentials.hpp:37] Loading credentials for authentication from
'/tmp/Endpoint_SlaveEndpointTest_UnauthorizedRequest_2_iQstJM/http_credentials'
I0613 03:28:15.465834  8958 http.cpp:975] Creating default 'basic' HTTP authenticator for
realm 'mesos-agent-executor'
I0613 03:28:15.465939  8958 http.cpp:996] Creating default 'jwt' HTTP authenticator for realm
'mesos-agent-executor'
I0613 03:28:15.466229  8958 http.cpp:975] Creating default 'basic' HTTP authenticator for
realm 'mesos-agent-readonly'
I0613 03:28:15.466331  8958 http.cpp:996] Creating default 'jwt' HTTP authenticator for realm
'mesos-agent-readonly'
I0613 03:28:15.466677  8958 http.cpp:975] Creating default 'basic' HTTP authenticator for
realm 'mesos-agent-readwrite'
I0613 03:28:15.466778  8958 http.cpp:996] Creating default 'jwt' HTTP authenticator for realm
'mesos-agent-readwrite'
I0613 03:28:15.468209  8958 slave.cpp:552] Agent resources: cpus(*):2; mem(*):1024; disk(*):1024;
ports(*):[31000-32000]
I0613 03:28:15.468274  8958 slave.cpp:560] Agent attributes: [  ]
I0613 03:28:15.468284  8958 slave.cpp:565] Agent hostname: 75ff5b5b9d5d
I0613 03:28:15.468410  8961 status_update_manager.cpp:177] Pausing sending status updates
I0613 03:28:15.469738  8965 state.cpp:62] Recovering state from '/tmp/Endpoint_SlaveEndpointTest_UnauthorizedRequest_2_BZdo4H/meta'
I0613 03:28:15.470072  8966 status_update_manager.cpp:203] Recovering status update manager
I0613 03:28:15.470249  8949 containerizer.cpp:582] Recovering containerizer
I0613 03:28:15.471690  8961 provisioner.cpp:416] Provisioner recovery complete
I0613 03:28:15.472060  8958 slave.cpp:6127] Finished recovery
I0613 03:28:15.472535  8958 slave.cpp:6309] Querying resource estimator for oversubscribable
resources
I0613 03:28:15.472829  8966 slave.cpp:6323] Received oversubscribable resources {} from the
resource estimator
I0613 03:28:15.474361  8957 process.cpp:3778] Handling HTTP event for process 'slave(759)'
with path: '/slave(759)/containers'
I0613 03:28:15.475991  8949 http.cpp:1115] HTTP GET for /slave(759)/containers from 172.17.0.2:41564
I0613 03:28:15.476076  8949 http.cpp:936] Authorizing principal 'test-principal' to GET the
'/containers' endpoint
I0613 03:28:15.478240  8960 slave.cpp:817] Agent terminating
[       OK ] Endpoint/SlaveEndpointTest.UnauthorizedRequest/2 (28 ms)
[ RUN      ] Endpoint/SlaveEndpointTest.NoAuthorizer/0
I0613 03:28:15.488955  1505 containerizer.cpp:230] Using isolation: posix/cpu,posix/mem,filesystem/posix,network/cni,environment_secret
W0613 03:28:15.489401  1505 backend.cpp:76] Failed to create 'aufs' backend: AufsBackend requires
root privileges
W0613 03:28:15.489480  1505 backend.cpp:76] Failed to create 'bind' backend: BindBackend requires
root privileges
I0613 03:28:15.489507  1505 provisioner.cpp:255] Using default backend 'copy'
I0613 03:28:15.491312  1505 cluster.cpp:448] Creating default 'local' authorizer
I0613 03:28:15.492810  8956 slave.cpp:248] Mesos agent started on (760)@172.17.0.2:41106
I0613 03:28:15.492827  8956 slave.cpp:249] Flags at startup: --acls="" --appc_simple_discovery_uri_prefix="http://"
--appc_store_dir="/tmp/Endpoint_SlaveEndpointTest_NoAuthorizer_0_dgz4B5/store/appc" --authenticate_http_executors="true"
--authenticate_http_readonly="true" --authenticate_http_readwrite="true" --authenticatee="crammd5"
--authentication_backoff_factor="1secs" --authorizer="local" --cgroups_cpu_enable_pids_and_tids_count="false"
--cgroups_enable_cfs="false" --cgroups_hierarchy="/sys/fs/cgroup" --cgroups_limit_swap="false"
--cgroups_root="mesos" --container_disk_watch_interval="15secs" --containerizers="mesos" --credential="/tmp/Endpoint_SlaveEndpointTest_NoAuthorizer_0_dgz4B5/credential"
--default_role="*" --disk_watch_interval="1mins" --docker="docker" --docker_kill_orphans="true"
--docker_registry="https://registry-1.docker.io" --docker_remove_delay="6hrs" --docker_socket="/var/run/docker.sock"
--docker_stop_timeout="0ns" --docker_store_dir="/tmp/Endpoint_SlaveEndpointTest_NoAuthorizer_0_dgz4B5/store/docker"
--docker_volume_checkpoint_dir="/var/run/mesos/isolators/docker/volume" --enforce_container_disk_quota="false"
--executor_registration_timeout="1mins" --executor_reregistration_timeout="2secs" --executor_secret_key="/tmp/Endpoint_SlaveEndpointTest_NoAuthorizer_0_dgz4B5/executor_secret_key"
--executor_shutdown_grace_period="5secs" --fetcher_cache_dir="/tmp/Endpoint_SlaveEndpointTest_NoAuthorizer_0_dgz4B5/fetch"
--fetcher_cache_size="2GB" --frameworks_home="" --gc_delay="1weeks" --gc_disk_headroom="0.1"
--hadoop_home="" --help="false" --hostname_lookup="true" --http_command_executor="false" --http_credentials="/tmp/Endpoint_SlaveEndpointTest_NoAuthorizer_0_dgz4B5/http_credentials"
--http_heartbeat_interval="30secs" --initialize_driver_logging="true" --isolation="posix/cpu,posix/mem"
--launcher="posix" --launcher_dir="/mesos/build/src" --logbufsecs="0" --logging_level="INFO"
--max_completed_executors_per_framework="150" --oversubscribed_resources_interval="15secs"
--perf_duration="10secs" --perf_interval="1mins" --port="5051" --qos_correction_interval_min="0ns"
--quiet="false" --recover="reconnect" --recovery_timeout="15mins" --registration_backoff_factor="10ms"
--resources="cpus:2;gpus:0;mem:1024;disk:1024;ports:[31000-32000]" --revocable_cpu_low_priority="true"
--runtime_dir="/tmp/Endpoint_SlaveEndpointTest_NoAuthorizer_0_dgz4B5" --sandbox_directory="/mnt/mesos/sandbox"
--strict="true" --switch_user="true" --systemd_enable_support="true" --systemd_runtime_directory="/run/systemd/system"
--version="false" --work_dir="/tmp/Endpoint_SlaveEndpointTest_NoAuthorizer_0_aSYPS0"
I0613 03:28:15.493257  8956 credentials.hpp:86] Loading credential for authentication from
'/tmp/Endpoint_SlaveEndpointTest_NoAuthorizer_0_dgz4B5/credential'
I0613 03:28:15.493396  8956 slave.cpp:281] Agent using credential for: test-principal
I0613 03:28:15.493415  8956 credentials.hpp:37] Loading credentials for authentication from
'/tmp/Endpoint_SlaveEndpointTest_NoAuthorizer_0_dgz4B5/http_credentials'
I0613 03:28:15.493660  8956 http.cpp:975] Creating default 'basic' HTTP authenticator for
realm 'mesos-agent-executor'
I0613 03:28:15.493752  8956 http.cpp:996] Creating default 'jwt' HTTP authenticator for realm
'mesos-agent-executor'
I0613 03:28:15.493945  8956 http.cpp:975] Creating default 'basic' HTTP authenticator for
realm 'mesos-agent-readonly'
I0613 03:28:15.494032  8956 http.cpp:996] Creating default 'jwt' HTTP authenticator for realm
'mesos-agent-readonly'
I0613 03:28:15.494282  8956 http.cpp:975] Creating default 'basic' HTTP authenticator for
realm 'mesos-agent-readwrite'
I0613 03:28:15.494371  8956 http.cpp:996] Creating default 'jwt' HTTP authenticator for realm
'mesos-agent-readwrite'
I0613 03:28:15.495529  8956 slave.cpp:552] Agent resources: cpus(*):2; mem(*):1024; disk(*):1024;
ports(*):[31000-32000]
I0613 03:28:15.495590  8956 slave.cpp:560] Agent attributes: [  ]
I0613 03:28:15.495600  8956 slave.cpp:565] Agent hostname: 75ff5b5b9d5d
I0613 03:28:15.495718  8955 status_update_manager.cpp:177] Pausing sending status updates
I0613 03:28:15.497030  8944 state.cpp:62] Recovering state from '/tmp/Endpoint_SlaveEndpointTest_NoAuthorizer_0_aSYPS0/meta'
I0613 03:28:15.497329  8959 status_update_manager.cpp:203] Recovering status update manager
I0613 03:28:15.497511  8955 containerizer.cpp:582] Recovering containerizer
I0613 03:28:15.498795  8962 provisioner.cpp:416] Provisioner recovery complete
I0613 03:28:15.499124  8948 slave.cpp:6127] Finished recovery
I0613 03:28:15.499492  8948 slave.cpp:6309] Querying resource estimator for oversubscribable
resources
I0613 03:28:15.503680  8949 slave.cpp:6323] Received oversubscribable resources {} from the
resource estimator
I0613 03:28:15.505125  8960 process.cpp:3778] Handling HTTP event for process 'slave(760)'
with path: '/slave(760)/monitor/statistics'
I0613 03:28:15.506598  8955 http.cpp:1115] HTTP GET for /slave(760)/monitor/statistics from
172.17.0.2:41566
I0613 03:28:15.506669  8955 http.cpp:936] Authorizing principal 'test-principal' to GET the
'/monitor/statistics' endpoint
I0613 03:28:15.510098  8948 slave.cpp:817] Agent terminating
[       OK ] Endpoint/SlaveEndpointTest.NoAuthorizer/0 (31 ms)
[ RUN      ] Endpoint/SlaveEndpointTest.NoAuthorizer/1
I0613 03:28:15.521412  1505 containerizer.cpp:230] Using isolation: posix/cpu,posix/mem,filesystem/posix,network/cni,environment_secret
W0613 03:28:15.521936  1505 backend.cpp:76] Failed to create 'aufs' backend: AufsBackend requires
root privileges
W0613 03:28:15.522027  1505 backend.cpp:76] Failed to create 'bind' backend: BindBackend requires
root privileges
I0613 03:28:15.522056  1505 provisioner.cpp:255] Using default backend 'copy'
I0613 03:28:15.524229  1505 cluster.cpp:448] Creating default 'local' authorizer
I0613 03:28:15.525770  8961 slave.cpp:248] Mesos agent started on (761)@172.17.0.2:41106
I0613 03:28:15.525789  8961 slave.cpp:249] Flags at startup: --acls="" --appc_simple_discovery_uri_prefix="http://"
--appc_store_dir="/tmp/Endpoint_SlaveEndpointTest_NoAuthorizer_1_sZRUMo/store/appc" --authenticate_http_executors="true"
--authenticate_http_readonly="true" --authenticate_http_readwrite="true" --authenticatee="crammd5"
--authentication_backoff_factor="1secs" --authorizer="local" --cgroups_cpu_enable_pids_and_tids_count="false"
--cgroups_enable_cfs="false" --cgroups_hierarchy="/sys/fs/cgroup" --cgroups_limit_swap="false"
--cgroups_root="mesos" --container_disk_watch_interval="15secs" --containerizers="mesos" --credential="/tmp/Endpoint_SlaveEndpointTest_NoAuthorizer_1_sZRUMo/credential"
--default_role="*" --disk_watch_interval="1mins" --docker="docker" --docker_kill_orphans="true"
--docker_registry="https://registry-1.docker.io" --docker_remove_delay="6hrs" --docker_socket="/var/run/docker.sock"
--docker_stop_timeout="0ns" --docker_store_dir="/tmp/Endpoint_SlaveEndpointTest_NoAuthorizer_1_sZRUMo/store/docker"
--docker_volume_checkpoint_dir="/var/run/mesos/isolators/docker/volume" --enforce_container_disk_quota="false"
--executor_registration_timeout="1mins" --executor_reregistration_timeout="2secs" --executor_secret_key="/tmp/Endpoint_SlaveEndpointTest_NoAuthorizer_1_sZRUMo/executor_secret_key"
--executor_shutdown_grace_period="5secs" --fetcher_cache_dir="/tmp/Endpoint_SlaveEndpointTest_NoAuthorizer_1_sZRUMo/fetch"
--fetcher_cache_size="2GB" --frameworks_home="" --gc_delay="1weeks" --gc_disk_headroom="0.1"
--hadoop_home="" --help="false" --hostname_lookup="true" --http_command_executor="false" --http_credentials="/tmp/Endpoint_SlaveEndpointTest_NoAuthorizer_1_sZRUMo/http_credentials"
--http_heartbeat_interval="30secs" --initialize_driver_logging="true" --isolation="posix/cpu,posix/mem"
--launcher="posix" --launcher_dir="/mesos/build/src" --logbufsecs="0" --logging_level="INFO"
--max_completed_executors_per_framework="150" --oversubscribed_resources_interval="15secs"
--perf_duration="10secs" --perf_interval="1mins" --port="5051" --qos_correction_interval_min="0ns"
--quiet="false" --recover="reconnect" --recovery_timeout="15mins" --registration_backoff_factor="10ms"
--resources="cpus:2;gpus:0;mem:1024;disk:1024;ports:[31000-32000]" --revocable_cpu_low_priority="true"
--runtime_dir="/tmp/Endpoint_SlaveEndpointTest_NoAuthorizer_1_sZRUMo" --sandbox_directory="/mnt/mesos/sandbox"
--strict="true" --switch_user="true" --systemd_enable_support="true" --systemd_runtime_directory="/run/systemd/system"
--version="false" --work_dir="/tmp/Endpoint_SlaveEndpointTest_NoAuthorizer_1_5E6UYj"
I0613 03:28:15.526197  8961 credentials.hpp:86] Loading credential for authentication from
'/tmp/Endpoint_SlaveEndpointTest_NoAuthorizer_1_sZRUMo/credential'
I0613 03:28:15.526335  8961 slave.cpp:281] Agent using credential for: test-principal
I0613 03:28:15.526351  8961 credentials.hpp:37] Loading credentials for authentication from
'/tmp/Endpoint_SlaveEndpointTest_NoAuthorizer_1_sZRUMo/http_credentials'
I0613 03:28:15.526592  8961 http.cpp:975] Creating default 'basic' HTTP authenticator for
realm 'mesos-agent-executor'
I0613 03:28:15.526686  8961 http.cpp:996] Creating default 'jwt' HTTP authenticator for realm
'mesos-agent-executor'
I0613 03:28:15.526890  8961 http.cpp:975] Creating default 'basic' HTTP authenticator for
realm 'mesos-agent-readonly'
I0613 03:28:15.526979  8961 http.cpp:996] Creating default 'jwt' HTTP authenticator for realm
'mesos-agent-readonly'
I0613 03:28:15.527132  8961 http.cpp:975] Creating default 'basic' HTTP authenticator for
realm 'mesos-agent-readwrite'
I0613 03:28:15.527214  8961 http.cpp:996] Creating default 'jwt' HTTP authenticator for realm
'mesos-agent-readwrite'
I0613 03:28:15.528801  8961 slave.cpp:552] Agent resources: cpus(*):2; mem(*):1024; disk(*):1024;
ports(*):[31000-32000]
I0613 03:28:15.528877  8961 slave.cpp:560] Agent attributes: [  ]
I0613 03:28:15.528887  8961 slave.cpp:565] Agent hostname: 75ff5b5b9d5d
I0613 03:28:15.529031  8958 status_update_manager.cpp:177] Pausing sending status updates
I0613 03:28:15.530822  8959 state.cpp:62] Recovering state from '/tmp/Endpoint_SlaveEndpointTest_NoAuthorizer_1_5E6UYj/meta'
I0613 03:28:15.531338  8949 status_update_manager.cpp:203] Recovering status update manager
I0613 03:28:15.531543  8963 containerizer.cpp:582] Recovering containerizer
I0613 03:28:15.533161  8957 provisioner.cpp:416] Provisioner recovery complete
I0613 03:28:15.533721  8949 slave.cpp:6127] Finished recovery
I0613 03:28:15.534173  8949 slave.cpp:6309] Querying resource estimator for oversubscribable
resources
I0613 03:28:15.534394  8959 slave.cpp:6323] Received oversubscribable resources {} from the
resource estimator
I0613 03:28:15.536036  8963 process.cpp:3778] Handling HTTP event for process 'slave(761)'
with path: '/slave(761)/monitor/statistics.json'
I0613 03:28:15.537722  8954 http.cpp:1115] HTTP GET for /slave(761)/monitor/statistics.json
from 172.17.0.2:41568
I0613 03:28:15.537798  8954 http.cpp:936] Authorizing principal 'test-principal' to GET the
'/monitor/statistics.json' endpoint
I0613 03:28:15.541195  8964 slave.cpp:817] Agent terminating
[       OK ] Endpoint/SlaveEndpointTest.NoAuthorizer/1 (30 ms)
[ RUN      ] Endpoint/SlaveEndpointTest.NoAuthorizer/2
I0613 03:28:15.552150  1505 containerizer.cpp:230] Using isolation: posix/cpu,posix/mem,filesystem/posix,network/cni,environment_secret
W0613 03:28:15.552611  1505 backend.cpp:76] Failed to create 'aufs' backend: AufsBackend requires
root privileges
W0613 03:28:15.552708  1505 backend.cpp:76] Failed to create 'bind' backend: BindBackend requires
root privileges
I0613 03:28:15.552733  1505 provisioner.cpp:255] Using default backend 'copy'
I0613 03:28:15.554852  1505 cluster.cpp:448] Creating default 'local' authorizer
I0613 03:28:15.556584  8965 slave.cpp:248] Mesos agent started on (762)@172.17.0.2:41106
I0613 03:28:15.556598  8965 slave.cpp:249] Flags at startup: --acls="" --appc_simple_discovery_uri_prefix="http://"
--appc_store_dir="/tmp/Endpoint_SlaveEndpointTest_NoAuthorizer_2_irIPgI/store/appc" --authenticate_http_executors="true"
--authenticate_http_readonly="true" --authenticate_http_readwrite="true" --authenticatee="crammd5"
--authentication_backoff_factor="1secs" --authorizer="local" --cgroups_cpu_enable_pids_and_tids_count="false"
--cgroups_enable_cfs="false" --cgroups_hierarchy="/sys/fs/cgroup" --cgroups_limit_swap="false"
--cgroups_root="mesos" --container_disk_watch_interval="15secs" --containerizers="mesos" --credential="/tmp/Endpoint_SlaveEndpointTest_NoAuthorizer_2_irIPgI/credential"
--default_role="*" --disk_watch_interval="1mins" --docker="docker" --docker_kill_orphans="true"
--docker_registry="https://registry-1.docker.io" --docker_remove_delay="6hrs" --docker_socket="/var/run/docker.sock"
--docker_stop_timeout="0ns" --docker_store_dir="/tmp/Endpoint_SlaveEndpointTest_NoAuthorizer_2_irIPgI/store/docker"
--docker_volume_checkpoint_dir="/var/run/mesos/isolators/docker/volume" --enforce_container_disk_quota="false"
--executor_registration_timeout="1mins" --executor_reregistration_timeout="2secs" --executor_secret_key="/tmp/Endpoint_SlaveEndpointTest_NoAuthorizer_2_irIPgI/executor_secret_key"
--executor_shutdown_grace_period="5secs" --fetcher_cache_dir="/tmp/Endpoint_SlaveEndpointTest_NoAuthorizer_2_irIPgI/fetch"
--fetcher_cache_size="2GB" --frameworks_home="" --gc_delay="1weeks" --gc_disk_headroom="0.1"
--hadoop_home="" --help="false" --hostname_lookup="true" --http_command_executor="false" --http_credentials="/tmp/Endpoint_SlaveEndpointTest_NoAuthorizer_2_irIPgI/http_credentials"
--http_heartbeat_interval="30secs" --initialize_driver_logging="true" --isolation="posix/cpu,posix/mem"
--launcher="posix" --launcher_dir="/mesos/build/src" --logbufsecs="0" --logging_level="INFO"
--max_completed_executors_per_framework="150" --oversubscribed_resources_interval="15secs"
--perf_duration="10secs" --perf_interval="1mins" --port="5051" --qos_correction_interval_min="0ns"
--quiet="false" --recover="reconnect" --recovery_timeout="15mins" --registration_backoff_factor="10ms"
--resources="cpus:2;gpus:0;mem:1024;disk:1024;ports:[31000-32000]" --revocable_cpu_low_priority="true"
--runtime_dir="/tmp/Endpoint_SlaveEndpointTest_NoAuthorizer_2_irIPgI" --sandbox_directory="/mnt/mesos/sandbox"
--strict="true" --switch_user="true" --systemd_enable_support="true" --systemd_runtime_directory="/run/systemd/system"
--version="false" --work_dir="/tmp/Endpoint_SlaveEndpointTest_NoAuthorizer_2_5o4coD"
I0613 03:28:15.556944  8965 credentials.hpp:86] Loading credential for authentication from
'/tmp/Endpoint_SlaveEndpointTest_NoAuthorizer_2_irIPgI/credential'
I0613 03:28:15.557073  8965 slave.cpp:281] Agent using credential for: test-principal
I0613 03:28:15.557088  8965 credentials.hpp:37] Loading credentials for authentication from
'/tmp/Endpoint_SlaveEndpointTest_NoAuthorizer_2_irIPgI/http_credentials'
I0613 03:28:15.557340  8965 http.cpp:975] Creating default 'basic' HTTP authenticator for
realm 'mesos-agent-executor'
I0613 03:28:15.557431  8965 http.cpp:996] Creating default 'jwt' HTTP authenticator for realm
'mesos-agent-executor'
I0613 03:28:15.557613  8965 http.cpp:975] Creating default 'basic' HTTP authenticator for
realm 'mesos-agent-readonly'
I0613 03:28:15.557699  8965 http.cpp:996] Creating default 'jwt' HTTP authenticator for realm
'mesos-agent-readonly'
I0613 03:28:15.558029  8965 http.cpp:975] Creating default 'basic' HTTP authenticator for
realm 'mesos-agent-readwrite'
I0613 03:28:15.558176  8965 http.cpp:996] Creating default 'jwt' HTTP authenticator for realm
'mesos-agent-readwrite'
I0613 03:28:15.559516  8965 slave.cpp:552] Agent resources: cpus(*):2; mem(*):1024; disk(*):1024;
ports(*):[31000-32000]
I0613 03:28:15.559586  8965 slave.cpp:560] Agent attributes: [  ]
I0613 03:28:15.559594  8965 slave.cpp:565] Agent hostname: 75ff5b5b9d5d
I0613 03:28:15.559736  8961 status_update_manager.cpp:177] Pausing sending status updates
I0613 03:28:15.560993  8958 state.cpp:62] Recovering state from '/tmp/Endpoint_SlaveEndpointTest_NoAuthorizer_2_5o4coD/meta'
I0613 03:28:15.561447  8960 status_update_manager.cpp:203] Recovering status update manager
I0613 03:28:15.561625  8955 containerizer.cpp:582] Recovering containerizer
I0613 03:28:15.563184  8954 provisioner.cpp:416] Provisioner recovery complete
I0613 03:28:15.563527  8950 slave.cpp:6127] Finished recovery
I0613 03:28:15.563982  8950 slave.cpp:6309] Querying resource estimator for oversubscribable
resources
I0613 03:28:15.564292  8964 slave.cpp:6323] Received oversubscribable resources {} from the
resource estimator
I0613 03:28:15.566005  8964 process.cpp:3778] Handling HTTP event for process 'slave(762)'
with path: '/slave(762)/containers'
I0613 03:28:15.567654  8963 http.cpp:1115] HTTP GET for /slave(762)/containers from 172.17.0.2:41570
I0613 03:28:15.567730  8963 http.cpp:936] Authorizing principal 'test-principal' to GET the
'/containers' endpoint
I0613 03:28:15.571184  8966 slave.cpp:817] Agent terminating
[       OK ] Endpoint/SlaveEndpointTest.NoAuthorizer/2 (29 ms)
[----------] 9 tests from Endpoint/SlaveEndpointTest (269 ms total)

[----------] Global test environment tear-down
[==========] 1547 tests from 171 test cases ran. (291529 ms total)
[  PASSED  ] 1546 tests.
[  FAILED  ] 1 test, listed below:
[  FAILED  ] PersistentVolumeEndpointsTest.ReserveAndSlaveRemoval

 1 FAILED TEST
  YOU HAVE 22 DISABLED TESTS

E0613 03:28:15.635210  8968 process.cpp:968] Failed to accept socket: future discarded
make[3]: *** [CMakeFiles/check] Error 1
make[3]: Leaving directory `/mesos/build'
make[2]: *** [CMakeFiles/check.dir/all] Error 2
make[2]: Leaving directory `/mesos/build'
make[1]: *** [CMakeFiles/check.dir/rule] Error 2
make[1]: Leaving directory `/mesos/build'
make: *** [check] Error 2
+ docker rmi mesos-1497322041-18599
Untagged: mesos-1497322041-18599:latest
Deleted: sha256:c6e9e98b22942af867fa7a42c37519f36d8bb2cd871bb0c9eb7d9962ba146ad1
Deleted: sha256:2edb6e52c2192a049074faf5831b21f150a564b9b024957bbb1a6859a9bbff0f
Deleted: sha256:769edcfbeb45ee3281b577405372bdafd5c0304107c52cf6985eb204c88c6390
Deleted: sha256:8a9a157fbf8990c8cc38e64d43ee5579e0e3cce315daa541797be794f6cf259a
Deleted: sha256:e5b7d8b3256cc54d9ff85f016400ead2b9a9c3609dc2cad950f065284156078f
Deleted: sha256:61ab715055c4a16b23c92ba7422441fe0ef6e858d3df1fc1c440d3c15d82e4b9
Deleted: sha256:dedc74127ca22a206d8f7e4a2cd3ad84a91597263f30699c25070a851f0504d9
Deleted: sha256:3338b694c1405f2e0d8936798915b91c2afa1c11475dad56e1426e7a4ad31d13
Deleted: sha256:25b774c5da921fb035770f218702325df8ce6be23d0294cac0d12a36fcf6a857
Deleted: sha256:7abc965208d1b00282d371ba8a2f4fc8fbe64b46e55d0e9f8ec5f42c45553a5b
Deleted: sha256:67fc1e41841b6d98493457c3a1e64b9de2695c8591367d0b065ccfc51530b391
Deleted: sha256:177f6aac547e1b5726999a61caa08832b676ebe8d96a4154a9be55ed18b6aa5a
Deleted: sha256:d5733e3fe13a5c06e6373d8d4e417d9081cf7a529ba79dbc35980c93870e1ad3
Deleted: sha256:feb655a0a0b9275187a1ff4dbfc17349e37bcbe13bba31ba43e226401d67a368
Deleted: sha256:f863254e69b09648361f9bd66b16252eb09728feca92d301e7f902fdd7224845
Deleted: sha256:0d1c2b1cd3e82f8132af889891c5561225f011ae98f938ce2f99e013328edbb5
Deleted: sha256:2c578a1d7cfabf3973e74117284abab47e2dcd09dfe67c6425b092acc701870e
Deleted: sha256:53d7c67f8f6ee2349acc3bf4d0972d5356c67883989cd9835878ca8f73bc0591
Deleted: sha256:ff16c2de21974bc2e0dab1aee22cb568cd4ecb7b27b7b60a2bc373eab3974175
Deleted: sha256:1f3c62b18ef5ac0982ed2087db3c2a56c66e9fd09fd744c8157279f9a1306a5b
Deleted: sha256:0cac676a86ceeaefc1251ff8846ae7f515dd192c5d29e6c83dc503a0306a20f5
Deleted: sha256:d0f79412026b321b6e6483bfdfac554236138525e86649f76b8f86dc7c653f63
Deleted: sha256:6e2749397252713aca5dcbbb44bbd1de8ed7e9979abfaf4a9a69144ba720c8ce
Deleted: sha256:1306634805fbe55b65b25e56772091846b69e9f938a724b2497e1252c9b52dec
Deleted: sha256:8c6d4f2e6f5f825e8076bb06c9c5098887c7ae3fb24858ff2ba7f6fadbe6a365
Build step 'Execute shell' marked build as failure
Not sending mail to unregistered user toenshoff@me.com

Mime
View raw message