mesos-builds mailing list archives

Site index · List index
Message view « Date » · « Thread »
Top « Date » · « Thread »
From Apache Jenkins Server <jenk...@builds.apache.org>
Subject Build failed in Jenkins: Mesos-Reviewbot #18280
Date Tue, 06 Jun 2017 16:10:56 GMT
See <https://builds.apache.org/job/Mesos-Reviewbot/18280/display/redirect>

------------------------------------------
[...truncated 28.07 MB...]
I0606 16:10:46.854406  4510 containerizer.cpp:230] Using isolation: posix/cpu,posix/mem,filesystem/posix,network/cni,environment_secret
W0606 16:10:46.855279  4510 backend.cpp:76] Failed to create 'overlay' backend: OverlayBackend
requires root privileges
W0606 16:10:46.855473  4510 backend.cpp:76] Failed to create 'bind' backend: BindBackend requires
root privileges
I0606 16:10:46.855521  4510 provisioner.cpp:255] Using default backend 'copy'
I0606 16:10:46.861328  4533 slave.cpp:248] Mesos agent started on (756)@172.17.0.2:34607
I0606 16:10:46.861378  4533 slave.cpp:249] Flags at startup: --acls="" --appc_simple_discovery_uri_prefix="http://"
--appc_store_dir="/tmp/Endpoint_SlaveEndpointTest_AuthorizedRequest_2_QvJq5J/store/appc" --authenticate_http_readonly="true"
--authenticate_http_readwrite="true" --authenticatee="crammd5" --authentication_backoff_factor="1secs"
--authorizer="local" --cgroups_cpu_enable_pids_and_tids_count="false" --cgroups_enable_cfs="false"
--cgroups_hierarchy="/sys/fs/cgroup" --cgroups_limit_swap="false" --cgroups_root="mesos" --container_disk_watch_interval="15secs"
--containerizers="mesos" --credential="/tmp/Endpoint_SlaveEndpointTest_AuthorizedRequest_2_QvJq5J/credential"
--default_role="*" --disk_watch_interval="1mins" --docker="docker" --docker_kill_orphans="true"
--docker_registry="https://registry-1.docker.io" --docker_remove_delay="6hrs" --docker_socket="/var/run/docker.sock"
--docker_stop_timeout="0ns" --docker_store_dir="/tmp/Endpoint_SlaveEndpointTest_AuthorizedRequest_2_QvJq5J/store/docker"
--docker_volume_checkpoint_dir="/var/run/mesos/isolators/docker/volume" --enforce_container_disk_quota="false"
--executor_registration_timeout="1mins" --executor_reregistration_timeout="2secs" --executor_shutdown_grace_period="5secs"
--fetcher_cache_dir="/tmp/Endpoint_SlaveEndpointTest_AuthorizedRequest_2_QvJq5J/fetch" --fetcher_cache_size="2GB"
--frameworks_home="" --gc_delay="1weeks" --gc_disk_headroom="0.1" --hadoop_home="" --help="false"
--hostname_lookup="true" --http_command_executor="false" --http_credentials="/tmp/Endpoint_SlaveEndpointTest_AuthorizedRequest_2_QvJq5J/http_credentials"
--http_heartbeat_interval="30secs" --initialize_driver_logging="true" --isolation="posix/cpu,posix/mem"
--launcher="posix" --launcher_dir="/mesos/mesos-1.4.0/_build/src" --logbufsecs="0" --logging_level="INFO"
--max_completed_executors_per_framework="150" --oversubscribed_resources_interval="15secs"
--perf_duration="10secs" --perf_interval="1mins" --port="5051" --qos_correction_interval_min="0ns"
--quiet="false" --recover="reconnect" --recovery_timeout="15mins" --registration_backoff_factor="10ms"
--resources="cpus:2;gpus:0;mem:1024;disk:1024;ports:[31000-32000]" --revocable_cpu_low_priority="true"
--runtime_dir="/tmp/Endpoint_SlaveEndpointTest_AuthorizedRequest_2_QvJq5J" --sandbox_directory="/mnt/mesos/sandbox"
--strict="true" --switch_user="true" --systemd_enable_support="true" --systemd_runtime_directory="/run/systemd/system"
--version="false" --work_dir="/tmp/Endpoint_SlaveEndpointTest_AuthorizedRequest_2_Cz5t9W"
I0606 16:10:46.862452  4533 credentials.hpp:86] Loading credential for authentication from
'/tmp/Endpoint_SlaveEndpointTest_AuthorizedRequest_2_QvJq5J/credential'
I0606 16:10:46.862928  4533 slave.cpp:281] Agent using credential for: test-principal
I0606 16:10:46.862969  4533 credentials.hpp:37] Loading credentials for authentication from
'/tmp/Endpoint_SlaveEndpointTest_AuthorizedRequest_2_QvJq5J/http_credentials'
I0606 16:10:46.863535  4533 http.cpp:975] Creating default 'basic' HTTP authenticator for
realm 'mesos-agent-readonly'
I0606 16:10:46.863929  4533 http.cpp:975] Creating default 'basic' HTTP authenticator for
realm 'mesos-agent-readwrite'
I0606 16:10:46.866245  4533 slave.cpp:552] Agent resources: cpus(*):2; mem(*):1024; disk(*):1024;
ports(*):[31000-32000]
I0606 16:10:46.866399  4533 slave.cpp:560] Agent attributes: [  ]
I0606 16:10:46.866420  4533 slave.cpp:565] Agent hostname: 91054f0fa810
I0606 16:10:46.866752  4530 status_update_manager.cpp:177] Pausing sending status updates
I0606 16:10:46.869014  4529 state.cpp:62] Recovering state from '/tmp/Endpoint_SlaveEndpointTest_AuthorizedRequest_2_Cz5t9W/meta'
I0606 16:10:46.869830  4529 status_update_manager.cpp:203] Recovering status update manager
I0606 16:10:46.870229  4529 containerizer.cpp:582] Recovering containerizer
I0606 16:10:46.873363  4529 provisioner.cpp:416] Provisioner recovery complete
I0606 16:10:46.874444  4529 slave.cpp:6127] Finished recovery
I0606 16:10:46.875955  4529 slave.cpp:6309] Querying resource estimator for oversubscribable
resources
I0606 16:10:46.876420  4530 slave.cpp:6323] Received oversubscribable resources {} from the
resource estimator
I0606 16:10:46.882167  4530 process.cpp:3778] Handling HTTP event for process 'slave(756)'
with path: '/slave(756)/containers'
I0606 16:10:46.884624  4530 http.cpp:1115] HTTP GET for /slave(756)/containers from 172.17.0.2:59884
I0606 16:10:46.884747  4530 http.cpp:936] Authorizing principal 'test-principal' to GET the
'/containers' endpoint
I0606 16:10:46.891921  4530 slave.cpp:817] Agent terminating
[       OK ] Endpoint/SlaveEndpointTest.AuthorizedRequest/2 (53 ms)
[ RUN      ] Endpoint/SlaveEndpointTest.UnauthorizedRequest/0
I0606 16:10:46.908082  4510 containerizer.cpp:230] Using isolation: posix/cpu,posix/mem,filesystem/posix,network/cni,environment_secret
W0606 16:10:46.908949  4510 backend.cpp:76] Failed to create 'overlay' backend: OverlayBackend
requires root privileges
W0606 16:10:46.909145  4510 backend.cpp:76] Failed to create 'bind' backend: BindBackend requires
root privileges
I0606 16:10:46.909196  4510 provisioner.cpp:255] Using default backend 'copy'
I0606 16:10:46.915599  4530 slave.cpp:248] Mesos agent started on (757)@172.17.0.2:34607
I0606 16:10:46.915688  4530 slave.cpp:249] Flags at startup: --acls="" --appc_simple_discovery_uri_prefix="http://"
--appc_store_dir="/tmp/Endpoint_SlaveEndpointTest_UnauthorizedRequest_0_CgfFiU/store/appc"
--authenticate_http_readonly="true" --authenticate_http_readwrite="true" --authenticatee="crammd5"
--authentication_backoff_factor="1secs" --authorizer="local" --cgroups_cpu_enable_pids_and_tids_count="false"
--cgroups_enable_cfs="false" --cgroups_hierarchy="/sys/fs/cgroup" --cgroups_limit_swap="false"
--cgroups_root="mesos" --container_disk_watch_interval="15secs" --containerizers="mesos" --credential="/tmp/Endpoint_SlaveEndpointTest_UnauthorizedRequest_0_CgfFiU/credential"
--default_role="*" --disk_watch_interval="1mins" --docker="docker" --docker_kill_orphans="true"
--docker_registry="https://registry-1.docker.io" --docker_remove_delay="6hrs" --docker_socket="/var/run/docker.sock"
--docker_stop_timeout="0ns" --docker_store_dir="/tmp/Endpoint_SlaveEndpointTest_UnauthorizedRequest_0_CgfFiU/store/docker"
--docker_volume_checkpoint_dir="/var/run/mesos/isolators/docker/volume" --enforce_container_disk_quota="false"
--executor_registration_timeout="1mins" --executor_reregistration_timeout="2secs" --executor_shutdown_grace_period="5secs"
--fetcher_cache_dir="/tmp/Endpoint_SlaveEndpointTest_UnauthorizedRequest_0_CgfFiU/fetch" --fetcher_cache_size="2GB"
--frameworks_home="" --gc_delay="1weeks" --gc_disk_headroom="0.1" --hadoop_home="" --help="false"
--hostname_lookup="true" --http_command_executor="false" --http_credentials="/tmp/Endpoint_SlaveEndpointTest_UnauthorizedRequest_0_CgfFiU/http_credentials"
--http_heartbeat_interval="30secs" --initialize_driver_logging="true" --isolation="posix/cpu,posix/mem"
--launcher="posix" --launcher_dir="/mesos/mesos-1.4.0/_build/src" --logbufsecs="0" --logging_level="INFO"
--max_completed_executors_per_framework="150" --oversubscribed_resources_interval="15secs"
--perf_duration="10secs" --perf_interval="1mins" --port="5051" --qos_correction_interval_min="0ns"
--quiet="false" --recover="reconnect" --recovery_timeout="15mins" --registration_backoff_factor="10ms"
--resources="cpus:2;gpus:0;mem:1024;disk:1024;ports:[31000-32000]" --revocable_cpu_low_priority="true"
--runtime_dir="/tmp/Endpoint_SlaveEndpointTest_UnauthorizedRequest_0_CgfFiU" --sandbox_directory="/mnt/mesos/sandbox"
--strict="true" --switch_user="true" --systemd_enable_support="true" --systemd_runtime_directory="/run/systemd/system"
--version="false" --work_dir="/tmp/Endpoint_SlaveEndpointTest_UnauthorizedRequest_0_0pO4d7"
I0606 16:10:46.916872  4530 credentials.hpp:86] Loading credential for authentication from
'/tmp/Endpoint_SlaveEndpointTest_UnauthorizedRequest_0_CgfFiU/credential'
I0606 16:10:46.917191  4530 slave.cpp:281] Agent using credential for: test-principal
I0606 16:10:46.917801  4530 credentials.hpp:37] Loading credentials for authentication from
'/tmp/Endpoint_SlaveEndpointTest_UnauthorizedRequest_0_CgfFiU/http_credentials'
I0606 16:10:46.918308  4530 http.cpp:975] Creating default 'basic' HTTP authenticator for
realm 'mesos-agent-readonly'
I0606 16:10:46.918591  4530 http.cpp:975] Creating default 'basic' HTTP authenticator for
realm 'mesos-agent-readwrite'
I0606 16:10:46.920650  4530 slave.cpp:552] Agent resources: cpus(*):2; mem(*):1024; disk(*):1024;
ports(*):[31000-32000]
I0606 16:10:46.921393  4530 slave.cpp:560] Agent attributes: [  ]
I0606 16:10:46.921454  4530 slave.cpp:565] Agent hostname: 91054f0fa810
I0606 16:10:46.921705  4534 status_update_manager.cpp:177] Pausing sending status updates
I0606 16:10:46.924607  4533 state.cpp:62] Recovering state from '/tmp/Endpoint_SlaveEndpointTest_UnauthorizedRequest_0_0pO4d7/meta'
I0606 16:10:46.925593  4533 status_update_manager.cpp:203] Recovering status update manager
I0606 16:10:46.926144  4533 containerizer.cpp:582] Recovering containerizer
I0606 16:10:46.928920  4534 provisioner.cpp:416] Provisioner recovery complete
I0606 16:10:46.929780  4535 slave.cpp:6127] Finished recovery
I0606 16:10:46.935421  4535 slave.cpp:6309] Querying resource estimator for oversubscribable
resources
I0606 16:10:46.936130  4535 slave.cpp:6323] Received oversubscribable resources {} from the
resource estimator
I0606 16:10:46.940873  4532 process.cpp:3778] Handling HTTP event for process 'slave(757)'
with path: '/slave(757)/monitor/statistics'
I0606 16:10:46.944566  4532 http.cpp:1115] HTTP GET for /slave(757)/monitor/statistics from
172.17.0.2:59886
I0606 16:10:46.944720  4532 http.cpp:936] Authorizing principal 'test-principal' to GET the
'/monitor/statistics' endpoint
I0606 16:10:46.955118  4530 slave.cpp:817] Agent terminating
[       OK ] Endpoint/SlaveEndpointTest.UnauthorizedRequest/0 (81 ms)
[ RUN      ] Endpoint/SlaveEndpointTest.UnauthorizedRequest/1
I0606 16:10:46.989825  4510 containerizer.cpp:230] Using isolation: posix/cpu,posix/mem,filesystem/posix,network/cni,environment_secret
W0606 16:10:46.990748  4510 backend.cpp:76] Failed to create 'overlay' backend: OverlayBackend
requires root privileges
W0606 16:10:46.991066  4510 backend.cpp:76] Failed to create 'bind' backend: BindBackend requires
root privileges
I0606 16:10:46.991186  4510 provisioner.cpp:255] Using default backend 'copy'
I0606 16:10:46.996764  4535 slave.cpp:248] Mesos agent started on (758)@172.17.0.2:34607
I0606 16:10:46.996810  4535 slave.cpp:249] Flags at startup: --acls="" --appc_simple_discovery_uri_prefix="http://"
--appc_store_dir="/tmp/Endpoint_SlaveEndpointTest_UnauthorizedRequest_1_wNDAi5/store/appc"
--authenticate_http_readonly="true" --authenticate_http_readwrite="true" --authenticatee="crammd5"
--authentication_backoff_factor="1secs" --authorizer="local" --cgroups_cpu_enable_pids_and_tids_count="false"
--cgroups_enable_cfs="false" --cgroups_hierarchy="/sys/fs/cgroup" --cgroups_limit_swap="false"
--cgroups_root="mesos" --container_disk_watch_interval="15secs" --containerizers="mesos" --credential="/tmp/Endpoint_SlaveEndpointTest_UnauthorizedRequest_1_wNDAi5/credential"
--default_role="*" --disk_watch_interval="1mins" --docker="docker" --docker_kill_orphans="true"
--docker_registry="https://registry-1.docker.io" --docker_remove_delay="6hrs" --docker_socket="/var/run/docker.sock"
--docker_stop_timeout="0ns" --docker_store_dir="/tmp/Endpoint_SlaveEndpointTest_UnauthorizedRequest_1_wNDAi5/store/docker"
--docker_volume_checkpoint_dir="/var/run/mesos/isolators/docker/volume" --enforce_container_disk_quota="false"
--executor_registration_timeout="1mins" --executor_reregistration_timeout="2secs" --executor_shutdown_grace_period="5secs"
--fetcher_cache_dir="/tmp/Endpoint_SlaveEndpointTest_UnauthorizedRequest_1_wNDAi5/fetch" --fetcher_cache_size="2GB"
--frameworks_home="" --gc_delay="1weeks" --gc_disk_headroom="0.1" --hadoop_home="" --help="false"
--hostname_lookup="true" --http_command_executor="false" --http_credentials="/tmp/Endpoint_SlaveEndpointTest_UnauthorizedRequest_1_wNDAi5/http_credentials"
--http_heartbeat_interval="30secs" --initialize_driver_logging="true" --isolation="posix/cpu,posix/mem"
--launcher="posix" --launcher_dir="/mesos/mesos-1.4.0/_build/src" --logbufsecs="0" --logging_level="INFO"
--max_completed_executors_per_framework="150" --oversubscribed_resources_interval="15secs"
--perf_duration="10secs" --perf_interval="1mins" --port="5051" --qos_correction_interval_min="0ns"
--quiet="false" --recover="reconnect" --recovery_timeout="15mins" --registration_backoff_factor="10ms"
--resources="cpus:2;gpus:0;mem:1024;disk:1024;ports:[31000-32000]" --revocable_cpu_low_priority="true"
--runtime_dir="/tmp/Endpoint_SlaveEndpointTest_UnauthorizedRequest_1_wNDAi5" --sandbox_directory="/mnt/mesos/sandbox"
--strict="true" --switch_user="true" --systemd_enable_support="true" --systemd_runtime_directory="/run/systemd/system"
--version="false" --work_dir="/tmp/Endpoint_SlaveEndpointTest_UnauthorizedRequest_1_IUKJ0h"
I0606 16:10:46.997552  4535 credentials.hpp:86] Loading credential for authentication from
'/tmp/Endpoint_SlaveEndpointTest_UnauthorizedRequest_1_wNDAi5/credential'
I0606 16:10:46.997813  4535 slave.cpp:281] Agent using credential for: test-principal
I0606 16:10:46.997843  4535 credentials.hpp:37] Loading credentials for authentication from
'/tmp/Endpoint_SlaveEndpointTest_UnauthorizedRequest_1_wNDAi5/http_credentials'
I0606 16:10:46.998224  4535 http.cpp:975] Creating default 'basic' HTTP authenticator for
realm 'mesos-agent-readonly'
I0606 16:10:46.998447  4535 http.cpp:975] Creating default 'basic' HTTP authenticator for
realm 'mesos-agent-readwrite'
I0606 16:10:47.000571  4535 slave.cpp:552] Agent resources: cpus(*):2; mem(*):1024; disk(*):1024;
ports(*):[31000-32000]
I0606 16:10:47.000727  4535 slave.cpp:560] Agent attributes: [  ]
I0606 16:10:47.000748  4535 slave.cpp:565] Agent hostname: 91054f0fa810
I0606 16:10:47.001010  4530 status_update_manager.cpp:177] Pausing sending status updates
I0606 16:10:47.003124  4529 state.cpp:62] Recovering state from '/tmp/Endpoint_SlaveEndpointTest_UnauthorizedRequest_1_IUKJ0h/meta'
I0606 16:10:47.003825  4529 status_update_manager.cpp:203] Recovering status update manager
I0606 16:10:47.004217  4529 containerizer.cpp:582] Recovering containerizer
I0606 16:10:47.006918  4531 provisioner.cpp:416] Provisioner recovery complete
I0606 16:10:47.007560  4529 slave.cpp:6127] Finished recovery
I0606 16:10:47.008283  4529 slave.cpp:6309] Querying resource estimator for oversubscribable
resources
I0606 16:10:47.008631  4531 slave.cpp:6323] Received oversubscribable resources {} from the
resource estimator
I0606 16:10:47.013530  4531 process.cpp:3778] Handling HTTP event for process 'slave(758)'
with path: '/slave(758)/monitor/statistics.json'
I0606 16:10:47.016252  4531 http.cpp:1115] HTTP GET for /slave(758)/monitor/statistics.json
from 172.17.0.2:59888
I0606 16:10:47.016453  4531 http.cpp:936] Authorizing principal 'test-principal' to GET the
'/monitor/statistics.json' endpoint
I0606 16:10:47.021425  4530 slave.cpp:817] Agent terminating
[       OK ] Endpoint/SlaveEndpointTest.UnauthorizedRequest/1 (48 ms)
[ RUN      ] Endpoint/SlaveEndpointTest.UnauthorizedRequest/2
I0606 16:10:47.038245  4510 containerizer.cpp:230] Using isolation: posix/cpu,posix/mem,filesystem/posix,network/cni,environment_secret
W0606 16:10:47.039121  4510 backend.cpp:76] Failed to create 'overlay' backend: OverlayBackend
requires root privileges
W0606 16:10:47.039316  4510 backend.cpp:76] Failed to create 'bind' backend: BindBackend requires
root privileges
I0606 16:10:47.039369  4510 provisioner.cpp:255] Using default backend 'copy'
I0606 16:10:47.044801  4535 slave.cpp:248] Mesos agent started on (759)@172.17.0.2:34607
I0606 16:10:47.044845  4535 slave.cpp:249] Flags at startup: --acls="" --appc_simple_discovery_uri_prefix="http://"
--appc_store_dir="/tmp/Endpoint_SlaveEndpointTest_UnauthorizedRequest_2_ymRDSg/store/appc"
--authenticate_http_readonly="true" --authenticate_http_readwrite="true" --authenticatee="crammd5"
--authentication_backoff_factor="1secs" --authorizer="local" --cgroups_cpu_enable_pids_and_tids_count="false"
--cgroups_enable_cfs="false" --cgroups_hierarchy="/sys/fs/cgroup" --cgroups_limit_swap="false"
--cgroups_root="mesos" --container_disk_watch_interval="15secs" --containerizers="mesos" --credential="/tmp/Endpoint_SlaveEndpointTest_UnauthorizedRequest_2_ymRDSg/credential"
--default_role="*" --disk_watch_interval="1mins" --docker="docker" --docker_kill_orphans="true"
--docker_registry="https://registry-1.docker.io" --docker_remove_delay="6hrs" --docker_socket="/var/run/docker.sock"
--docker_stop_timeout="0ns" --docker_store_dir="/tmp/Endpoint_SlaveEndpointTest_UnauthorizedRequest_2_ymRDSg/store/docker"
--docker_volume_checkpoint_dir="/var/run/mesos/isolators/docker/volume" --enforce_container_disk_quota="false"
--executor_registration_timeout="1mins" --executor_reregistration_timeout="2secs" --executor_shutdown_grace_period="5secs"
--fetcher_cache_dir="/tmp/Endpoint_SlaveEndpointTest_UnauthorizedRequest_2_ymRDSg/fetch" --fetcher_cache_size="2GB"
--frameworks_home="" --gc_delay="1weeks" --gc_disk_headroom="0.1" --hadoop_home="" --help="false"
--hostname_lookup="true" --http_command_executor="false" --http_credentials="/tmp/Endpoint_SlaveEndpointTest_UnauthorizedRequest_2_ymRDSg/http_credentials"
--http_heartbeat_interval="30secs" --initialize_driver_logging="true" --isolation="posix/cpu,posix/mem"
--launcher="posix" --launcher_dir="/mesos/mesos-1.4.0/_build/src" --logbufsecs="0" --logging_level="INFO"
--max_completed_executors_per_framework="150" --oversubscribed_resources_interval="15secs"
--perf_duration="10secs" --perf_interval="1mins" --port="5051" --qos_correction_interval_min="0ns"
--quiet="false" --recover="reconnect" --recovery_timeout="15mins" --registration_backoff_factor="10ms"
--resources="cpus:2;gpus:0;mem:1024;disk:1024;ports:[31000-32000]" --revocable_cpu_low_priority="true"
--runtime_dir="/tmp/Endpoint_SlaveEndpointTest_UnauthorizedRequest_2_ymRDSg" --sandbox_directory="/mnt/mesos/sandbox"
--strict="true" --switch_user="true" --systemd_enable_support="true" --systemd_runtime_directory="/run/systemd/system"
--version="false" --work_dir="/tmp/Endpoint_SlaveEndpointTest_UnauthorizedRequest_2_uRcXst"
I0606 16:10:47.045600  4535 credentials.hpp:86] Loading credential for authentication from
'/tmp/Endpoint_SlaveEndpointTest_UnauthorizedRequest_2_ymRDSg/credential'
I0606 16:10:47.045876  4535 slave.cpp:281] Agent using credential for: test-principal
I0606 16:10:47.045907  4535 credentials.hpp:37] Loading credentials for authentication from
'/tmp/Endpoint_SlaveEndpointTest_UnauthorizedRequest_2_ymRDSg/http_credentials'
I0606 16:10:47.046337  4535 http.cpp:975] Creating default 'basic' HTTP authenticator for
realm 'mesos-agent-readonly'
I0606 16:10:47.046649  4535 http.cpp:975] Creating default 'basic' HTTP authenticator for
realm 'mesos-agent-readwrite'
I0606 16:10:47.048750  4535 slave.cpp:552] Agent resources: cpus(*):2; mem(*):1024; disk(*):1024;
ports(*):[31000-32000]
I0606 16:10:47.048897  4535 slave.cpp:560] Agent attributes: [  ]
I0606 16:10:47.048918  4535 slave.cpp:565] Agent hostname: 91054f0fa810
I0606 16:10:47.049147  4530 status_update_manager.cpp:177] Pausing sending status updates
I0606 16:10:47.051060  4529 state.cpp:62] Recovering state from '/tmp/Endpoint_SlaveEndpointTest_UnauthorizedRequest_2_uRcXst/meta'
I0606 16:10:47.051576  4534 status_update_manager.cpp:203] Recovering status update manager
I0606 16:10:47.051841  4530 containerizer.cpp:582] Recovering containerizer
I0606 16:10:47.054340  4534 provisioner.cpp:416] Provisioner recovery complete
I0606 16:10:47.055274  4534 slave.cpp:6127] Finished recovery
I0606 16:10:47.055955  4534 slave.cpp:6309] Querying resource estimator for oversubscribable
resources
I0606 16:10:47.057003  4534 slave.cpp:6323] Received oversubscribable resources {} from the
resource estimator
I0606 16:10:47.061902  4531 process.cpp:3778] Handling HTTP event for process 'slave(759)'
with path: '/slave(759)/containers'
I0606 16:10:47.064844  4531 http.cpp:1115] HTTP GET for /slave(759)/containers from 172.17.0.2:59890
I0606 16:10:47.064975  4531 http.cpp:936] Authorizing principal 'test-principal' to GET the
'/containers' endpoint
I0606 16:10:47.068758  4536 slave.cpp:817] Agent terminating
[       OK ] Endpoint/SlaveEndpointTest.UnauthorizedRequest/2 (55 ms)
[ RUN      ] Endpoint/SlaveEndpointTest.NoAuthorizer/0
I0606 16:10:47.095005  4510 containerizer.cpp:230] Using isolation: posix/cpu,posix/mem,filesystem/posix,network/cni,environment_secret
W0606 16:10:47.095906  4510 backend.cpp:76] Failed to create 'overlay' backend: OverlayBackend
requires root privileges
W0606 16:10:47.096144  4510 backend.cpp:76] Failed to create 'bind' backend: BindBackend requires
root privileges
I0606 16:10:47.096215  4510 provisioner.cpp:255] Using default backend 'copy'
I0606 16:10:47.099490  4510 cluster.cpp:448] Creating default 'local' authorizer
I0606 16:10:47.103834  4536 slave.cpp:248] Mesos agent started on (760)@172.17.0.2:34607
I0606 16:10:47.103902  4536 slave.cpp:249] Flags at startup: --acls="" --appc_simple_discovery_uri_prefix="http://"
--appc_store_dir="/tmp/Endpoint_SlaveEndpointTest_NoAuthorizer_0_0O2z1s/store/appc" --authenticate_http_readonly="true"
--authenticate_http_readwrite="true" --authenticatee="crammd5" --authentication_backoff_factor="1secs"
--authorizer="local" --cgroups_cpu_enable_pids_and_tids_count="false" --cgroups_enable_cfs="false"
--cgroups_hierarchy="/sys/fs/cgroup" --cgroups_limit_swap="false" --cgroups_root="mesos" --container_disk_watch_interval="15secs"
--containerizers="mesos" --credential="/tmp/Endpoint_SlaveEndpointTest_NoAuthorizer_0_0O2z1s/credential"
--default_role="*" --disk_watch_interval="1mins" --docker="docker" --docker_kill_orphans="true"
--docker_registry="https://registry-1.docker.io" --docker_remove_delay="6hrs" --docker_socket="/var/run/docker.sock"
--docker_stop_timeout="0ns" --docker_store_dir="/tmp/Endpoint_SlaveEndpointTest_NoAuthorizer_0_0O2z1s/store/docker"
--docker_volume_checkpoint_dir="/var/run/mesos/isolators/docker/volume" --enforce_container_disk_quota="false"
--executor_registration_timeout="1mins" --executor_reregistration_timeout="2secs" --executor_shutdown_grace_period="5secs"
--fetcher_cache_dir="/tmp/Endpoint_SlaveEndpointTest_NoAuthorizer_0_0O2z1s/fetch" --fetcher_cache_size="2GB"
--frameworks_home="" --gc_delay="1weeks" --gc_disk_headroom="0.1" --hadoop_home="" --help="false"
--hostname_lookup="true" --http_command_executor="false" --http_credentials="/tmp/Endpoint_SlaveEndpointTest_NoAuthorizer_0_0O2z1s/http_credentials"
--http_heartbeat_interval="30secs" --initialize_driver_logging="true" --isolation="posix/cpu,posix/mem"
--launcher="posix" --launcher_dir="/mesos/mesos-1.4.0/_build/src" --logbufsecs="0" --logging_level="INFO"
--max_completed_executors_per_framework="150" --oversubscribed_resources_interval="15secs"
--perf_duration="10secs" --perf_interval="1mins" --port="5051" --qos_correction_interval_min="0ns"
--quiet="false" --recover="reconnect" --recovery_timeout="15mins" --registration_backoff_factor="10ms"
--resources="cpus:2;gpus:0;mem:1024;disk:1024;ports:[31000-32000]" --revocable_cpu_low_priority="true"
--runtime_dir="/tmp/Endpoint_SlaveEndpointTest_NoAuthorizer_0_0O2z1s" --sandbox_directory="/mnt/mesos/sandbox"
--strict="true" --switch_user="true" --systemd_enable_support="true" --systemd_runtime_directory="/run/systemd/system"
--version="false" --work_dir="/tmp/Endpoint_SlaveEndpointTest_NoAuthorizer_0_OPoQsF"
I0606 16:10:47.104990  4536 credentials.hpp:86] Loading credential for authentication from
'/tmp/Endpoint_SlaveEndpointTest_NoAuthorizer_0_0O2z1s/credential'
I0606 16:10:47.105265  4536 slave.cpp:281] Agent using credential for: test-principal
I0606 16:10:47.105295  4536 credentials.hpp:37] Loading credentials for authentication from
'/tmp/Endpoint_SlaveEndpointTest_NoAuthorizer_0_0O2z1s/http_credentials'
I0606 16:10:47.105712  4536 http.cpp:975] Creating default 'basic' HTTP authenticator for
realm 'mesos-agent-readonly'
I0606 16:10:47.105978  4536 http.cpp:975] Creating default 'basic' HTTP authenticator for
realm 'mesos-agent-readwrite'
I0606 16:10:47.108567  4536 slave.cpp:552] Agent resources: cpus(*):2; mem(*):1024; disk(*):1024;
ports(*):[31000-32000]
I0606 16:10:47.108718  4536 slave.cpp:560] Agent attributes: [  ]
I0606 16:10:47.108739  4536 slave.cpp:565] Agent hostname: 91054f0fa810
I0606 16:10:47.109035  4533 status_update_manager.cpp:177] Pausing sending status updates
I0606 16:10:47.111049  4536 state.cpp:62] Recovering state from '/tmp/Endpoint_SlaveEndpointTest_NoAuthorizer_0_OPoQsF/meta'
I0606 16:10:47.111533  4533 status_update_manager.cpp:203] Recovering status update manager
I0606 16:10:47.111928  4530 containerizer.cpp:582] Recovering containerizer
I0606 16:10:47.114244  4530 provisioner.cpp:416] Provisioner recovery complete
I0606 16:10:47.114769  4535 slave.cpp:6127] Finished recovery
I0606 16:10:47.115589  4535 slave.cpp:6309] Querying resource estimator for oversubscribable
resources
I0606 16:10:47.116142  4531 slave.cpp:6323] Received oversubscribable resources {} from the
resource estimator
I0606 16:10:47.120709  4530 process.cpp:3778] Handling HTTP event for process 'slave(760)'
with path: '/slave(760)/monitor/statistics'
I0606 16:10:47.122679  4535 http.cpp:1115] HTTP GET for /slave(760)/monitor/statistics from
172.17.0.2:59892
I0606 16:10:47.122812  4535 http.cpp:936] Authorizing principal 'test-principal' to GET the
'/monitor/statistics' endpoint
I0606 16:10:47.130065  4530 slave.cpp:817] Agent terminating
[       OK ] Endpoint/SlaveEndpointTest.NoAuthorizer/0 (58 ms)
[ RUN      ] Endpoint/SlaveEndpointTest.NoAuthorizer/1
I0606 16:10:47.152501  4510 containerizer.cpp:230] Using isolation: posix/cpu,posix/mem,filesystem/posix,network/cni,environment_secret
W0606 16:10:47.153360  4510 backend.cpp:76] Failed to create 'overlay' backend: OverlayBackend
requires root privileges
W0606 16:10:47.153628  4510 backend.cpp:76] Failed to create 'bind' backend: BindBackend requires
root privileges
I0606 16:10:47.153705  4510 provisioner.cpp:255] Using default backend 'copy'
I0606 16:10:47.156929  4510 cluster.cpp:448] Creating default 'local' authorizer
I0606 16:10:47.160090  4534 slave.cpp:248] Mesos agent started on (761)@172.17.0.2:34607
I0606 16:10:47.160136  4534 slave.cpp:249] Flags at startup: --acls="" --appc_simple_discovery_uri_prefix="http://"
--appc_store_dir="/tmp/Endpoint_SlaveEndpointTest_NoAuthorizer_1_a4xlMF/store/appc" --authenticate_http_readonly="true"
--authenticate_http_readwrite="true" --authenticatee="crammd5" --authentication_backoff_factor="1secs"
--authorizer="local" --cgroups_cpu_enable_pids_and_tids_count="false" --cgroups_enable_cfs="false"
--cgroups_hierarchy="/sys/fs/cgroup" --cgroups_limit_swap="false" --cgroups_root="mesos" --container_disk_watch_interval="15secs"
--containerizers="mesos" --credential="/tmp/Endpoint_SlaveEndpointTest_NoAuthorizer_1_a4xlMF/credential"
--default_role="*" --disk_watch_interval="1mins" --docker="docker" --docker_kill_orphans="true"
--docker_registry="https://registry-1.docker.io" --docker_remove_delay="6hrs" --docker_socket="/var/run/docker.sock"
--docker_stop_timeout="0ns" --docker_store_dir="/tmp/Endpoint_SlaveEndpointTest_NoAuthorizer_1_a4xlMF/store/docker"
--docker_volume_checkpoint_dir="/var/run/mesos/isolators/docker/volume" --enforce_container_disk_quota="false"
--executor_registration_timeout="1mins" --executor_reregistration_timeout="2secs" --executor_shutdown_grace_period="5secs"
--fetcher_cache_dir="/tmp/Endpoint_SlaveEndpointTest_NoAuthorizer_1_a4xlMF/fetch" --fetcher_cache_size="2GB"
--frameworks_home="" --gc_delay="1weeks" --gc_disk_headroom="0.1" --hadoop_home="" --help="false"
--hostname_lookup="true" --http_command_executor="false" --http_credentials="/tmp/Endpoint_SlaveEndpointTest_NoAuthorizer_1_a4xlMF/http_credentials"
--http_heartbeat_interval="30secs" --initialize_driver_logging="true" --isolation="posix/cpu,posix/mem"
--launcher="posix" --launcher_dir="/mesos/mesos-1.4.0/_build/src" --logbufsecs="0" --logging_level="INFO"
--max_completed_executors_per_framework="150" --oversubscribed_resources_interval="15secs"
--perf_duration="10secs" --perf_interval="1mins" --port="5051" --qos_correction_interval_min="0ns"
--quiet="false" --recover="reconnect" --recovery_timeout="15mins" --registration_backoff_factor="10ms"
--resources="cpus:2;gpus:0;mem:1024;disk:1024;ports:[31000-32000]" --revocable_cpu_low_priority="true"
--runtime_dir="/tmp/Endpoint_SlaveEndpointTest_NoAuthorizer_1_a4xlMF" --sandbox_directory="/mnt/mesos/sandbox"
--strict="true" --switch_user="true" --systemd_enable_support="true" --systemd_runtime_directory="/run/systemd/system"
--version="false" --work_dir="/tmp/Endpoint_SlaveEndpointTest_NoAuthorizer_1_8lad4R"
I0606 16:10:47.160861  4534 credentials.hpp:86] Loading credential for authentication from
'/tmp/Endpoint_SlaveEndpointTest_NoAuthorizer_1_a4xlMF/credential'
I0606 16:10:47.161124  4534 slave.cpp:281] Agent using credential for: test-principal
I0606 16:10:47.161155  4534 credentials.hpp:37] Loading credentials for authentication from
'/tmp/Endpoint_SlaveEndpointTest_NoAuthorizer_1_a4xlMF/http_credentials'
I0606 16:10:47.161533  4534 http.cpp:975] Creating default 'basic' HTTP authenticator for
realm 'mesos-agent-readonly'
I0606 16:10:47.161725  4534 http.cpp:975] Creating default 'basic' HTTP authenticator for
realm 'mesos-agent-readwrite'
I0606 16:10:47.163800  4534 slave.cpp:552] Agent resources: cpus(*):2; mem(*):1024; disk(*):1024;
ports(*):[31000-32000]
I0606 16:10:47.164016  4534 slave.cpp:560] Agent attributes: [  ]
I0606 16:10:47.164068  4534 slave.cpp:565] Agent hostname: 91054f0fa810
I0606 16:10:47.164315  4532 status_update_manager.cpp:177] Pausing sending status updates
I0606 16:10:47.166344  4532 state.cpp:62] Recovering state from '/tmp/Endpoint_SlaveEndpointTest_NoAuthorizer_1_8lad4R/meta'
I0606 16:10:47.167062  4534 status_update_manager.cpp:203] Recovering status update manager
I0606 16:10:47.167439  4533 containerizer.cpp:582] Recovering containerizer
I0606 16:10:47.170003  4533 provisioner.cpp:416] Provisioner recovery complete
I0606 16:10:47.170928  4534 slave.cpp:6127] Finished recovery
I0606 16:10:47.171624  4534 slave.cpp:6309] Querying resource estimator for oversubscribable
resources
I0606 16:10:47.172263  4535 slave.cpp:6323] Received oversubscribable resources {} from the
resource estimator
I0606 16:10:47.177285  4531 process.cpp:3778] Handling HTTP event for process 'slave(761)'
with path: '/slave(761)/monitor/statistics.json'
I0606 16:10:47.179778  4531 http.cpp:1115] HTTP GET for /slave(761)/monitor/statistics.json
from 172.17.0.2:59894
I0606 16:10:47.179905  4531 http.cpp:936] Authorizing principal 'test-principal' to GET the
'/monitor/statistics.json' endpoint
I0606 16:10:47.186058  4536 slave.cpp:817] Agent terminating
[       OK ] Endpoint/SlaveEndpointTest.NoAuthorizer/1 (50 ms)
[ RUN      ] Endpoint/SlaveEndpointTest.NoAuthorizer/2
I0606 16:10:47.204010  4510 containerizer.cpp:230] Using isolation: posix/cpu,posix/mem,filesystem/posix,network/cni,environment_secret
W0606 16:10:47.205001  4510 backend.cpp:76] Failed to create 'overlay' backend: OverlayBackend
requires root privileges
W0606 16:10:47.205317  4510 backend.cpp:76] Failed to create 'bind' backend: BindBackend requires
root privileges
I0606 16:10:47.205379  4510 provisioner.cpp:255] Using default backend 'copy'
I0606 16:10:47.209242  4510 cluster.cpp:448] Creating default 'local' authorizer
I0606 16:10:47.212455  4536 slave.cpp:248] Mesos agent started on (762)@172.17.0.2:34607
I0606 16:10:47.212499  4536 slave.cpp:249] Flags at startup: --acls="" --appc_simple_discovery_uri_prefix="http://"
--appc_store_dir="/tmp/Endpoint_SlaveEndpointTest_NoAuthorizer_2_Mji34S/store/appc" --authenticate_http_readonly="true"
--authenticate_http_readwrite="true" --authenticatee="crammd5" --authentication_backoff_factor="1secs"
--authorizer="local" --cgroups_cpu_enable_pids_and_tids_count="false" --cgroups_enable_cfs="false"
--cgroups_hierarchy="/sys/fs/cgroup" --cgroups_limit_swap="false" --cgroups_root="mesos" --container_disk_watch_interval="15secs"
--containerizers="mesos" --credential="/tmp/Endpoint_SlaveEndpointTest_NoAuthorizer_2_Mji34S/credential"
--default_role="*" --disk_watch_interval="1mins" --docker="docker" --docker_kill_orphans="true"
--docker_registry="https://registry-1.docker.io" --docker_remove_delay="6hrs" --docker_socket="/var/run/docker.sock"
--docker_stop_timeout="0ns" --docker_store_dir="/tmp/Endpoint_SlaveEndpointTest_NoAuthorizer_2_Mji34S/store/docker"
--docker_volume_checkpoint_dir="/var/run/mesos/isolators/docker/volume" --enforce_container_disk_quota="false"
--executor_registration_timeout="1mins" --executor_reregistration_timeout="2secs" --executor_shutdown_grace_period="5secs"
--fetcher_cache_dir="/tmp/Endpoint_SlaveEndpointTest_NoAuthorizer_2_Mji34S/fetch" --fetcher_cache_size="2GB"
--frameworks_home="" --gc_delay="1weeks" --gc_disk_headroom="0.1" --hadoop_home="" --help="false"
--hostname_lookup="true" --http_command_executor="false" --http_credentials="/tmp/Endpoint_SlaveEndpointTest_NoAuthorizer_2_Mji34S/http_credentials"
--http_heartbeat_interval="30secs" --initialize_driver_logging="true" --isolation="posix/cpu,posix/mem"
--launcher="posix" --launcher_dir="/mesos/mesos-1.4.0/_build/src" --logbufsecs="0" --logging_level="INFO"
--max_completed_executors_per_framework="150" --oversubscribed_resources_interval="15secs"
--perf_duration="10secs" --perf_interval="1mins" --port="5051" --qos_correction_interval_min="0ns"
--quiet="false" --recover="reconnect" --recovery_timeout="15mins" --registration_backoff_factor="10ms"
--resources="cpus:2;gpus:0;mem:1024;disk:1024;ports:[31000-32000]" --revocable_cpu_low_priority="true"
--runtime_dir="/tmp/Endpoint_SlaveEndpointTest_NoAuthorizer_2_Mji34S" --sandbox_directory="/mnt/mesos/sandbox"
--strict="true" --switch_user="true" --systemd_enable_support="true" --systemd_runtime_directory="/run/systemd/system"
--version="false" --work_dir="/tmp/Endpoint_SlaveEndpointTest_NoAuthorizer_2_8nzDe5"
I0606 16:10:47.213251  4536 credentials.hpp:86] Loading credential for authentication from
'/tmp/Endpoint_SlaveEndpointTest_NoAuthorizer_2_Mji34S/credential'
I0606 16:10:47.213526  4536 slave.cpp:281] Agent using credential for: test-principal
I0606 16:10:47.213559  4536 credentials.hpp:37] Loading credentials for authentication from
'/tmp/Endpoint_SlaveEndpointTest_NoAuthorizer_2_Mji34S/http_credentials'
I0606 16:10:47.214066  4536 http.cpp:975] Creating default 'basic' HTTP authenticator for
realm 'mesos-agent-readonly'
I0606 16:10:47.214334  4536 http.cpp:975] Creating default 'basic' HTTP authenticator for
realm 'mesos-agent-readwrite'
I0606 16:10:47.216455  4536 slave.cpp:552] Agent resources: cpus(*):2; mem(*):1024; disk(*):1024;
ports(*):[31000-32000]
I0606 16:10:47.216605  4536 slave.cpp:560] Agent attributes: [  ]
I0606 16:10:47.216625  4536 slave.cpp:565] Agent hostname: 91054f0fa810
I0606 16:10:47.216924  4531 status_update_manager.cpp:177] Pausing sending status updates
I0606 16:10:47.219058  4535 state.cpp:62] Recovering state from '/tmp/Endpoint_SlaveEndpointTest_NoAuthorizer_2_8nzDe5/meta'
I0606 16:10:47.219900  4535 status_update_manager.cpp:203] Recovering status update manager
I0606 16:10:47.220199  4535 containerizer.cpp:582] Recovering containerizer
I0606 16:10:47.223695  4535 provisioner.cpp:416] Provisioner recovery complete
I0606 16:10:47.224520  4534 slave.cpp:6127] Finished recovery
I0606 16:10:47.225131  4534 slave.cpp:6309] Querying resource estimator for oversubscribable
resources
I0606 16:10:47.225514  4532 slave.cpp:6323] Received oversubscribable resources {} from the
resource estimator
I0606 16:10:47.231093  4536 process.cpp:3778] Handling HTTP event for process 'slave(762)'
with path: '/slave(762)/containers'
I0606 16:10:47.233228  4530 http.cpp:1115] HTTP GET for /slave(762)/containers from 172.17.0.2:59896
I0606 16:10:47.233378  4530 http.cpp:936] Authorizing principal 'test-principal' to GET the
'/containers' endpoint
I0606 16:10:47.240310  4530 slave.cpp:817] Agent terminating
[       OK ] Endpoint/SlaveEndpointTest.NoAuthorizer/2 (54 ms)
[----------] 9 tests from Endpoint/SlaveEndpointTest (506 ms total)

[----------] Global test environment tear-down
[==========] 1588 tests from 176 test cases ran. (721215 ms total)
[  PASSED  ] 1584 tests.
[  FAILED  ] 4 tests, listed below:
[  FAILED  ] DefaultExecutorCheckTest.CommandCheckDeliveredAndReconciled
[  FAILED  ] DefaultExecutorCheckTest.CommandCheckStatusChange
[  FAILED  ] DefaultExecutorCheckTest.CommandCheckSeesParentsEnv
[  FAILED  ] DefaultExecutorCheckTest.CommandCheckSharesWorkDirWithTask

 4 FAILED TESTS
  YOU HAVE 22 DISABLED TESTS

E0606 16:10:47.398133  4537 process.cpp:968] Failed to accept socket: future discarded
make[4]: *** [check-local] Error 1
make[4]: Leaving directory `/mesos/mesos-1.4.0/_build/src'
make[3]: *** [check-am] Error 2
make[3]: Leaving directory `/mesos/mesos-1.4.0/_build/src'
make[2]: *** [check] Error 2
make[2]: Leaving directory `/mesos/mesos-1.4.0/_build/src'
make[1]: *** [check-recursive] Error 1
make[1]: Leaving directory `/mesos/mesos-1.4.0/_build'
make: *** [distcheck] Error 1
+ docker rmi mesos-1496759672-30498
Untagged: mesos-1496759672-30498:latest
Deleted: sha256:0eed2a4a923deaafd40a6420353cff7b2e80b1c1818cbbaa372fe1b408f6f968
Deleted: sha256:400dd7e766ce62d40fbf7083d4637ceee87bb623f40dcd6b062115aa4d5a7620
Deleted: sha256:dfb132673c475903c154b1fa89cfcdd033f54f9edf11b1a674723d3a2e2e0dcc
Deleted: sha256:0fdef1d30e457def8e714719e1d9fb961d8db23baeb6a226742607ca5e494b5e
Deleted: sha256:bb18de6e7fadcd2d26161844ddf080d03641354e6d033a13366441d39568f11c
Deleted: sha256:ad59f33eebf5858532fabac106f1b35ecf6bb3967e385df6f1a24dbd6a3d9daa
Deleted: sha256:d77f67d64a6ca46e5135e489068a1e9cdd03423e6fedd9da8e691e8d22f6e200
Deleted: sha256:847f9d61681d7f1da783ca1f663bb0873c07934ddb1e636d06f355b52be8e8e5
Deleted: sha256:400f3c7460079a04a39eb3eb777dc2bdb0c3a55e29736bff68c8cbd501abb8f6
Deleted: sha256:c6585910c9ba27cdcf8fe4107d1c5fd47e335fdbb61d3d9b1ee38703c0a4ffd3
Deleted: sha256:20dd69b554c03caf323db9c9cc4f9dbea36ee6150574781ce57e92f5ffe3cd15
Deleted: sha256:de0d569ccfdd70a621f9cde551f92aa392e67aea121a39782883985fd65b5c3c
Deleted: sha256:82b33ea4f4106b50fb898ec623577872388520885f77dca89bf8316a934256a1
Deleted: sha256:65b185b95a7e13fcf83dbbc8fb17c7fd6f42e891928d45fc06c94258be24fb6d
Deleted: sha256:1da02b1aa36140589acbb301f54e509670f832f8003f510d23e405516330ebf7
Deleted: sha256:295b5d6c01f356536aef3d69844933bd65c8c47156a327db4b780f7783d059bf
Deleted: sha256:ae640aecb53e5d6b9c8becfcc0c9db5ac44193a6804d2737aac4863d761d4334
Deleted: sha256:9e5bf4873a70d705eda359fd7ac5650435ae86a7389ca64bdd70dc61d4f9c71e
Deleted: sha256:2e2e2a3b0f8360bdcb53d824acbb415f5b6d5c55ea420243d91944e728e4b336
Deleted: sha256:fe854298f43faa2149482cfcc91fa3ebb14146b41944151e10bec840dc12c6d9
Deleted: sha256:9b2b7e3d60e2c429637589e3ef4e53b3ca603e632babe0379686755b1cc5276f
Deleted: sha256:27b57f85ee5fb86c9d57516ef6156c7a65fbb908808bd50ed923617cdb63b4a9
Deleted: sha256:1c0acbaed5057370d33e4e089ccadae5b22da7899ec7f822fb1c542f4563c86d
Deleted: sha256:175e5b2dea761c5d74d25f1b5bb8aece794a26961ebf34e817ef84a4004c7c91
Build step 'Execute shell' marked build as failure

Mime
View raw message