mesos-builds mailing list archives

Site index · List index
Message view « Date » · « Thread »
Top « Date » · « Thread »
From Apache Jenkins Server <jenk...@builds.apache.org>
Subject Build failed in Jenkins: Mesos-Buildbot » cmake,gcc,--verbose --enable-libevent --enable-ssl,GLOG_v=1 MESOS_VERBOSE=1,ubuntu:14.04,(ubuntu)&&(!ubuntu-us1)&&(!ubuntu-eu2) #3827
Date Wed, 21 Jun 2017 09:47:38 GMT
See <https://builds.apache.org/job/Mesos-Buildbot/BUILDTOOL=cmake,COMPILER=gcc,CONFIGURATION=--verbose%20--enable-libevent%20--enable-ssl,ENVIRONMENT=GLOG_v=1%20MESOS_VERBOSE=1,OS=ubuntu%3A14.04,label_exp=(ubuntu)&&(!ubuntu-us1)&&(!ubuntu-eu2)/3827/display/redirect?page=changes>

Changes:

[mpark] Prevented allocating reservation refinements to non-capable frameworks.

[mpark] Converted the resources to the "endpoint" format for V0 endpoints.

[mpark] Converted the resources to the "endpoint" format for V1 endpoints.

[mpark] Updated a `CREATE` error message mention "create" rather than "reserve".

[mpark] Placed the `convertResourceFormat` calls after resource validation.

[mpark] Added missing `RESERVATION_REFINEMENT` capability to examples and tests.

[mpark] Replaced incorrect use of `CHECK_GE`s with `CHECK_GT`.

[mpark] Fixed an error message dependent test `AgentHierarchicalRoleCapability`.

------------------------------------------
[...truncated 1.87 MB...]
NOTE: Set LIBPROCESS_SSL_REQUIRE_CERT=1 to require peer certificate verification
[       OK ] SSLTest.PeerAddress (356 ms)
[ RUN      ] SSLTest.HTTPSGet
I0621 09:47:23.788219 32707 openssl.cpp:419] CA file path is unspecified! NOTE: Set CA file
path with LIBPROCESS_SSL_CA_FILE=<filepath>
I0621 09:47:23.788234 32707 openssl.cpp:424] CA directory path unspecified! NOTE: Set CA directory
path with LIBPROCESS_SSL_CA_DIR=<dirpath>
I0621 09:47:23.788239 32707 openssl.cpp:429] Will not verify peer certificate!
NOTE: Set LIBPROCESS_SSL_VERIFY_CERT=1 to enable peer certificate verification
I0621 09:47:23.788242 32707 openssl.cpp:435] Will only verify peer certificate if presented!
NOTE: Set LIBPROCESS_SSL_REQUIRE_CERT=1 to require peer certificate verification
[       OK ] SSLTest.HTTPSGet (643 ms)
[ RUN      ] SSLTest.HTTPSPost
I0621 09:47:24.021900 32707 openssl.cpp:419] CA file path is unspecified! NOTE: Set CA file
path with LIBPROCESS_SSL_CA_FILE=<filepath>
I0621 09:47:24.021919 32707 openssl.cpp:424] CA directory path unspecified! NOTE: Set CA directory
path with LIBPROCESS_SSL_CA_DIR=<dirpath>
I0621 09:47:24.021925 32707 openssl.cpp:429] Will not verify peer certificate!
NOTE: Set LIBPROCESS_SSL_VERIFY_CERT=1 to enable peer certificate verification
I0621 09:47:24.021930 32707 openssl.cpp:435] Will only verify peer certificate if presented!
NOTE: Set LIBPROCESS_SSL_REQUIRE_CERT=1 to require peer certificate verification
[       OK ] SSLTest.HTTPSPost (231 ms)
[ RUN      ] SSLTest.SilentSocket
I0621 09:47:24.592586 32707 openssl.cpp:419] CA file path is unspecified! NOTE: Set CA file
path with LIBPROCESS_SSL_CA_FILE=<filepath>
I0621 09:47:24.592602 32707 openssl.cpp:424] CA directory path unspecified! NOTE: Set CA directory
path with LIBPROCESS_SSL_CA_DIR=<dirpath>
I0621 09:47:24.592607 32707 openssl.cpp:429] Will not verify peer certificate!
NOTE: Set LIBPROCESS_SSL_VERIFY_CERT=1 to enable peer certificate verification
I0621 09:47:24.592609 32707 openssl.cpp:435] Will only verify peer certificate if presented!
NOTE: Set LIBPROCESS_SSL_REQUIRE_CERT=1 to require peer certificate verification
I0621 09:47:24.599481 32724 libevent_ssl_socket.cpp:1170] Socket error: error:00000000:lib(0):func(0):reason(0)
[       OK ] SSLTest.SilentSocket (570 ms)
[----------] 15 tests from SSLTest (9497 ms total)

[----------] 42 tests from Scheme/HTTPTest
[ RUN      ] Scheme/HTTPTest.Endpoints/0
I0621 09:47:24.911937 32707 openssl.cpp:419] CA file path is unspecified! NOTE: Set CA file
path with LIBPROCESS_SSL_CA_FILE=<filepath>
I0621 09:47:24.911952 32707 openssl.cpp:424] CA directory path unspecified! NOTE: Set CA directory
path with LIBPROCESS_SSL_CA_DIR=<dirpath>
I0621 09:47:24.911955 32707 openssl.cpp:429] Will not verify peer certificate!
NOTE: Set LIBPROCESS_SSL_VERIFY_CERT=1 to enable peer certificate verification
I0621 09:47:24.911958 32707 openssl.cpp:435] Will only verify peer certificate if presented!
NOTE: Set LIBPROCESS_SSL_REQUIRE_CERT=1 to require peer certificate verification
E0621 09:47:24.912407 32724 process.cpp:968] Failed to accept socket: future discarded
I0621 09:47:24.923302 32707 process.cpp:1282] libprocess is initialized on 172.17.0.4:50181
with 16 worker threads
I0621 09:47:24.928983  1007 process.cpp:3779] Handling HTTP event for process '(74)' with
path: '/(74)/body'
I0621 09:47:24.935537  1011 process.cpp:3779] Handling HTTP event for process '(74)' with
path: '/(74)/pipe'
I0621 09:47:24.942399  1004 process.cpp:3779] Handling HTTP event for process '(74)' with
path: '/(74)/body'
I0621 09:47:24.943066  1004 process.cpp:3836] Failed to process request for '/(74)/body':
failure
I0621 09:47:24.943177  1000 process.cpp:1495] Returning '500 Internal Server Error' for '/(74)/body'
(failure)
[       OK ] Scheme/HTTPTest.Endpoints/0 (344 ms)
[ RUN      ] Scheme/HTTPTest.Endpoints/1
I0621 09:47:24.947280 32707 process.cpp:1282] libprocess is initialized on 172.17.0.4:56452
with 16 worker threads
I0621 09:47:24.948693  1025 process.cpp:3779] Handling HTTP event for process '(75)' with
path: '/(75)/body'
I0621 09:47:24.950922  1026 process.cpp:3779] Handling HTTP event for process '(75)' with
path: '/(75)/pipe'
I0621 09:47:24.953837  1018 process.cpp:3779] Handling HTTP event for process '(75)' with
path: '/(75)/body'
I0621 09:47:24.954488  1027 process.cpp:3836] Failed to process request for '/(75)/body':
failure
I0621 09:47:24.954514  1026 process.cpp:1495] Returning '500 Internal Server Error' for '/(75)/body'
(failure)
I0621 09:47:24.955296  1029 process.cpp:855] Decode failure: Connection reset by peer
E0621 09:47:24.955353  1029 process.cpp:2469] Failed to shutdown socket with fd 9, address
172.17.0.4:56452: Transport endpoint is not connected
[       OK ] Scheme/HTTPTest.Endpoints/1 (11 ms)
[ RUN      ] Scheme/HTTPTest.EndpointsHelp/0
I0621 09:47:25.250318 32707 openssl.cpp:419] CA file path is unspecified! NOTE: Set CA file
path with LIBPROCESS_SSL_CA_FILE=<filepath>
I0621 09:47:25.250336 32707 openssl.cpp:424] CA directory path unspecified! NOTE: Set CA directory
path with LIBPROCESS_SSL_CA_DIR=<dirpath>
I0621 09:47:25.250340 32707 openssl.cpp:429] Will not verify peer certificate!
NOTE: Set LIBPROCESS_SSL_VERIFY_CERT=1 to enable peer certificate verification
I0621 09:47:25.250345 32707 openssl.cpp:435] Will only verify peer certificate if presented!
NOTE: Set LIBPROCESS_SSL_REQUIRE_CERT=1 to require peer certificate verification
E0621 09:47:25.250957  1029 process.cpp:968] Failed to accept socket: future discarded
I0621 09:47:25.259780 32707 process.cpp:1282] libprocess is initialized on 172.17.0.4:33782
with 16 worker threads
I0621 09:47:25.266046  1034 process.cpp:3779] Handling HTTP event for process 'help' with
path: '/help'
I0621 09:47:25.274235  1037 process.cpp:3779] Handling HTTP event for process 'help' with
path: '/help'
I0621 09:47:25.281797  1033 process.cpp:3779] Handling HTTP event for process 'help' with
path: '/help/(76)/body'
I0621 09:47:25.289041  1042 process.cpp:3779] Handling HTTP event for process 'help' with
path: '/help/(76)/a/b/c'
[       OK ] Scheme/HTTPTest.EndpointsHelp/0 (337 ms)
[ RUN      ] Scheme/HTTPTest.EndpointsHelp/1
I0621 09:47:25.295902 32707 process.cpp:1282] libprocess is initialized on 172.17.0.4:40205
with 16 worker threads
I0621 09:47:25.297693  1050 process.cpp:3779] Handling HTTP event for process 'help' with
path: '/help'
I0621 09:47:25.300612  1057 process.cpp:3779] Handling HTTP event for process 'help' with
path: '/help'
I0621 09:47:25.305171  1055 process.cpp:3779] Handling HTTP event for process 'help' with
path: '/help/(77)/body'
I0621 09:47:25.309098  1047 process.cpp:3779] Handling HTTP event for process 'help' with
path: '/help/(77)/a/b/c'
[       OK ] Scheme/HTTPTest.EndpointsHelp/1 (19 ms)
[ RUN      ] Scheme/HTTPTest.EndpointsHelpRemoval/0
I0621 09:47:25.649376 32707 openssl.cpp:419] CA file path is unspecified! NOTE: Set CA file
path with LIBPROCESS_SSL_CA_FILE=<filepath>
I0621 09:47:25.649390 32707 openssl.cpp:424] CA directory path unspecified! NOTE: Set CA directory
path with LIBPROCESS_SSL_CA_DIR=<dirpath>
I0621 09:47:25.649395 32707 openssl.cpp:429] Will not verify peer certificate!
NOTE: Set LIBPROCESS_SSL_VERIFY_CERT=1 to enable peer certificate verification
I0621 09:47:25.649399 32707 openssl.cpp:435] Will only verify peer certificate if presented!
NOTE: Set LIBPROCESS_SSL_REQUIRE_CERT=1 to require peer certificate verification
E0621 09:47:25.649787  1063 process.cpp:968] Failed to accept socket: future discarded
I0621 09:47:25.652312 32707 process.cpp:1282] libprocess is initialized on 172.17.0.4:45011
with 16 worker threads
I0621 09:47:25.657966  1076 process.cpp:3779] Handling HTTP event for process 'help' with
path: '/help/(78)/body'
I0621 09:47:25.664583  1074 process.cpp:3779] Handling HTTP event for process 'help' with
path: '/help/(78)/bogus'
[       OK ] Scheme/HTTPTest.EndpointsHelpRemoval/0 (355 ms)
[ RUN      ] Scheme/HTTPTest.EndpointsHelpRemoval/1
I0621 09:47:25.669160 32707 process.cpp:1282] libprocess is initialized on 172.17.0.4:33911
with 16 worker threads
I0621 09:47:25.670639  1093 process.cpp:3779] Handling HTTP event for process 'help' with
path: '/help/(79)/body'
I0621 09:47:25.673231  1094 process.cpp:3779] Handling HTTP event for process 'help' with
path: '/help/(79)/bogus'
[       OK ] Scheme/HTTPTest.EndpointsHelpRemoval/1 (8 ms)
[ RUN      ] Scheme/HTTPTest.PipeEOF/0
I0621 09:47:26.003937 32707 openssl.cpp:419] CA file path is unspecified! NOTE: Set CA file
path with LIBPROCESS_SSL_CA_FILE=<filepath>
I0621 09:47:26.003957 32707 openssl.cpp:424] CA directory path unspecified! NOTE: Set CA directory
path with LIBPROCESS_SSL_CA_DIR=<dirpath>
I0621 09:47:26.003962 32707 openssl.cpp:429] Will not verify peer certificate!
NOTE: Set LIBPROCESS_SSL_VERIFY_CERT=1 to enable peer certificate verification
I0621 09:47:26.003964 32707 openssl.cpp:435] Will only verify peer certificate if presented!
NOTE: Set LIBPROCESS_SSL_REQUIRE_CERT=1 to require peer certificate verification
E0621 09:47:26.004498  1097 process.cpp:968] Failed to accept socket: future discarded
I0621 09:47:26.007045 32707 process.cpp:1282] libprocess is initialized on 172.17.0.4:54416
with 16 worker threads
[       OK ] Scheme/HTTPTest.PipeEOF/0 (334 ms)
[ RUN      ] Scheme/HTTPTest.PipeEOF/1
I0621 09:47:26.010877 32707 process.cpp:1282] libprocess is initialized on 172.17.0.4:37547
with 16 worker threads
[       OK ] Scheme/HTTPTest.PipeEOF/1 (3 ms)
[ RUN      ] Scheme/HTTPTest.PipeFailure/0
I0621 09:47:26.493906 32707 openssl.cpp:419] CA file path is unspecified! NOTE: Set CA file
path with LIBPROCESS_SSL_CA_FILE=<filepath>
I0621 09:47:26.493926 32707 openssl.cpp:424] CA directory path unspecified! NOTE: Set CA directory
path with LIBPROCESS_SSL_CA_DIR=<dirpath>
I0621 09:47:26.493932 32707 openssl.cpp:429] Will not verify peer certificate!
NOTE: Set LIBPROCESS_SSL_VERIFY_CERT=1 to enable peer certificate verification
I0621 09:47:26.493937 32707 openssl.cpp:435] Will only verify peer certificate if presented!
NOTE: Set LIBPROCESS_SSL_REQUIRE_CERT=1 to require peer certificate verification
E0621 09:47:26.494606  1131 process.cpp:968] Failed to accept socket: future discarded
I0621 09:47:26.496963 32707 process.cpp:1282] libprocess is initialized on 172.17.0.4:58990
with 16 worker threads
[       OK ] Scheme/HTTPTest.PipeFailure/0 (486 ms)
[ RUN      ] Scheme/HTTPTest.PipeFailure/1
I0621 09:47:26.500200 32707 process.cpp:1282] libprocess is initialized on 172.17.0.4:36494
with 16 worker threads
[       OK ] Scheme/HTTPTest.PipeFailure/1 (3 ms)
[ RUN      ] Scheme/HTTPTest.PipeReaderCloses/0
I0621 09:47:27.186879 32707 openssl.cpp:419] CA file path is unspecified! NOTE: Set CA file
path with LIBPROCESS_SSL_CA_FILE=<filepath>
I0621 09:47:27.186899 32707 openssl.cpp:424] CA directory path unspecified! NOTE: Set CA directory
path with LIBPROCESS_SSL_CA_DIR=<dirpath>
I0621 09:47:27.186906 32707 openssl.cpp:429] Will not verify peer certificate!
NOTE: Set LIBPROCESS_SSL_VERIFY_CERT=1 to enable peer certificate verification
I0621 09:47:27.186911 32707 openssl.cpp:435] Will only verify peer certificate if presented!
NOTE: Set LIBPROCESS_SSL_REQUIRE_CERT=1 to require peer certificate verification
E0621 09:47:27.187458  1165 process.cpp:968] Failed to accept socket: future discarded
I0621 09:47:27.190040 32707 process.cpp:1282] libprocess is initialized on 172.17.0.4:51931
with 16 worker threads
[       OK ] Scheme/HTTPTest.PipeReaderCloses/0 (690 ms)
[ RUN      ] Scheme/HTTPTest.PipeReaderCloses/1
I0621 09:47:27.193910 32707 process.cpp:1282] libprocess is initialized on 172.17.0.4:50005
with 16 worker threads
[       OK ] Scheme/HTTPTest.PipeReaderCloses/1 (4 ms)
[ RUN      ] Scheme/HTTPTest.Encode/0
I0621 09:47:28.135260 32707 openssl.cpp:419] CA file path is unspecified! NOTE: Set CA file
path with LIBPROCESS_SSL_CA_FILE=<filepath>
I0621 09:47:28.135274 32707 openssl.cpp:424] CA directory path unspecified! NOTE: Set CA directory
path with LIBPROCESS_SSL_CA_DIR=<dirpath>
I0621 09:47:28.135278 32707 openssl.cpp:429] Will not verify peer certificate!
NOTE: Set LIBPROCESS_SSL_VERIFY_CERT=1 to enable peer certificate verification
I0621 09:47:28.135282 32707 openssl.cpp:435] Will only verify peer certificate if presented!
NOTE: Set LIBPROCESS_SSL_REQUIRE_CERT=1 to require peer certificate verification
E0621 09:47:28.135723  1199 process.cpp:968] Failed to accept socket: future discarded
I0621 09:47:28.138224 32707 process.cpp:1282] libprocess is initialized on 172.17.0.4:42964
with 16 worker threads
[       OK ] Scheme/HTTPTest.Encode/0 (944 ms)
[ RUN      ] Scheme/HTTPTest.Encode/1
I0621 09:47:28.142045 32707 process.cpp:1282] libprocess is initialized on 172.17.0.4:39535
with 16 worker threads
[       OK ] Scheme/HTTPTest.Encode/1 (4 ms)
[ RUN      ] Scheme/HTTPTest.PathParse/0
I0621 09:47:28.786458 32707 openssl.cpp:419] CA file path is unspecified! NOTE: Set CA file
path with LIBPROCESS_SSL_CA_FILE=<filepath>
I0621 09:47:28.786473 32707 openssl.cpp:424] CA directory path unspecified! NOTE: Set CA directory
path with LIBPROCESS_SSL_CA_DIR=<dirpath>
I0621 09:47:28.786478 32707 openssl.cpp:429] Will not verify peer certificate!
NOTE: Set LIBPROCESS_SSL_VERIFY_CERT=1 to enable peer certificate verification
I0621 09:47:28.786481 32707 openssl.cpp:435] Will only verify peer certificate if presented!
NOTE: Set LIBPROCESS_SSL_REQUIRE_CERT=1 to require peer certificate verification
E0621 09:47:28.786887  1233 process.cpp:968] Failed to accept socket: future discarded
I0621 09:47:28.789315 32707 process.cpp:1282] libprocess is initialized on 172.17.0.4:46019
with 16 worker threads
[       OK ] Scheme/HTTPTest.PathParse/0 (647 ms)
[ RUN      ] Scheme/HTTPTest.PathParse/1
I0621 09:47:28.792596 32707 process.cpp:1282] libprocess is initialized on 172.17.0.4:40010
with 16 worker threads
[       OK ] Scheme/HTTPTest.PathParse/1 (3 ms)
[ RUN      ] Scheme/HTTPTest.Get/0
I0621 09:47:29.329332 32707 openssl.cpp:419] CA file path is unspecified! NOTE: Set CA file
path with LIBPROCESS_SSL_CA_FILE=<filepath>
I0621 09:47:29.329346 32707 openssl.cpp:424] CA directory path unspecified! NOTE: Set CA directory
path with LIBPROCESS_SSL_CA_DIR=<dirpath>
I0621 09:47:29.329350 32707 openssl.cpp:429] Will not verify peer certificate!
NOTE: Set LIBPROCESS_SSL_VERIFY_CERT=1 to enable peer certificate verification
I0621 09:47:29.329354 32707 openssl.cpp:435] Will only verify peer certificate if presented!
NOTE: Set LIBPROCESS_SSL_REQUIRE_CERT=1 to require peer certificate verification
E0621 09:47:29.329759  1267 process.cpp:968] Failed to accept socket: future discarded
I0621 09:47:29.332175 32707 process.cpp:1282] libprocess is initialized on 172.17.0.4:39658
with 16 worker threads
I0621 09:47:29.337965  1282 process.cpp:3779] Handling HTTP event for process '(80)' with
path: '/(80)/get'
I0621 09:47:29.344209  1269 process.cpp:3779] Handling HTTP event for process '(80)' with
path: '/(80)/get'
[       OK ] Scheme/HTTPTest.Get/0 (554 ms)
[ RUN      ] Scheme/HTTPTest.Get/1
I0621 09:47:29.348851 32707 process.cpp:1282] libprocess is initialized on 172.17.0.4:39233
with 16 worker threads
I0621 09:47:29.350257  1299 process.cpp:3779] Handling HTTP event for process '(81)' with
path: '/(81)/get'
I0621 09:47:29.352857  1299 process.cpp:3779] Handling HTTP event for process '(81)' with
path: '/(81)/get'
[       OK ] Scheme/HTTPTest.Get/1 (8 ms)
[ RUN      ] Scheme/HTTPTest.NestedGet/0
I0621 09:47:29.897411 32707 openssl.cpp:419] CA file path is unspecified! NOTE: Set CA file
path with LIBPROCESS_SSL_CA_FILE=<filepath>
I0621 09:47:29.897435 32707 openssl.cpp:424] CA directory path unspecified! NOTE: Set CA directory
path with LIBPROCESS_SSL_CA_DIR=<dirpath>
I0621 09:47:29.897440 32707 openssl.cpp:429] Will not verify peer certificate!
NOTE: Set LIBPROCESS_SSL_VERIFY_CERT=1 to enable peer certificate verification
I0621 09:47:29.897444 32707 openssl.cpp:435] Will only verify peer certificate if presented!
NOTE: Set LIBPROCESS_SSL_REQUIRE_CERT=1 to require peer certificate verification
E0621 09:47:29.898203  1301 process.cpp:968] Failed to accept socket: future discarded
I0621 09:47:29.904791 32707 process.cpp:1282] libprocess is initialized on 172.17.0.4:47565
with 16 worker threads
I0621 09:47:29.911039  1302 process.cpp:3779] Handling HTTP event for process '(82)' with
path: '/(82)//a/b/c'
I0621 09:47:29.918066  1306 process.cpp:3779] Handling HTTP event for process '(82)' with
path: '/(82)//a/b'
[       OK ] Scheme/HTTPTest.NestedGet/0 (566 ms)
[ RUN      ] Scheme/HTTPTest.NestedGet/1
*** Aborted at 1498038449 (unix time) try "date -d @1498038449" if you are using GNU date
***
PC: @     0x2ac791eb8a5e (unknown)
*** SIGSEGV (@0x65bc648) received by PID 32707 (TID 0x2ac7944bb700) from PID 106677832; stack
trace: ***
    @     0x2ac7913f0330 (unknown)
    @     0x2ac791eb8a5e (unknown)
    @     0x2ac7916b8e30 (unknown)
I0621 09:47:29.924334 32707 process.cpp:1282] libprocess is initialized on 172.17.0.4:55795
with 16 worker threads
    @     0x2ac7916b948c (unknown)
I0621 09:47:29.926399  1329 process.cpp:3779] Handling HTTP event for process '(83)' with
path: '/(83)//a/b/c'
I0621 09:47:29.928925  1325 process.cpp:3779] Handling HTTP event for process '(83)' with
path: '/(83)//a/b'
[       OK ] Scheme/HTTPTest.NestedGet/1 (10 ms)
[ RUN      ] Scheme/HTTPTest.StreamingGetComplete/0
    @           0xade491 process::UPID::UPID()
    @     0x2ac7904604a8 process::DispatchEvent::DispatchEvent()
    @     0x2ac7904581e2 process::internal::dispatch()
    @     0x2ac790477b48 process::dispatch<>()
    @     0x2ac790457198 process::ProcessBase::route()
    @     0x2ac7902e27df process::ProcessBase::route<>()
    @     0x2ac7902de487 process::Help::initialize()
    @     0x2ac790450a03 process::ProcessManager::resume()
    @     0x2ac79044ce78 _ZZN7process14ProcessManager12init_threadsEvENKUt_clEv
    @     0x2ac79045ead0 _ZNSt12_Bind_simpleIFZN7process14ProcessManager12init_threadsEvEUt_vEE9_M_invokeIIEEEvSt12_Index_tupleIIXspT_EEE
    @     0x2ac79045ea27 _ZNSt12_Bind_simpleIFZN7process14ProcessManager12init_threadsEvEUt_vEEclEv
    @     0x2ac79045e9c0 _ZNSt6thread5_ImplISt12_Bind_simpleIFZN7process14ProcessManager12init_threadsEvEUt_vEEE6_M_runEv
    @     0x2ac7916afa60 (unknown)
    @     0x2ac7913e8184 start_thread
    @     0x2ac791f1bffd (unknown)
make[3]: *** [CMakeFiles/check] Segmentation fault
make[3]: Leaving directory `/mesos/build'
make[2]: *** [CMakeFiles/check.dir/all] Error 2
make[2]: Leaving directory `/mesos/build'
make[1]: *** [CMakeFiles/check.dir/rule] Error 2
make[1]: Leaving directory `/mesos/build'
make: *** [check] Error 2
+ docker rmi mesos-1498035363-18821
Untagged: mesos-1498035363-18821:latest
Deleted: sha256:e6f9e9849443b2228205fdebda60d4c4890d99876619c854670a8a70a2f04a85
Deleted: sha256:e6a2558f9c3933c6104c59b24830f7239fd983f139f3ac65665eedecc17d0a35
Deleted: sha256:4697034a1afa1b9495ac1804dc8db4e4e442965d2176e13733d89af9b581e92d
Deleted: sha256:0e8d4fb2ef9e886a544a03786ea167b3cfe65605a913ada4efcf366c36a01e06
Deleted: sha256:525d2b1a32dfe2d28303a9ebcf12cd58009b57ea238d3e47e82511eb78192d8a
Deleted: sha256:52532325c4c7e01d883727893e8a07780086ada403776fd91b0eac324ec9901b
Deleted: sha256:1ae1b8b28f7a674fd288af74300c62506f43644868b32426b0903f51832c9125
Deleted: sha256:a3a445300553effd34931bb3b46c6539dd6c7a258b6d77d3fdbb9e31af29aca3
Deleted: sha256:ea0d1f8a689d1c948b00483e35d2b037bc635d8ee9d1c54896a1cf7a04544f63
Deleted: sha256:7a329453cbfa56a46db4ae6d7b14a0a3e94e087eb51272ec568680408632f082
Deleted: sha256:640a4176bc01db4fe89c76a89879e961b62362be24a620b895a3178d5838319f
Deleted: sha256:c098ca3c0fb14fe3329d96c9ddb75585bea84d734e7ce55820afe1b5da0929d1
Deleted: sha256:06e57d507aabe3de110439f07a2bf407721a1b0f71182dc12bf5d75b1faa9eca
Deleted: sha256:663391a51e8dce1294fde8ab8e9032bc98046b0391dc7bb9ab380feb9d38418b
Deleted: sha256:dd508750cca5e77929d2b62604e5998ee2794de3c25613eb846617ba0a32657e
Deleted: sha256:f31582d4a3732f1542cac8a99426ed7896f56e254eeb3e1da9c9ebec71235aab
Deleted: sha256:cc698d2562a14a03ca7ddeadbabec1cbfc4a0f9fb52993abb928b54cc44ec33a
Deleted: sha256:5f22472dc098a77908cf1b9f81115d09c9b4a29fbb537c8ae2db4a38508cef0f
Deleted: sha256:2b13505ec5af9f4e47c1c5b5bb9baa75a437eb5b5756751ec0db77e81d5de84f
Deleted: sha256:24ac58aec683d1c42c7c4e4d210fbc82687978010eb4f0198a570ccd3a48b25d
Deleted: sha256:56e23a8eb41b97eaac5acf6a71b9089ffba37644ece4b1c870ce357c8638c326
Deleted: sha256:8fd3a605dc39857ae24a1feaf1334d40b65f4cf32cd21b533641fd735c84a68d
Deleted: sha256:13e05973963e08b040dae077d581c0eedbc71ba6ce69b6883f10a51606c3285b
Deleted: sha256:b492a5dcd0ba41b7610524ed8d1df314f93128f898126515072c634c5e183db2
Build step 'Execute shell' marked build as failure

Mime
View raw message