mesos-builds mailing list archives

Site index · List index
Message view « Date » · « Thread »
Top « Date » · « Thread »
From Apache Jenkins Server <jenk...@builds.apache.org>
Subject Build failed in Jenkins: Mesos-Buildbot » autotools,gcc,--verbose --enable-libevent --enable-ssl,GLOG_v=1 MESOS_VERBOSE=1,ubuntu:14.04,(ubuntu)&&(!ubuntu-us1)&&(!ubuntu-eu2) #3794
Date Wed, 14 Jun 2017 05:04:26 GMT
See <https://builds.apache.org/job/Mesos-Buildbot/BUILDTOOL=autotools,COMPILER=gcc,CONFIGURATION=--verbose%20--enable-libevent%20--enable-ssl,ENVIRONMENT=GLOG_v=1%20MESOS_VERBOSE=1,OS=ubuntu%3A14.04,label_exp=(ubuntu)&&(!ubuntu-us1)&&(!ubuntu-eu2)/3794/display/redirect?page=changes>

Changes:

[mpark] Added support for printing JSON values via `jsonify`.

------------------------------------------
[...truncated 29.55 MB...]
I0614 05:04:20.570312 28617 slave.cpp:6323] Received oversubscribable resources {} from the
resource estimator
I0614 05:04:20.574864 28631 process.cpp:3778] Handling HTTP event for process 'slave(767)'
with path: '/slave(767)/containers'
I0614 05:04:20.577797 28631 http.cpp:1115] HTTP GET for /slave(767)/containers from 172.17.0.5:50740
I0614 05:04:20.577889 28631 http.cpp:936] Authorizing principal 'test-principal' to GET the
'/containers' endpoint
I0614 05:04:20.584760 28611 slave.cpp:817] Agent terminating
[       OK ] Endpoint/SlaveEndpointTest.AuthorizedRequest/2 (59 ms)
[ RUN      ] Endpoint/SlaveEndpointTest.UnauthorizedRequest/0
I0614 05:04:20.606459  7811 containerizer.cpp:230] Using isolation: posix/cpu,posix/mem,filesystem/posix,network/cni,environment_secret
W0614 05:04:20.607472  7811 backend.cpp:76] Failed to create 'aufs' backend: AufsBackend requires
root privileges
W0614 05:04:20.607704  7811 backend.cpp:76] Failed to create 'bind' backend: BindBackend requires
root privileges
I0614 05:04:20.607949  7811 provisioner.cpp:255] Using default backend 'copy'
I0614 05:04:20.612720 28613 slave.cpp:248] Mesos agent started on (768)@172.17.0.5:33535
I0614 05:04:20.613098 28613 slave.cpp:249] Flags at startup: --acls="" --appc_simple_discovery_uri_prefix="http://"
--appc_store_dir="/tmp/Endpoint_SlaveEndpointTest_UnauthorizedRequest_0_GVv3mB/store/appc"
--authenticate_http_executors="true" --authenticate_http_readonly="true" --authenticate_http_readwrite="true"
--authenticatee="crammd5" --authentication_backoff_factor="1secs" --authorizer="local" --cgroups_cpu_enable_pids_and_tids_count="false"
--cgroups_enable_cfs="false" --cgroups_hierarchy="/sys/fs/cgroup" --cgroups_limit_swap="false"
--cgroups_root="mesos" --container_disk_watch_interval="15secs" --containerizers="mesos" --credential="/tmp/Endpoint_SlaveEndpointTest_UnauthorizedRequest_0_GVv3mB/credential"
--default_role="*" --disk_watch_interval="1mins" --docker="docker" --docker_kill_orphans="true"
--docker_registry="https://registry-1.docker.io" --docker_remove_delay="6hrs" --docker_socket="/var/run/docker.sock"
--docker_stop_timeout="0ns" --docker_store_dir="/tmp/Endpoint_SlaveEndpointTest_UnauthorizedRequest_0_GVv3mB/store/docker"
--docker_volume_checkpoint_dir="/var/run/mesos/isolators/docker/volume" --enforce_container_disk_quota="false"
--executor_registration_timeout="1mins" --executor_reregistration_timeout="2secs" --executor_secret_key="/tmp/Endpoint_SlaveEndpointTest_UnauthorizedRequest_0_GVv3mB/executor_secret_key"
--executor_shutdown_grace_period="5secs" --fetcher_cache_dir="/tmp/Endpoint_SlaveEndpointTest_UnauthorizedRequest_0_GVv3mB/fetch"
--fetcher_cache_size="2GB" --frameworks_home="" --gc_delay="1weeks" --gc_disk_headroom="0.1"
--hadoop_home="" --help="false" --hostname_lookup="true" --http_command_executor="false" --http_credentials="/tmp/Endpoint_SlaveEndpointTest_UnauthorizedRequest_0_GVv3mB/http_credentials"
--http_heartbeat_interval="30secs" --initialize_driver_logging="true" --isolation="posix/cpu,posix/mem"
--launcher="posix" --launcher_dir="/mesos/mesos-1.4.0/_build/src" --logbufsecs="0" --logging_level="INFO"
--max_completed_executors_per_framework="150" --oversubscribed_resources_interval="15secs"
--perf_duration="10secs" --perf_interval="1mins" --port="5051" --qos_correction_interval_min="0ns"
--quiet="false" --recover="reconnect" --recovery_timeout="15mins" --registration_backoff_factor="10ms"
--resources="cpus:2;gpus:0;mem:1024;disk:1024;ports:[31000-32000]" --revocable_cpu_low_priority="true"
--runtime_dir="/tmp/Endpoint_SlaveEndpointTest_UnauthorizedRequest_0_GVv3mB" --sandbox_directory="/mnt/mesos/sandbox"
--strict="true" --switch_user="true" --systemd_enable_support="true" --systemd_runtime_directory="/run/systemd/system"
--version="false" --work_dir="/tmp/Endpoint_SlaveEndpointTest_UnauthorizedRequest_0_3oNGeE"
I0614 05:04:20.613930 28613 credentials.hpp:86] Loading credential for authentication from
'/tmp/Endpoint_SlaveEndpointTest_UnauthorizedRequest_0_GVv3mB/credential'
I0614 05:04:20.614212 28613 slave.cpp:281] Agent using credential for: test-principal
I0614 05:04:20.614403 28613 credentials.hpp:37] Loading credentials for authentication from
'/tmp/Endpoint_SlaveEndpointTest_UnauthorizedRequest_0_GVv3mB/http_credentials'
I0614 05:04:20.614853 28613 http.cpp:975] Creating default 'basic' HTTP authenticator for
realm 'mesos-agent-executor'
I0614 05:04:20.615166 28613 http.cpp:996] Creating default 'jwt' HTTP authenticator for realm
'mesos-agent-executor'
I0614 05:04:20.615512 28613 http.cpp:975] Creating default 'basic' HTTP authenticator for
realm 'mesos-agent-readonly'
I0614 05:04:20.615743 28613 http.cpp:996] Creating default 'jwt' HTTP authenticator for realm
'mesos-agent-readonly'
I0614 05:04:20.616040 28613 http.cpp:975] Creating default 'basic' HTTP authenticator for
realm 'mesos-agent-readwrite'
I0614 05:04:20.616278 28613 http.cpp:996] Creating default 'jwt' HTTP authenticator for realm
'mesos-agent-readwrite'
I0614 05:04:20.618063 28613 slave.cpp:552] Agent resources: cpus(*):2; mem(*):1024; disk(*):1024;
ports(*):[31000-32000]
I0614 05:04:20.618171 28613 slave.cpp:560] Agent attributes: [  ]
I0614 05:04:20.618190 28613 slave.cpp:565] Agent hostname: 2fb588184b40
I0614 05:04:20.618484 28630 status_update_manager.cpp:177] Pausing sending status updates
I0614 05:04:20.620846 28613 state.cpp:62] Recovering state from '/tmp/Endpoint_SlaveEndpointTest_UnauthorizedRequest_0_3oNGeE/meta'
I0614 05:04:20.621446 28613 status_update_manager.cpp:203] Recovering status update manager
I0614 05:04:20.621665 28613 containerizer.cpp:582] Recovering containerizer
I0614 05:04:20.623864 28612 provisioner.cpp:416] Provisioner recovery complete
I0614 05:04:20.624287 28624 slave.cpp:6127] Finished recovery
I0614 05:04:20.625226 28624 slave.cpp:6309] Querying resource estimator for oversubscribable
resources
I0614 05:04:20.625526 28612 slave.cpp:6323] Received oversubscribable resources {} from the
resource estimator
I0614 05:04:20.629328 28625 process.cpp:3778] Handling HTTP event for process 'slave(768)'
with path: '/slave(768)/monitor/statistics'
I0614 05:04:20.631739 28611 http.cpp:1115] HTTP GET for /slave(768)/monitor/statistics from
172.17.0.5:50742
I0614 05:04:20.631839 28611 http.cpp:936] Authorizing principal 'test-principal' to GET the
'/monitor/statistics' endpoint
I0614 05:04:20.635289 28623 slave.cpp:817] Agent terminating
[       OK ] Endpoint/SlaveEndpointTest.UnauthorizedRequest/0 (43 ms)
[ RUN      ] Endpoint/SlaveEndpointTest.UnauthorizedRequest/1
I0614 05:04:20.647858  7811 containerizer.cpp:230] Using isolation: posix/cpu,posix/mem,filesystem/posix,network/cni,environment_secret
W0614 05:04:20.648401  7811 backend.cpp:76] Failed to create 'aufs' backend: AufsBackend requires
root privileges
W0614 05:04:20.648514  7811 backend.cpp:76] Failed to create 'bind' backend: BindBackend requires
root privileges
I0614 05:04:20.648548  7811 provisioner.cpp:255] Using default backend 'copy'
I0614 05:04:20.652035 28617 slave.cpp:248] Mesos agent started on (769)@172.17.0.5:33535
I0614 05:04:20.652066 28617 slave.cpp:249] Flags at startup: --acls="" --appc_simple_discovery_uri_prefix="http://"
--appc_store_dir="/tmp/Endpoint_SlaveEndpointTest_UnauthorizedRequest_1_SrGvgq/store/appc"
--authenticate_http_executors="true" --authenticate_http_readonly="true" --authenticate_http_readwrite="true"
--authenticatee="crammd5" --authentication_backoff_factor="1secs" --authorizer="local" --cgroups_cpu_enable_pids_and_tids_count="false"
--cgroups_enable_cfs="false" --cgroups_hierarchy="/sys/fs/cgroup" --cgroups_limit_swap="false"
--cgroups_root="mesos" --container_disk_watch_interval="15secs" --containerizers="mesos" --credential="/tmp/Endpoint_SlaveEndpointTest_UnauthorizedRequest_1_SrGvgq/credential"
--default_role="*" --disk_watch_interval="1mins" --docker="docker" --docker_kill_orphans="true"
--docker_registry="https://registry-1.docker.io" --docker_remove_delay="6hrs" --docker_socket="/var/run/docker.sock"
--docker_stop_timeout="0ns" --docker_store_dir="/tmp/Endpoint_SlaveEndpointTest_UnauthorizedRequest_1_SrGvgq/store/docker"
--docker_volume_checkpoint_dir="/var/run/mesos/isolators/docker/volume" --enforce_container_disk_quota="false"
--executor_registration_timeout="1mins" --executor_reregistration_timeout="2secs" --executor_secret_key="/tmp/Endpoint_SlaveEndpointTest_UnauthorizedRequest_1_SrGvgq/executor_secret_key"
--executor_shutdown_grace_period="5secs" --fetcher_cache_dir="/tmp/Endpoint_SlaveEndpointTest_UnauthorizedRequest_1_SrGvgq/fetch"
--fetcher_cache_size="2GB" --frameworks_home="" --gc_delay="1weeks" --gc_disk_headroom="0.1"
--hadoop_home="" --help="false" --hostname_lookup="true" --http_command_executor="false" --http_credentials="/tmp/Endpoint_SlaveEndpointTest_UnauthorizedRequest_1_SrGvgq/http_credentials"
--http_heartbeat_interval="30secs" --initialize_driver_logging="true" --isolation="posix/cpu,posix/mem"
--launcher="posix" --launcher_dir="/mesos/mesos-1.4.0/_build/src" --logbufsecs="0" --logging_level="INFO"
--max_completed_executors_per_framework="150" --oversubscribed_resources_interval="15secs"
--perf_duration="10secs" --perf_interval="1mins" --port="5051" --qos_correction_interval_min="0ns"
--quiet="false" --recover="reconnect" --recovery_timeout="15mins" --registration_backoff_factor="10ms"
--resources="cpus:2;gpus:0;mem:1024;disk:1024;ports:[31000-32000]" --revocable_cpu_low_priority="true"
--runtime_dir="/tmp/Endpoint_SlaveEndpointTest_UnauthorizedRequest_1_SrGvgq" --sandbox_directory="/mnt/mesos/sandbox"
--strict="true" --switch_user="true" --systemd_enable_support="true" --systemd_runtime_directory="/run/systemd/system"
--version="false" --work_dir="/tmp/Endpoint_SlaveEndpointTest_UnauthorizedRequest_1_943M1s"
I0614 05:04:20.652542 28617 credentials.hpp:86] Loading credential for authentication from
'/tmp/Endpoint_SlaveEndpointTest_UnauthorizedRequest_1_SrGvgq/credential'
I0614 05:04:20.652776 28617 slave.cpp:281] Agent using credential for: test-principal
I0614 05:04:20.652798 28617 credentials.hpp:37] Loading credentials for authentication from
'/tmp/Endpoint_SlaveEndpointTest_UnauthorizedRequest_1_SrGvgq/http_credentials'
I0614 05:04:20.653095 28617 http.cpp:975] Creating default 'basic' HTTP authenticator for
realm 'mesos-agent-executor'
I0614 05:04:20.653252 28617 http.cpp:996] Creating default 'jwt' HTTP authenticator for realm
'mesos-agent-executor'
I0614 05:04:20.653580 28617 http.cpp:975] Creating default 'basic' HTTP authenticator for
realm 'mesos-agent-readonly'
I0614 05:04:20.653703 28617 http.cpp:996] Creating default 'jwt' HTTP authenticator for realm
'mesos-agent-readonly'
I0614 05:04:20.653918 28617 http.cpp:975] Creating default 'basic' HTTP authenticator for
realm 'mesos-agent-readwrite'
I0614 05:04:20.654016 28617 http.cpp:996] Creating default 'jwt' HTTP authenticator for realm
'mesos-agent-readwrite'
I0614 05:04:20.655478 28617 slave.cpp:552] Agent resources: cpus(*):2; mem(*):1024; disk(*):1024;
ports(*):[31000-32000]
I0614 05:04:20.655550 28617 slave.cpp:560] Agent attributes: [  ]
I0614 05:04:20.655563 28617 slave.cpp:565] Agent hostname: 2fb588184b40
I0614 05:04:20.655717 28613 status_update_manager.cpp:177] Pausing sending status updates
I0614 05:04:20.657109 28627 state.cpp:62] Recovering state from '/tmp/Endpoint_SlaveEndpointTest_UnauthorizedRequest_1_943M1s/meta'
I0614 05:04:20.657475 28623 status_update_manager.cpp:203] Recovering status update manager
I0614 05:04:20.657775 28612 containerizer.cpp:582] Recovering containerizer
I0614 05:04:20.659281 28616 provisioner.cpp:416] Provisioner recovery complete
I0614 05:04:20.659701 28609 slave.cpp:6127] Finished recovery
I0614 05:04:20.660188 28609 slave.cpp:6309] Querying resource estimator for oversubscribable
resources
I0614 05:04:20.660446 28624 slave.cpp:6323] Received oversubscribable resources {} from the
resource estimator
I0614 05:04:20.662629 28625 process.cpp:3778] Handling HTTP event for process 'slave(769)'
with path: '/slave(769)/monitor/statistics.json'
I0614 05:04:20.664356 28618 http.cpp:1115] HTTP GET for /slave(769)/monitor/statistics.json
from 172.17.0.5:50744
I0614 05:04:20.664438 28618 http.cpp:936] Authorizing principal 'test-principal' to GET the
'/monitor/statistics.json' endpoint
I0614 05:04:20.666435 28617 slave.cpp:817] Agent terminating
[       OK ] Endpoint/SlaveEndpointTest.UnauthorizedRequest/1 (29 ms)
[ RUN      ] Endpoint/SlaveEndpointTest.UnauthorizedRequest/2
I0614 05:04:20.675406  7811 containerizer.cpp:230] Using isolation: posix/cpu,posix/mem,filesystem/posix,network/cni,environment_secret
W0614 05:04:20.675848  7811 backend.cpp:76] Failed to create 'aufs' backend: AufsBackend requires
root privileges
W0614 05:04:20.675940  7811 backend.cpp:76] Failed to create 'bind' backend: BindBackend requires
root privileges
I0614 05:04:20.675974  7811 provisioner.cpp:255] Using default backend 'copy'
I0614 05:04:20.678506 28611 slave.cpp:248] Mesos agent started on (770)@172.17.0.5:33535
I0614 05:04:20.678532 28611 slave.cpp:249] Flags at startup: --acls="" --appc_simple_discovery_uri_prefix="http://"
--appc_store_dir="/tmp/Endpoint_SlaveEndpointTest_UnauthorizedRequest_2_JV7Prf/store/appc"
--authenticate_http_executors="true" --authenticate_http_readonly="true" --authenticate_http_readwrite="true"
--authenticatee="crammd5" --authentication_backoff_factor="1secs" --authorizer="local" --cgroups_cpu_enable_pids_and_tids_count="false"
--cgroups_enable_cfs="false" --cgroups_hierarchy="/sys/fs/cgroup" --cgroups_limit_swap="false"
--cgroups_root="mesos" --container_disk_watch_interval="15secs" --containerizers="mesos" --credential="/tmp/Endpoint_SlaveEndpointTest_UnauthorizedRequest_2_JV7Prf/credential"
--default_role="*" --disk_watch_interval="1mins" --docker="docker" --docker_kill_orphans="true"
--docker_registry="https://registry-1.docker.io" --docker_remove_delay="6hrs" --docker_socket="/var/run/docker.sock"
--docker_stop_timeout="0ns" --docker_store_dir="/tmp/Endpoint_SlaveEndpointTest_UnauthorizedRequest_2_JV7Prf/store/docker"
--docker_volume_checkpoint_dir="/var/run/mesos/isolators/docker/volume" --enforce_container_disk_quota="false"
--executor_registration_timeout="1mins" --executor_reregistration_timeout="2secs" --executor_secret_key="/tmp/Endpoint_SlaveEndpointTest_UnauthorizedRequest_2_JV7Prf/executor_secret_key"
--executor_shutdown_grace_period="5secs" --fetcher_cache_dir="/tmp/Endpoint_SlaveEndpointTest_UnauthorizedRequest_2_JV7Prf/fetch"
--fetcher_cache_size="2GB" --frameworks_home="" --gc_delay="1weeks" --gc_disk_headroom="0.1"
--hadoop_home="" --help="false" --hostname_lookup="true" --http_command_executor="false" --http_credentials="/tmp/Endpoint_SlaveEndpointTest_UnauthorizedRequest_2_JV7Prf/http_credentials"
--http_heartbeat_interval="30secs" --initialize_driver_logging="true" --isolation="posix/cpu,posix/mem"
--launcher="posix" --launcher_dir="/mesos/mesos-1.4.0/_build/src" --logbufsecs="0" --logging_level="INFO"
--max_completed_executors_per_framework="150" --oversubscribed_resources_interval="15secs"
--perf_duration="10secs" --perf_interval="1mins" --port="5051" --qos_correction_interval_min="0ns"
--quiet="false" --recover="reconnect" --recovery_timeout="15mins" --registration_backoff_factor="10ms"
--resources="cpus:2;gpus:0;mem:1024;disk:1024;ports:[31000-32000]" --revocable_cpu_low_priority="true"
--runtime_dir="/tmp/Endpoint_SlaveEndpointTest_UnauthorizedRequest_2_JV7Prf" --sandbox_directory="/mnt/mesos/sandbox"
--strict="true" --switch_user="true" --systemd_enable_support="true" --systemd_runtime_directory="/run/systemd/system"
--version="false" --work_dir="/tmp/Endpoint_SlaveEndpointTest_UnauthorizedRequest_2_dhSW8h"
I0614 05:04:20.678915 28611 credentials.hpp:86] Loading credential for authentication from
'/tmp/Endpoint_SlaveEndpointTest_UnauthorizedRequest_2_JV7Prf/credential'
I0614 05:04:20.679090 28611 slave.cpp:281] Agent using credential for: test-principal
I0614 05:04:20.679111 28611 credentials.hpp:37] Loading credentials for authentication from
'/tmp/Endpoint_SlaveEndpointTest_UnauthorizedRequest_2_JV7Prf/http_credentials'
I0614 05:04:20.679384 28611 http.cpp:975] Creating default 'basic' HTTP authenticator for
realm 'mesos-agent-executor'
I0614 05:04:20.679492 28611 http.cpp:996] Creating default 'jwt' HTTP authenticator for realm
'mesos-agent-executor'
I0614 05:04:20.679693 28611 http.cpp:975] Creating default 'basic' HTTP authenticator for
realm 'mesos-agent-readonly'
I0614 05:04:20.679798 28611 http.cpp:996] Creating default 'jwt' HTTP authenticator for realm
'mesos-agent-readonly'
I0614 05:04:20.680039 28611 http.cpp:975] Creating default 'basic' HTTP authenticator for
realm 'mesos-agent-readwrite'
I0614 05:04:20.680130 28611 http.cpp:996] Creating default 'jwt' HTTP authenticator for realm
'mesos-agent-readwrite'
I0614 05:04:20.681360 28611 slave.cpp:552] Agent resources: cpus(*):2; mem(*):1024; disk(*):1024;
ports(*):[31000-32000]
I0614 05:04:20.681424 28611 slave.cpp:560] Agent attributes: [  ]
I0614 05:04:20.681435 28611 slave.cpp:565] Agent hostname: 2fb588184b40
I0614 05:04:20.681550 28628 status_update_manager.cpp:177] Pausing sending status updates
I0614 05:04:20.682809 28632 state.cpp:62] Recovering state from '/tmp/Endpoint_SlaveEndpointTest_UnauthorizedRequest_2_dhSW8h/meta'
I0614 05:04:20.683275 28626 status_update_manager.cpp:203] Recovering status update manager
I0614 05:04:20.683687 28609 containerizer.cpp:582] Recovering containerizer
I0614 05:04:20.685257 28611 provisioner.cpp:416] Provisioner recovery complete
I0614 05:04:20.685685 28621 slave.cpp:6127] Finished recovery
I0614 05:04:20.686408 28621 slave.cpp:6309] Querying resource estimator for oversubscribable
resources
I0614 05:04:20.686679 28615 slave.cpp:6323] Received oversubscribable resources {} from the
resource estimator
I0614 05:04:20.688235 28624 process.cpp:3778] Handling HTTP event for process 'slave(770)'
with path: '/slave(770)/containers'
I0614 05:04:20.689893 28614 http.cpp:1115] HTTP GET for /slave(770)/containers from 172.17.0.5:50746
I0614 05:04:20.690001 28614 http.cpp:936] Authorizing principal 'test-principal' to GET the
'/containers' endpoint
I0614 05:04:20.692693 28628 slave.cpp:817] Agent terminating
[       OK ] Endpoint/SlaveEndpointTest.UnauthorizedRequest/2 (26 ms)
[ RUN      ] Endpoint/SlaveEndpointTest.NoAuthorizer/0
I0614 05:04:20.701642  7811 containerizer.cpp:230] Using isolation: posix/cpu,posix/mem,filesystem/posix,network/cni,environment_secret
W0614 05:04:20.702085  7811 backend.cpp:76] Failed to create 'aufs' backend: AufsBackend requires
root privileges
W0614 05:04:20.702179  7811 backend.cpp:76] Failed to create 'bind' backend: BindBackend requires
root privileges
I0614 05:04:20.702219  7811 provisioner.cpp:255] Using default backend 'copy'
I0614 05:04:20.703786  7811 cluster.cpp:448] Creating default 'local' authorizer
I0614 05:04:20.705101 28626 slave.cpp:248] Mesos agent started on (771)@172.17.0.5:33535
I0614 05:04:20.705149 28626 slave.cpp:249] Flags at startup: --acls="" --appc_simple_discovery_uri_prefix="http://"
--appc_store_dir="/tmp/Endpoint_SlaveEndpointTest_NoAuthorizer_0_FBSvM3/store/appc" --authenticate_http_executors="true"
--authenticate_http_readonly="true" --authenticate_http_readwrite="true" --authenticatee="crammd5"
--authentication_backoff_factor="1secs" --authorizer="local" --cgroups_cpu_enable_pids_and_tids_count="false"
--cgroups_enable_cfs="false" --cgroups_hierarchy="/sys/fs/cgroup" --cgroups_limit_swap="false"
--cgroups_root="mesos" --container_disk_watch_interval="15secs" --containerizers="mesos" --credential="/tmp/Endpoint_SlaveEndpointTest_NoAuthorizer_0_FBSvM3/credential"
--default_role="*" --disk_watch_interval="1mins" --docker="docker" --docker_kill_orphans="true"
--docker_registry="https://registry-1.docker.io" --docker_remove_delay="6hrs" --docker_socket="/var/run/docker.sock"
--docker_stop_timeout="0ns" --docker_store_dir="/tmp/Endpoint_SlaveEndpointTest_NoAuthorizer_0_FBSvM3/store/docker"
--docker_volume_checkpoint_dir="/var/run/mesos/isolators/docker/volume" --enforce_container_disk_quota="false"
--executor_registration_timeout="1mins" --executor_reregistration_timeout="2secs" --executor_secret_key="/tmp/Endpoint_SlaveEndpointTest_NoAuthorizer_0_FBSvM3/executor_secret_key"
--executor_shutdown_grace_period="5secs" --fetcher_cache_dir="/tmp/Endpoint_SlaveEndpointTest_NoAuthorizer_0_FBSvM3/fetch"
--fetcher_cache_size="2GB" --frameworks_home="" --gc_delay="1weeks" --gc_disk_headroom="0.1"
--hadoop_home="" --help="false" --hostname_lookup="true" --http_command_executor="false" --http_credentials="/tmp/Endpoint_SlaveEndpointTest_NoAuthorizer_0_FBSvM3/http_credentials"
--http_heartbeat_interval="30secs" --initialize_driver_logging="true" --isolation="posix/cpu,posix/mem"
--launcher="posix" --launcher_dir="/mesos/mesos-1.4.0/_build/src" --logbufsecs="0" --logging_level="INFO"
--max_completed_executors_per_framework="150" --oversubscribed_resources_interval="15secs"
--perf_duration="10secs" --perf_interval="1mins" --port="5051" --qos_correction_interval_min="0ns"
--quiet="false" --recover="reconnect" --recovery_timeout="15mins" --registration_backoff_factor="10ms"
--resources="cpus:2;gpus:0;mem:1024;disk:1024;ports:[31000-32000]" --revocable_cpu_low_priority="true"
--runtime_dir="/tmp/Endpoint_SlaveEndpointTest_NoAuthorizer_0_FBSvM3" --sandbox_directory="/mnt/mesos/sandbox"
--strict="true" --switch_user="true" --systemd_enable_support="true" --systemd_runtime_directory="/run/systemd/system"
--version="false" --work_dir="/tmp/Endpoint_SlaveEndpointTest_NoAuthorizer_0_scPKp6"
I0614 05:04:20.705678 28626 credentials.hpp:86] Loading credential for authentication from
'/tmp/Endpoint_SlaveEndpointTest_NoAuthorizer_0_FBSvM3/credential'
I0614 05:04:20.705983 28626 slave.cpp:281] Agent using credential for: test-principal
I0614 05:04:20.706007 28626 credentials.hpp:37] Loading credentials for authentication from
'/tmp/Endpoint_SlaveEndpointTest_NoAuthorizer_0_FBSvM3/http_credentials'
I0614 05:04:20.706360 28626 http.cpp:975] Creating default 'basic' HTTP authenticator for
realm 'mesos-agent-executor'
I0614 05:04:20.706555 28626 http.cpp:996] Creating default 'jwt' HTTP authenticator for realm
'mesos-agent-executor'
I0614 05:04:20.706980 28626 http.cpp:975] Creating default 'basic' HTTP authenticator for
realm 'mesos-agent-readonly'
I0614 05:04:20.707087 28626 http.cpp:996] Creating default 'jwt' HTTP authenticator for realm
'mesos-agent-readonly'
I0614 05:04:20.707320 28626 http.cpp:975] Creating default 'basic' HTTP authenticator for
realm 'mesos-agent-readwrite'
I0614 05:04:20.707420 28626 http.cpp:996] Creating default 'jwt' HTTP authenticator for realm
'mesos-agent-readwrite'
I0614 05:04:20.708708 28626 slave.cpp:552] Agent resources: cpus(*):2; mem(*):1024; disk(*):1024;
ports(*):[31000-32000]
I0614 05:04:20.708776 28626 slave.cpp:560] Agent attributes: [  ]
I0614 05:04:20.708789 28626 slave.cpp:565] Agent hostname: 2fb588184b40
I0614 05:04:20.708930 28625 status_update_manager.cpp:177] Pausing sending status updates
I0614 05:04:20.710503 28614 state.cpp:62] Recovering state from '/tmp/Endpoint_SlaveEndpointTest_NoAuthorizer_0_scPKp6/meta'
I0614 05:04:20.710913 28615 status_update_manager.cpp:203] Recovering status update manager
I0614 05:04:20.711165 28621 containerizer.cpp:582] Recovering containerizer
I0614 05:04:20.712959 28622 provisioner.cpp:416] Provisioner recovery complete
I0614 05:04:20.713335 28611 slave.cpp:6127] Finished recovery
I0614 05:04:20.713735 28611 slave.cpp:6309] Querying resource estimator for oversubscribable
resources
I0614 05:04:20.713985 28625 slave.cpp:6323] Received oversubscribable resources {} from the
resource estimator
I0614 05:04:20.715499 28610 process.cpp:3778] Handling HTTP event for process 'slave(771)'
with path: '/slave(771)/monitor/statistics'
I0614 05:04:20.717209 28631 http.cpp:1115] HTTP GET for /slave(771)/monitor/statistics from
172.17.0.5:50748
I0614 05:04:20.717296 28631 http.cpp:936] Authorizing principal 'test-principal' to GET the
'/monitor/statistics' endpoint
I0614 05:04:20.720592 28612 slave.cpp:817] Agent terminating
[       OK ] Endpoint/SlaveEndpointTest.NoAuthorizer/0 (31 ms)
[ RUN      ] Endpoint/SlaveEndpointTest.NoAuthorizer/1
I0614 05:04:20.735579  7811 containerizer.cpp:230] Using isolation: posix/cpu,posix/mem,filesystem/posix,network/cni,environment_secret
W0614 05:04:20.736681  7811 backend.cpp:76] Failed to create 'aufs' backend: AufsBackend requires
root privileges
W0614 05:04:20.737001  7811 backend.cpp:76] Failed to create 'bind' backend: BindBackend requires
root privileges
I0614 05:04:20.737184  7811 provisioner.cpp:255] Using default backend 'copy'
I0614 05:04:20.739441  7811 cluster.cpp:448] Creating default 'local' authorizer
I0614 05:04:20.742028 28625 slave.cpp:248] Mesos agent started on (772)@172.17.0.5:33535
I0614 05:04:20.742293 28625 slave.cpp:249] Flags at startup: --acls="" --appc_simple_discovery_uri_prefix="http://"
--appc_store_dir="/tmp/Endpoint_SlaveEndpointTest_NoAuthorizer_1_n4BNvT/store/appc" --authenticate_http_executors="true"
--authenticate_http_readonly="true" --authenticate_http_readwrite="true" --authenticatee="crammd5"
--authentication_backoff_factor="1secs" --authorizer="local" --cgroups_cpu_enable_pids_and_tids_count="false"
--cgroups_enable_cfs="false" --cgroups_hierarchy="/sys/fs/cgroup" --cgroups_limit_swap="false"
--cgroups_root="mesos" --container_disk_watch_interval="15secs" --containerizers="mesos" --credential="/tmp/Endpoint_SlaveEndpointTest_NoAuthorizer_1_n4BNvT/credential"
--default_role="*" --disk_watch_interval="1mins" --docker="docker" --docker_kill_orphans="true"
--docker_registry="https://registry-1.docker.io" --docker_remove_delay="6hrs" --docker_socket="/var/run/docker.sock"
--docker_stop_timeout="0ns" --docker_store_dir="/tmp/Endpoint_SlaveEndpointTest_NoAuthorizer_1_n4BNvT/store/docker"
--docker_volume_checkpoint_dir="/var/run/mesos/isolators/docker/volume" --enforce_container_disk_quota="false"
--executor_registration_timeout="1mins" --executor_reregistration_timeout="2secs" --executor_secret_key="/tmp/Endpoint_SlaveEndpointTest_NoAuthorizer_1_n4BNvT/executor_secret_key"
--executor_shutdown_grace_period="5secs" --fetcher_cache_dir="/tmp/Endpoint_SlaveEndpointTest_NoAuthorizer_1_n4BNvT/fetch"
--fetcher_cache_size="2GB" --frameworks_home="" --gc_delay="1weeks" --gc_disk_headroom="0.1"
--hadoop_home="" --help="false" --hostname_lookup="true" --http_command_executor="false" --http_credentials="/tmp/Endpoint_SlaveEndpointTest_NoAuthorizer_1_n4BNvT/http_credentials"
--http_heartbeat_interval="30secs" --initialize_driver_logging="true" --isolation="posix/cpu,posix/mem"
--launcher="posix" --launcher_dir="/mesos/mesos-1.4.0/_build/src" --logbufsecs="0" --logging_level="INFO"
--max_completed_executors_per_framework="150" --oversubscribed_resources_interval="15secs"
--perf_duration="10secs" --perf_interval="1mins" --port="5051" --qos_correction_interval_min="0ns"
--quiet="false" --recover="reconnect" --recovery_timeout="15mins" --registration_backoff_factor="10ms"
--resources="cpus:2;gpus:0;mem:1024;disk:1024;ports:[31000-32000]" --revocable_cpu_low_priority="true"
--runtime_dir="/tmp/Endpoint_SlaveEndpointTest_NoAuthorizer_1_n4BNvT" --sandbox_directory="/mnt/mesos/sandbox"
--strict="true" --switch_user="true" --systemd_enable_support="true" --systemd_runtime_directory="/run/systemd/system"
--version="false" --work_dir="/tmp/Endpoint_SlaveEndpointTest_NoAuthorizer_1_PTYc4V"
I0614 05:04:20.742992 28625 credentials.hpp:86] Loading credential for authentication from
'/tmp/Endpoint_SlaveEndpointTest_NoAuthorizer_1_n4BNvT/credential'
I0614 05:04:20.743343 28625 slave.cpp:281] Agent using credential for: test-principal
I0614 05:04:20.743500 28625 credentials.hpp:37] Loading credentials for authentication from
'/tmp/Endpoint_SlaveEndpointTest_NoAuthorizer_1_n4BNvT/http_credentials'
I0614 05:04:20.743954 28625 http.cpp:975] Creating default 'basic' HTTP authenticator for
realm 'mesos-agent-executor'
I0614 05:04:20.744228 28625 http.cpp:996] Creating default 'jwt' HTTP authenticator for realm
'mesos-agent-executor'
I0614 05:04:20.744613 28625 http.cpp:975] Creating default 'basic' HTTP authenticator for
realm 'mesos-agent-readonly'
I0614 05:04:20.744992 28625 http.cpp:996] Creating default 'jwt' HTTP authenticator for realm
'mesos-agent-readonly'
I0614 05:04:20.745371 28625 http.cpp:975] Creating default 'basic' HTTP authenticator for
realm 'mesos-agent-readwrite'
I0614 05:04:20.745700 28625 http.cpp:996] Creating default 'jwt' HTTP authenticator for realm
'mesos-agent-readwrite'
I0614 05:04:20.747398 28625 slave.cpp:552] Agent resources: cpus(*):2; mem(*):1024; disk(*):1024;
ports(*):[31000-32000]
I0614 05:04:20.747692 28625 slave.cpp:560] Agent attributes: [  ]
I0614 05:04:20.747833 28625 slave.cpp:565] Agent hostname: 2fb588184b40
I0614 05:04:20.748643 28619 status_update_manager.cpp:177] Pausing sending status updates
I0614 05:04:20.749711 28630 state.cpp:62] Recovering state from '/tmp/Endpoint_SlaveEndpointTest_NoAuthorizer_1_PTYc4V/meta'
I0614 05:04:20.750155 28631 status_update_manager.cpp:203] Recovering status update manager
I0614 05:04:20.750524 28631 containerizer.cpp:582] Recovering containerizer
I0614 05:04:20.752194 28631 provisioner.cpp:416] Provisioner recovery complete
I0614 05:04:20.752696 28614 slave.cpp:6127] Finished recovery
I0614 05:04:20.753427 28614 slave.cpp:6309] Querying resource estimator for oversubscribable
resources
I0614 05:04:20.753986 28614 slave.cpp:6323] Received oversubscribable resources {} from the
resource estimator
I0614 05:04:20.756911 28614 process.cpp:3778] Handling HTTP event for process 'slave(772)'
with path: '/slave(772)/monitor/statistics.json'
I0614 05:04:20.759590 28614 http.cpp:1115] HTTP GET for /slave(772)/monitor/statistics.json
from 172.17.0.5:50750
I0614 05:04:20.759855 28614 http.cpp:936] Authorizing principal 'test-principal' to GET the
'/monitor/statistics.json' endpoint
I0614 05:04:20.764235 28619 slave.cpp:817] Agent terminating
[       OK ] Endpoint/SlaveEndpointTest.NoAuthorizer/1 (46 ms)
[ RUN      ] Endpoint/SlaveEndpointTest.NoAuthorizer/2
I0614 05:04:20.781975  7811 containerizer.cpp:230] Using isolation: posix/cpu,posix/mem,filesystem/posix,network/cni,environment_secret
W0614 05:04:20.782697  7811 backend.cpp:76] Failed to create 'aufs' backend: AufsBackend requires
root privileges
W0614 05:04:20.782814  7811 backend.cpp:76] Failed to create 'bind' backend: BindBackend requires
root privileges
I0614 05:04:20.782851  7811 provisioner.cpp:255] Using default backend 'copy'
I0614 05:04:20.784924  7811 cluster.cpp:448] Creating default 'local' authorizer
I0614 05:04:20.786866 28629 slave.cpp:248] Mesos agent started on (773)@172.17.0.5:33535
I0614 05:04:20.787048 28629 slave.cpp:249] Flags at startup: --acls="" --appc_simple_discovery_uri_prefix="http://"
--appc_store_dir="/tmp/Endpoint_SlaveEndpointTest_NoAuthorizer_2_YUVRFJ/store/appc" --authenticate_http_executors="true"
--authenticate_http_readonly="true" --authenticate_http_readwrite="true" --authenticatee="crammd5"
--authentication_backoff_factor="1secs" --authorizer="local" --cgroups_cpu_enable_pids_and_tids_count="false"
--cgroups_enable_cfs="false" --cgroups_hierarchy="/sys/fs/cgroup" --cgroups_limit_swap="false"
--cgroups_root="mesos" --container_disk_watch_interval="15secs" --containerizers="mesos" --credential="/tmp/Endpoint_SlaveEndpointTest_NoAuthorizer_2_YUVRFJ/credential"
--default_role="*" --disk_watch_interval="1mins" --docker="docker" --docker_kill_orphans="true"
--docker_registry="https://registry-1.docker.io" --docker_remove_delay="6hrs" --docker_socket="/var/run/docker.sock"
--docker_stop_timeout="0ns" --docker_store_dir="/tmp/Endpoint_SlaveEndpointTest_NoAuthorizer_2_YUVRFJ/store/docker"
--docker_volume_checkpoint_dir="/var/run/mesos/isolators/docker/volume" --enforce_container_disk_quota="false"
--executor_registration_timeout="1mins" --executor_reregistration_timeout="2secs" --executor_secret_key="/tmp/Endpoint_SlaveEndpointTest_NoAuthorizer_2_YUVRFJ/executor_secret_key"
--executor_shutdown_grace_period="5secs" --fetcher_cache_dir="/tmp/Endpoint_SlaveEndpointTest_NoAuthorizer_2_YUVRFJ/fetch"
--fetcher_cache_size="2GB" --frameworks_home="" --gc_delay="1weeks" --gc_disk_headroom="0.1"
--hadoop_home="" --help="false" --hostname_lookup="true" --http_command_executor="false" --http_credentials="/tmp/Endpoint_SlaveEndpointTest_NoAuthorizer_2_YUVRFJ/http_credentials"
--http_heartbeat_interval="30secs" --initialize_driver_logging="true" --isolation="posix/cpu,posix/mem"
--launcher="posix" --launcher_dir="/mesos/mesos-1.4.0/_build/src" --logbufsecs="0" --logging_level="INFO"
--max_completed_executors_per_framework="150" --oversubscribed_resources_interval="15secs"
--perf_duration="10secs" --perf_interval="1mins" --port="5051" --qos_correction_interval_min="0ns"
--quiet="false" --recover="reconnect" --recovery_timeout="15mins" --registration_backoff_factor="10ms"
--resources="cpus:2;gpus:0;mem:1024;disk:1024;ports:[31000-32000]" --revocable_cpu_low_priority="true"
--runtime_dir="/tmp/Endpoint_SlaveEndpointTest_NoAuthorizer_2_YUVRFJ" --sandbox_directory="/mnt/mesos/sandbox"
--strict="true" --switch_user="true" --systemd_enable_support="true" --systemd_runtime_directory="/run/systemd/system"
--version="false" --work_dir="/tmp/Endpoint_SlaveEndpointTest_NoAuthorizer_2_mQVj7L"
I0614 05:04:20.787734 28629 credentials.hpp:86] Loading credential for authentication from
'/tmp/Endpoint_SlaveEndpointTest_NoAuthorizer_2_YUVRFJ/credential'
I0614 05:04:20.788079 28629 slave.cpp:281] Agent using credential for: test-principal
I0614 05:04:20.788252 28629 credentials.hpp:37] Loading credentials for authentication from
'/tmp/Endpoint_SlaveEndpointTest_NoAuthorizer_2_YUVRFJ/http_credentials'
I0614 05:04:20.788751 28629 http.cpp:975] Creating default 'basic' HTTP authenticator for
realm 'mesos-agent-executor'
I0614 05:04:20.789022 28629 http.cpp:996] Creating default 'jwt' HTTP authenticator for realm
'mesos-agent-executor'
I0614 05:04:20.789382 28629 http.cpp:975] Creating default 'basic' HTTP authenticator for
realm 'mesos-agent-readonly'
I0614 05:04:20.789611 28629 http.cpp:996] Creating default 'jwt' HTTP authenticator for realm
'mesos-agent-readonly'
I0614 05:04:20.789922 28629 http.cpp:975] Creating default 'basic' HTTP authenticator for
realm 'mesos-agent-readwrite'
I0614 05:04:20.790148 28629 http.cpp:996] Creating default 'jwt' HTTP authenticator for realm
'mesos-agent-readwrite'
I0614 05:04:20.791856 28629 slave.cpp:552] Agent resources: cpus(*):2; mem(*):1024; disk(*):1024;
ports(*):[31000-32000]
I0614 05:04:20.792106 28629 slave.cpp:560] Agent attributes: [  ]
I0614 05:04:20.792253 28629 slave.cpp:565] Agent hostname: 2fb588184b40
I0614 05:04:20.794198 28629 status_update_manager.cpp:177] Pausing sending status updates
I0614 05:04:20.795410 28629 state.cpp:62] Recovering state from '/tmp/Endpoint_SlaveEndpointTest_NoAuthorizer_2_mQVj7L/meta'
I0614 05:04:20.796072 28629 status_update_manager.cpp:203] Recovering status update manager
I0614 05:04:20.796429 28629 containerizer.cpp:582] Recovering containerizer
I0614 05:04:20.798501 28629 provisioner.cpp:416] Provisioner recovery complete
I0614 05:04:20.799242 28629 slave.cpp:6127] Finished recovery
I0614 05:04:20.800292 28629 slave.cpp:6309] Querying resource estimator for oversubscribable
resources
I0614 05:04:20.800940 28611 slave.cpp:6323] Received oversubscribable resources {} from the
resource estimator
I0614 05:04:20.803802 28632 process.cpp:3778] Handling HTTP event for process 'slave(773)'
with path: '/slave(773)/containers'
I0614 05:04:20.805790 28618 http.cpp:1115] HTTP GET for /slave(773)/containers from 172.17.0.5:50752
I0614 05:04:20.805865 28618 http.cpp:936] Authorizing principal 'test-principal' to GET the
'/containers' endpoint
I0614 05:04:20.810412 28625 slave.cpp:817] Agent terminating
[       OK ] Endpoint/SlaveEndpointTest.NoAuthorizer/2 (42 ms)
[----------] 9 tests from Endpoint/SlaveEndpointTest (368 ms total)

[----------] Global test environment tear-down
[==========] 1602 tests from 178 test cases ran. (489138 ms total)
[  PASSED  ] 1601 tests.
[  FAILED  ] 1 test, listed below:
[  FAILED  ] PersistentVolumeEndpointsTest.ReserveAndSlaveRemoval

 1 FAILED TEST
  YOU HAVE 19 DISABLED TESTS

E0614 05:04:20.899355 28633 process.cpp:968] Failed to accept socket: future discarded
make[4]: *** [check-local] Error 1
make[4]: Leaving directory `/mesos/mesos-1.4.0/_build/src'
make[3]: *** [check-am] Error 2
make[3]: Leaving directory `/mesos/mesos-1.4.0/_build/src'
make[2]: *** [check] Error 2
make[2]: Leaving directory `/mesos/mesos-1.4.0/_build/src'
make[1]: *** [check-recursive] Error 1
make[1]: Leaving directory `/mesos/mesos-1.4.0/_build'
make: *** [distcheck] Error 1
+ docker rmi mesos-1497413330-31649
Untagged: mesos-1497413330-31649:latest
Deleted: sha256:60622fdc4b8ee785ec56029eba0dc68c579d9cad8d5bbe05cb476e65861bf7ed
Deleted: sha256:f6f642a87610bbfeb5dc7a05a890ddeca9fa14ee29cc080279c55d5f9af65dcd
Deleted: sha256:fe60ae912e39d62263b42c8dc17ce148dec1a608777ba57b0ab53efc6d1d1297
Deleted: sha256:65cf94566615c2ffba36c447cdd45f419f2c213ec8e85e5fbac3637d07258d76
Deleted: sha256:178163b26fd5ce281427c728fbc38e0f8724467e8278d1d4d7e7ae90abb3dc5a
Deleted: sha256:4cf2b11ca251f62a627f2b741968e91f03f0c3443e210c5e9a851442eab84927
Deleted: sha256:f069edd6f5a8938f679784b1f7695e30e7ac039cdc40ec267651abb466c70339
Deleted: sha256:1dfd52c05a46d94368c4289e100c595f234bb4c27f5c4991c3ea2d266079083e
Deleted: sha256:253d8af7ebcad3e13e41ea93199f6dca82486c23c2702909b9120b6c2e61bd77
Deleted: sha256:954ab6a15b0c9c28006726be5dc5c60d58adb408aadee093f4e43c928bddccb6
Deleted: sha256:490f764d094c6fbe58a16c75f7e6074618c9f32e2180c91c29d398d0d776ac65
Deleted: sha256:9cb9ff69883c97ac710869fe080f0e1e6c712c27f42c71cc23f1d2f3f02c9811
Deleted: sha256:a2c3afe4e682a1046dc0f869f71c5ce7307c81f545f1555bb090664a230a4cb5
Deleted: sha256:b3e336f9ee9a9813facf54e13f68486e07cf5b315e00413555755740a771c816
Deleted: sha256:b27b627794406f79b03342587e3177ac2815a5e6d6dee8905ce4919236460ba8
Deleted: sha256:881e94835ce77319d82470f6bbf3bfdc05412eaecd36712436aba01932498303
Deleted: sha256:29e4b612d4aae15ccb1b0fb2f5d9053575dfd5172a13639874251f125dfc72fa
Deleted: sha256:ad77a2a763faba28a196183322bc98dc82bce97f10595a3707551b28d476c72c
Deleted: sha256:31477dc491b98b91de610be08e3e797dc436d498628bc097420d24662f0b6a43
Deleted: sha256:7e2a24fe0a9a5873291be7d50499fd5dcb4caf2800dae7d38c0bcfec469abd1c
Deleted: sha256:fa171e473f67b4d99d0b8916afe96d8ba58658430c2f85b8039979d0dc059b62
Deleted: sha256:ea6b7b37394c1f6fdf5d9466a71edceaeb89eada69da247d03d55011e22ed4ef
Deleted: sha256:fe99018acaea0b59df21ced8e9b9e44534e0a9af3e38de93eeca750b3aca140b
Deleted: sha256:ab7f58ed2b6b31b2cbea227475e55864e17661235308317359739c4c540860b5
Build step 'Execute shell' marked build as failure

Mime
View raw message