mesos-builds mailing list archives

Site index · List index
Message view « Date » · « Thread »
Top « Date » · « Thread »
From Apache Jenkins Server <jenk...@builds.apache.org>
Subject Build failed in Jenkins: Mesos-Reviewbot #18354
Date Mon, 12 Jun 2017 19:05:22 GMT
See <https://builds.apache.org/job/Mesos-Reviewbot/18354/display/redirect?page=changes>

Changes:

[klueska] Updated 'config.py' in the new Mesos CLI to take settings as parameter.

[klueska] Extended the unit test infrastructure in the new Mesos CLI.

------------------------------------------
[...truncated 28.20 MB...]
I0612 19:05:15.127641  4580 containerizer.cpp:230] Using isolation: posix/cpu,posix/mem,filesystem/posix,network/cni,environment_secret
W0612 19:05:15.128455  4580 backend.cpp:76] Failed to create 'overlay' backend: OverlayBackend
requires root privileges
W0612 19:05:15.128635  4580 backend.cpp:76] Failed to create 'bind' backend: BindBackend requires
root privileges
I0612 19:05:15.128684  4580 provisioner.cpp:255] Using default backend 'copy'
I0612 19:05:15.133977  4600 slave.cpp:248] Mesos agent started on (756)@172.17.0.2:35507
I0612 19:05:15.134027  4600 slave.cpp:249] Flags at startup: --acls="" --appc_simple_discovery_uri_prefix="http://"
--appc_store_dir="/tmp/Endpoint_SlaveEndpointTest_AuthorizedRequest_2_38uhmC/store/appc" --authenticate_http_readonly="true"
--authenticate_http_readwrite="true" --authenticatee="crammd5" --authentication_backoff_factor="1secs"
--authorizer="local" --cgroups_cpu_enable_pids_and_tids_count="false" --cgroups_enable_cfs="false"
--cgroups_hierarchy="/sys/fs/cgroup" --cgroups_limit_swap="false" --cgroups_root="mesos" --container_disk_watch_interval="15secs"
--containerizers="mesos" --credential="/tmp/Endpoint_SlaveEndpointTest_AuthorizedRequest_2_38uhmC/credential"
--default_role="*" --disk_watch_interval="1mins" --docker="docker" --docker_kill_orphans="true"
--docker_registry="https://registry-1.docker.io" --docker_remove_delay="6hrs" --docker_socket="/var/run/docker.sock"
--docker_stop_timeout="0ns" --docker_store_dir="/tmp/Endpoint_SlaveEndpointTest_AuthorizedRequest_2_38uhmC/store/docker"
--docker_volume_checkpoint_dir="/var/run/mesos/isolators/docker/volume" --enforce_container_disk_quota="false"
--executor_registration_timeout="1mins" --executor_reregistration_timeout="2secs" --executor_shutdown_grace_period="5secs"
--fetcher_cache_dir="/tmp/Endpoint_SlaveEndpointTest_AuthorizedRequest_2_38uhmC/fetch" --fetcher_cache_size="2GB"
--frameworks_home="" --gc_delay="1weeks" --gc_disk_headroom="0.1" --hadoop_home="" --help="false"
--hostname_lookup="true" --http_command_executor="false" --http_credentials="/tmp/Endpoint_SlaveEndpointTest_AuthorizedRequest_2_38uhmC/http_credentials"
--http_heartbeat_interval="30secs" --initialize_driver_logging="true" --isolation="posix/cpu,posix/mem"
--launcher="posix" --launcher_dir="/mesos/mesos-1.4.0/_build/src" --logbufsecs="0" --logging_level="INFO"
--max_completed_executors_per_framework="150" --oversubscribed_resources_interval="15secs"
--perf_duration="10secs" --perf_interval="1mins" --port="5051" --qos_correction_interval_min="0ns"
--quiet="false" --recover="reconnect" --recovery_timeout="15mins" --registration_backoff_factor="10ms"
--resources="cpus:2;gpus:0;mem:1024;disk:1024;ports:[31000-32000]" --revocable_cpu_low_priority="true"
--runtime_dir="/tmp/Endpoint_SlaveEndpointTest_AuthorizedRequest_2_38uhmC" --sandbox_directory="/mnt/mesos/sandbox"
--strict="true" --switch_user="true" --systemd_enable_support="true" --systemd_runtime_directory="/run/systemd/system"
--version="false" --work_dir="/tmp/Endpoint_SlaveEndpointTest_AuthorizedRequest_2_DtrgrH"
I0612 19:05:15.134739  4600 credentials.hpp:86] Loading credential for authentication from
'/tmp/Endpoint_SlaveEndpointTest_AuthorizedRequest_2_38uhmC/credential'
I0612 19:05:15.139935  4600 slave.cpp:281] Agent using credential for: test-principal
I0612 19:05:15.139986  4600 credentials.hpp:37] Loading credentials for authentication from
'/tmp/Endpoint_SlaveEndpointTest_AuthorizedRequest_2_38uhmC/http_credentials'
I0612 19:05:15.140435  4600 http.cpp:975] Creating default 'basic' HTTP authenticator for
realm 'mesos-agent-readonly'
I0612 19:05:15.140676  4600 http.cpp:975] Creating default 'basic' HTTP authenticator for
realm 'mesos-agent-readwrite'
I0612 19:05:15.142663  4600 slave.cpp:552] Agent resources: cpus(*):2; mem(*):1024; disk(*):1024;
ports(*):[31000-32000]
I0612 19:05:15.142798  4600 slave.cpp:560] Agent attributes: [  ]
I0612 19:05:15.142817  4600 slave.cpp:565] Agent hostname: 361c4817f7f9
I0612 19:05:15.143085  4603 status_update_manager.cpp:177] Pausing sending status updates
I0612 19:05:15.157554  4600 state.cpp:62] Recovering state from '/tmp/Endpoint_SlaveEndpointTest_AuthorizedRequest_2_DtrgrH/meta'
I0612 19:05:15.158200  4600 status_update_manager.cpp:203] Recovering status update manager
I0612 19:05:15.158409  4600 containerizer.cpp:582] Recovering containerizer
I0612 19:05:15.161269  4599 provisioner.cpp:416] Provisioner recovery complete
I0612 19:05:15.161980  4603 slave.cpp:6127] Finished recovery
I0612 19:05:15.162642  4603 slave.cpp:6309] Querying resource estimator for oversubscribable
resources
I0612 19:05:15.163089  4601 slave.cpp:6323] Received oversubscribable resources {} from the
resource estimator
I0612 19:05:15.195483  4603 process.cpp:3778] Handling HTTP event for process 'slave(756)'
with path: '/slave(756)/containers'
I0612 19:05:15.197777  4603 http.cpp:1115] HTTP GET for /slave(756)/containers from 172.17.0.2:39886
I0612 19:05:15.197891  4603 http.cpp:936] Authorizing principal 'test-principal' to GET the
'/containers' endpoint
I0612 19:05:15.204841  4604 slave.cpp:817] Agent terminating
[       OK ] Endpoint/SlaveEndpointTest.AuthorizedRequest/2 (94 ms)
[ RUN      ] Endpoint/SlaveEndpointTest.UnauthorizedRequest/0
I0612 19:05:15.221186  4580 containerizer.cpp:230] Using isolation: posix/cpu,posix/mem,filesystem/posix,network/cni,environment_secret
W0612 19:05:15.222019  4580 backend.cpp:76] Failed to create 'overlay' backend: OverlayBackend
requires root privileges
W0612 19:05:15.222204  4580 backend.cpp:76] Failed to create 'bind' backend: BindBackend requires
root privileges
I0612 19:05:15.222254  4580 provisioner.cpp:255] Using default backend 'copy'
I0612 19:05:15.227195  4603 slave.cpp:248] Mesos agent started on (757)@172.17.0.2:35507
I0612 19:05:15.227300  4603 slave.cpp:249] Flags at startup: --acls="" --appc_simple_discovery_uri_prefix="http://"
--appc_store_dir="/tmp/Endpoint_SlaveEndpointTest_UnauthorizedRequest_0_zzoDRi/store/appc"
--authenticate_http_readonly="true" --authenticate_http_readwrite="true" --authenticatee="crammd5"
--authentication_backoff_factor="1secs" --authorizer="local" --cgroups_cpu_enable_pids_and_tids_count="false"
--cgroups_enable_cfs="false" --cgroups_hierarchy="/sys/fs/cgroup" --cgroups_limit_swap="false"
--cgroups_root="mesos" --container_disk_watch_interval="15secs" --containerizers="mesos" --credential="/tmp/Endpoint_SlaveEndpointTest_UnauthorizedRequest_0_zzoDRi/credential"
--default_role="*" --disk_watch_interval="1mins" --docker="docker" --docker_kill_orphans="true"
--docker_registry="https://registry-1.docker.io" --docker_remove_delay="6hrs" --docker_socket="/var/run/docker.sock"
--docker_stop_timeout="0ns" --docker_store_dir="/tmp/Endpoint_SlaveEndpointTest_UnauthorizedRequest_0_zzoDRi/store/docker"
--docker_volume_checkpoint_dir="/var/run/mesos/isolators/docker/volume" --enforce_container_disk_quota="false"
--executor_registration_timeout="1mins" --executor_reregistration_timeout="2secs" --executor_shutdown_grace_period="5secs"
--fetcher_cache_dir="/tmp/Endpoint_SlaveEndpointTest_UnauthorizedRequest_0_zzoDRi/fetch" --fetcher_cache_size="2GB"
--frameworks_home="" --gc_delay="1weeks" --gc_disk_headroom="0.1" --hadoop_home="" --help="false"
--hostname_lookup="true" --http_command_executor="false" --http_credentials="/tmp/Endpoint_SlaveEndpointTest_UnauthorizedRequest_0_zzoDRi/http_credentials"
--http_heartbeat_interval="30secs" --initialize_driver_logging="true" --isolation="posix/cpu,posix/mem"
--launcher="posix" --launcher_dir="/mesos/mesos-1.4.0/_build/src" --logbufsecs="0" --logging_level="INFO"
--max_completed_executors_per_framework="150" --oversubscribed_resources_interval="15secs"
--perf_duration="10secs" --perf_interval="1mins" --port="5051" --qos_correction_interval_min="0ns"
--quiet="false" --recover="reconnect" --recovery_timeout="15mins" --registration_backoff_factor="10ms"
--resources="cpus:2;gpus:0;mem:1024;disk:1024;ports:[31000-32000]" --revocable_cpu_low_priority="true"
--runtime_dir="/tmp/Endpoint_SlaveEndpointTest_UnauthorizedRequest_0_zzoDRi" --sandbox_directory="/mnt/mesos/sandbox"
--strict="true" --switch_user="true" --systemd_enable_support="true" --systemd_runtime_directory="/run/systemd/system"
--version="false" --work_dir="/tmp/Endpoint_SlaveEndpointTest_UnauthorizedRequest_0_nNnsHn"
I0612 19:05:15.228452  4603 credentials.hpp:86] Loading credential for authentication from
'/tmp/Endpoint_SlaveEndpointTest_UnauthorizedRequest_0_zzoDRi/credential'
I0612 19:05:15.229111  4603 slave.cpp:281] Agent using credential for: test-principal
I0612 19:05:15.229173  4603 credentials.hpp:37] Loading credentials for authentication from
'/tmp/Endpoint_SlaveEndpointTest_UnauthorizedRequest_0_zzoDRi/http_credentials'
I0612 19:05:15.229918  4603 http.cpp:975] Creating default 'basic' HTTP authenticator for
realm 'mesos-agent-readonly'
I0612 19:05:15.230391  4603 http.cpp:975] Creating default 'basic' HTTP authenticator for
realm 'mesos-agent-readwrite'
I0612 19:05:15.232765  4603 slave.cpp:552] Agent resources: cpus(*):2; mem(*):1024; disk(*):1024;
ports(*):[31000-32000]
I0612 19:05:15.233177  4603 slave.cpp:560] Agent attributes: [  ]
I0612 19:05:15.233228  4603 slave.cpp:565] Agent hostname: 361c4817f7f9
I0612 19:05:15.233708  4601 status_update_manager.cpp:177] Pausing sending status updates
I0612 19:05:15.236112  4602 state.cpp:62] Recovering state from '/tmp/Endpoint_SlaveEndpointTest_UnauthorizedRequest_0_nNnsHn/meta'
I0612 19:05:15.249225  4603 status_update_manager.cpp:203] Recovering status update manager
I0612 19:05:15.249800  4603 containerizer.cpp:582] Recovering containerizer
I0612 19:05:15.252074  4601 provisioner.cpp:416] Provisioner recovery complete
I0612 19:05:15.252724  4601 slave.cpp:6127] Finished recovery
I0612 19:05:15.253300  4601 slave.cpp:6309] Querying resource estimator for oversubscribable
resources
I0612 19:05:15.253947  4605 slave.cpp:6323] Received oversubscribable resources {} from the
resource estimator
I0612 19:05:15.258435  4606 process.cpp:3778] Handling HTTP event for process 'slave(757)'
with path: '/slave(757)/monitor/statistics'
I0612 19:05:15.261123  4606 http.cpp:1115] HTTP GET for /slave(757)/monitor/statistics from
172.17.0.2:39890
I0612 19:05:15.261500  4606 http.cpp:936] Authorizing principal 'test-principal' to GET the
'/monitor/statistics' endpoint
I0612 19:05:15.265350  4605 slave.cpp:817] Agent terminating
[       OK ] Endpoint/SlaveEndpointTest.UnauthorizedRequest/0 (59 ms)
[ RUN      ] Endpoint/SlaveEndpointTest.UnauthorizedRequest/1
I0612 19:05:15.279996  4580 containerizer.cpp:230] Using isolation: posix/cpu,posix/mem,filesystem/posix,network/cni,environment_secret
W0612 19:05:15.280802  4580 backend.cpp:76] Failed to create 'overlay' backend: OverlayBackend
requires root privileges
W0612 19:05:15.280982  4580 backend.cpp:76] Failed to create 'bind' backend: BindBackend requires
root privileges
I0612 19:05:15.281029  4580 provisioner.cpp:255] Using default backend 'copy'
I0612 19:05:15.287230  4603 slave.cpp:248] Mesos agent started on (758)@172.17.0.2:35507
I0612 19:05:15.287696  4603 slave.cpp:249] Flags at startup: --acls="" --appc_simple_discovery_uri_prefix="http://"
--appc_store_dir="/tmp/Endpoint_SlaveEndpointTest_UnauthorizedRequest_1_Td8g4Z/store/appc"
--authenticate_http_readonly="true" --authenticate_http_readwrite="true" --authenticatee="crammd5"
--authentication_backoff_factor="1secs" --authorizer="local" --cgroups_cpu_enable_pids_and_tids_count="false"
--cgroups_enable_cfs="false" --cgroups_hierarchy="/sys/fs/cgroup" --cgroups_limit_swap="false"
--cgroups_root="mesos" --container_disk_watch_interval="15secs" --containerizers="mesos" --credential="/tmp/Endpoint_SlaveEndpointTest_UnauthorizedRequest_1_Td8g4Z/credential"
--default_role="*" --disk_watch_interval="1mins" --docker="docker" --docker_kill_orphans="true"
--docker_registry="https://registry-1.docker.io" --docker_remove_delay="6hrs" --docker_socket="/var/run/docker.sock"
--docker_stop_timeout="0ns" --docker_store_dir="/tmp/Endpoint_SlaveEndpointTest_UnauthorizedRequest_1_Td8g4Z/store/docker"
--docker_volume_checkpoint_dir="/var/run/mesos/isolators/docker/volume" --enforce_container_disk_quota="false"
--executor_registration_timeout="1mins" --executor_reregistration_timeout="2secs" --executor_shutdown_grace_period="5secs"
--fetcher_cache_dir="/tmp/Endpoint_SlaveEndpointTest_UnauthorizedRequest_1_Td8g4Z/fetch" --fetcher_cache_size="2GB"
--frameworks_home="" --gc_delay="1weeks" --gc_disk_headroom="0.1" --hadoop_home="" --help="false"
--hostname_lookup="true" --http_command_executor="false" --http_credentials="/tmp/Endpoint_SlaveEndpointTest_UnauthorizedRequest_1_Td8g4Z/http_credentials"
--http_heartbeat_interval="30secs" --initialize_driver_logging="true" --isolation="posix/cpu,posix/mem"
--launcher="posix" --launcher_dir="/mesos/mesos-1.4.0/_build/src" --logbufsecs="0" --logging_level="INFO"
--max_completed_executors_per_framework="150" --oversubscribed_resources_interval="15secs"
--perf_duration="10secs" --perf_interval="1mins" --port="5051" --qos_correction_interval_min="0ns"
--quiet="false" --recover="reconnect" --recovery_timeout="15mins" --registration_backoff_factor="10ms"
--resources="cpus:2;gpus:0;mem:1024;disk:1024;ports:[31000-32000]" --revocable_cpu_low_priority="true"
--runtime_dir="/tmp/Endpoint_SlaveEndpointTest_UnauthorizedRequest_1_Td8g4Z" --sandbox_directory="/mnt/mesos/sandbox"
--strict="true" --switch_user="true" --systemd_enable_support="true" --systemd_runtime_directory="/run/systemd/system"
--version="false" --work_dir="/tmp/Endpoint_SlaveEndpointTest_UnauthorizedRequest_1_JIlzK4"
I0612 19:05:15.288615  4603 credentials.hpp:86] Loading credential for authentication from
'/tmp/Endpoint_SlaveEndpointTest_UnauthorizedRequest_1_Td8g4Z/credential'
I0612 19:05:15.289281  4603 slave.cpp:281] Agent using credential for: test-principal
I0612 19:05:15.289345  4603 credentials.hpp:37] Loading credentials for authentication from
'/tmp/Endpoint_SlaveEndpointTest_UnauthorizedRequest_1_Td8g4Z/http_credentials'
I0612 19:05:15.289963  4603 http.cpp:975] Creating default 'basic' HTTP authenticator for
realm 'mesos-agent-readonly'
I0612 19:05:15.290483  4603 http.cpp:975] Creating default 'basic' HTTP authenticator for
realm 'mesos-agent-readwrite'
I0612 19:05:15.292935  4603 slave.cpp:552] Agent resources: cpus(*):2; mem(*):1024; disk(*):1024;
ports(*):[31000-32000]
I0612 19:05:15.293124  4603 slave.cpp:560] Agent attributes: [  ]
I0612 19:05:15.293380  4603 slave.cpp:565] Agent hostname: 361c4817f7f9
I0612 19:05:15.293902  4605 status_update_manager.cpp:177] Pausing sending status updates
I0612 19:05:15.296211  4605 state.cpp:62] Recovering state from '/tmp/Endpoint_SlaveEndpointTest_UnauthorizedRequest_1_JIlzK4/meta'
I0612 19:05:15.296934  4601 status_update_manager.cpp:203] Recovering status update manager
I0612 19:05:15.297405  4602 containerizer.cpp:582] Recovering containerizer
I0612 19:05:15.299813  4601 provisioner.cpp:416] Provisioner recovery complete
I0612 19:05:15.300509  4601 slave.cpp:6127] Finished recovery
I0612 19:05:15.301091  4601 slave.cpp:6309] Querying resource estimator for oversubscribable
resources
I0612 19:05:15.301975  4599 slave.cpp:6323] Received oversubscribable resources {} from the
resource estimator
I0612 19:05:15.305893  4604 process.cpp:3778] Handling HTTP event for process 'slave(758)'
with path: '/slave(758)/monitor/statistics.json'
I0612 19:05:15.307729  4606 http.cpp:1115] HTTP GET for /slave(758)/monitor/statistics.json
from 172.17.0.2:39892
I0612 19:05:15.308113  4606 http.cpp:936] Authorizing principal 'test-principal' to GET the
'/monitor/statistics.json' endpoint
I0612 19:05:15.312134  4601 slave.cpp:817] Agent terminating
[       OK ] Endpoint/SlaveEndpointTest.UnauthorizedRequest/1 (47 ms)
[ RUN      ] Endpoint/SlaveEndpointTest.UnauthorizedRequest/2
I0612 19:05:15.327834  4580 containerizer.cpp:230] Using isolation: posix/cpu,posix/mem,filesystem/posix,network/cni,environment_secret
W0612 19:05:15.328696  4580 backend.cpp:76] Failed to create 'overlay' backend: OverlayBackend
requires root privileges
W0612 19:05:15.328883  4580 backend.cpp:76] Failed to create 'bind' backend: BindBackend requires
root privileges
I0612 19:05:15.328935  4580 provisioner.cpp:255] Using default backend 'copy'
I0612 19:05:15.334357  4600 slave.cpp:248] Mesos agent started on (759)@172.17.0.2:35507
I0612 19:05:15.334439  4600 slave.cpp:249] Flags at startup: --acls="" --appc_simple_discovery_uri_prefix="http://"
--appc_store_dir="/tmp/Endpoint_SlaveEndpointTest_UnauthorizedRequest_2_JMkSLH/store/appc"
--authenticate_http_readonly="true" --authenticate_http_readwrite="true" --authenticatee="crammd5"
--authentication_backoff_factor="1secs" --authorizer="local" --cgroups_cpu_enable_pids_and_tids_count="false"
--cgroups_enable_cfs="false" --cgroups_hierarchy="/sys/fs/cgroup" --cgroups_limit_swap="false"
--cgroups_root="mesos" --container_disk_watch_interval="15secs" --containerizers="mesos" --credential="/tmp/Endpoint_SlaveEndpointTest_UnauthorizedRequest_2_JMkSLH/credential"
--default_role="*" --disk_watch_interval="1mins" --docker="docker" --docker_kill_orphans="true"
--docker_registry="https://registry-1.docker.io" --docker_remove_delay="6hrs" --docker_socket="/var/run/docker.sock"
--docker_stop_timeout="0ns" --docker_store_dir="/tmp/Endpoint_SlaveEndpointTest_UnauthorizedRequest_2_JMkSLH/store/docker"
--docker_volume_checkpoint_dir="/var/run/mesos/isolators/docker/volume" --enforce_container_disk_quota="false"
--executor_registration_timeout="1mins" --executor_reregistration_timeout="2secs" --executor_shutdown_grace_period="5secs"
--fetcher_cache_dir="/tmp/Endpoint_SlaveEndpointTest_UnauthorizedRequest_2_JMkSLH/fetch" --fetcher_cache_size="2GB"
--frameworks_home="" --gc_delay="1weeks" --gc_disk_headroom="0.1" --hadoop_home="" --help="false"
--hostname_lookup="true" --http_command_executor="false" --http_credentials="/tmp/Endpoint_SlaveEndpointTest_UnauthorizedRequest_2_JMkSLH/http_credentials"
--http_heartbeat_interval="30secs" --initialize_driver_logging="true" --isolation="posix/cpu,posix/mem"
--launcher="posix" --launcher_dir="/mesos/mesos-1.4.0/_build/src" --logbufsecs="0" --logging_level="INFO"
--max_completed_executors_per_framework="150" --oversubscribed_resources_interval="15secs"
--perf_duration="10secs" --perf_interval="1mins" --port="5051" --qos_correction_interval_min="0ns"
--quiet="false" --recover="reconnect" --recovery_timeout="15mins" --registration_backoff_factor="10ms"
--resources="cpus:2;gpus:0;mem:1024;disk:1024;ports:[31000-32000]" --revocable_cpu_low_priority="true"
--runtime_dir="/tmp/Endpoint_SlaveEndpointTest_UnauthorizedRequest_2_JMkSLH" --sandbox_directory="/mnt/mesos/sandbox"
--strict="true" --switch_user="true" --systemd_enable_support="true" --systemd_runtime_directory="/run/systemd/system"
--version="false" --work_dir="/tmp/Endpoint_SlaveEndpointTest_UnauthorizedRequest_2_7QPqkM"
I0612 19:05:15.335631  4600 credentials.hpp:86] Loading credential for authentication from
'/tmp/Endpoint_SlaveEndpointTest_UnauthorizedRequest_2_JMkSLH/credential'
I0612 19:05:15.337011  4600 slave.cpp:281] Agent using credential for: test-principal
I0612 19:05:15.337087  4600 credentials.hpp:37] Loading credentials for authentication from
'/tmp/Endpoint_SlaveEndpointTest_UnauthorizedRequest_2_JMkSLH/http_credentials'
I0612 19:05:15.337815  4600 http.cpp:975] Creating default 'basic' HTTP authenticator for
realm 'mesos-agent-readonly'
I0612 19:05:15.338271  4600 http.cpp:975] Creating default 'basic' HTTP authenticator for
realm 'mesos-agent-readwrite'
I0612 19:05:15.340575  4600 slave.cpp:552] Agent resources: cpus(*):2; mem(*):1024; disk(*):1024;
ports(*):[31000-32000]
I0612 19:05:15.340762  4600 slave.cpp:560] Agent attributes: [  ]
I0612 19:05:15.341015  4600 slave.cpp:565] Agent hostname: 361c4817f7f9
I0612 19:05:15.341372  4601 status_update_manager.cpp:177] Pausing sending status updates
I0612 19:05:15.343530  4601 state.cpp:62] Recovering state from '/tmp/Endpoint_SlaveEndpointTest_UnauthorizedRequest_2_7QPqkM/meta'
I0612 19:05:15.344156  4601 status_update_manager.cpp:203] Recovering status update manager
I0612 19:05:15.344408  4601 containerizer.cpp:582] Recovering containerizer
I0612 19:05:15.346648  4606 provisioner.cpp:416] Provisioner recovery complete
I0612 19:05:15.347455  4599 slave.cpp:6127] Finished recovery
I0612 19:05:15.348064  4599 slave.cpp:6309] Querying resource estimator for oversubscribable
resources
I0612 19:05:15.348498  4603 slave.cpp:6323] Received oversubscribable resources {} from the
resource estimator
I0612 19:05:15.352485  4606 process.cpp:3778] Handling HTTP event for process 'slave(759)'
with path: '/slave(759)/containers'
I0612 19:05:15.354959  4606 http.cpp:1115] HTTP GET for /slave(759)/containers from 172.17.0.2:39894
I0612 19:05:15.355340  4606 http.cpp:936] Authorizing principal 'test-principal' to GET the
'/containers' endpoint
I0612 19:05:15.358867  4602 slave.cpp:817] Agent terminating
[       OK ] Endpoint/SlaveEndpointTest.UnauthorizedRequest/2 (46 ms)
[ RUN      ] Endpoint/SlaveEndpointTest.NoAuthorizer/0
I0612 19:05:15.374186  4580 containerizer.cpp:230] Using isolation: posix/cpu,posix/mem,filesystem/posix,network/cni,environment_secret
W0612 19:05:15.374989  4580 backend.cpp:76] Failed to create 'overlay' backend: OverlayBackend
requires root privileges
W0612 19:05:15.375169  4580 backend.cpp:76] Failed to create 'bind' backend: BindBackend requires
root privileges
I0612 19:05:15.375218  4580 provisioner.cpp:255] Using default backend 'copy'
I0612 19:05:15.377712  4580 cluster.cpp:448] Creating default 'local' authorizer
I0612 19:05:15.381602  4602 slave.cpp:248] Mesos agent started on (760)@172.17.0.2:35507
I0612 19:05:15.382148  4602 slave.cpp:249] Flags at startup: --acls="" --appc_simple_discovery_uri_prefix="http://"
--appc_store_dir="/tmp/Endpoint_SlaveEndpointTest_NoAuthorizer_0_xKMuXp/store/appc" --authenticate_http_readonly="true"
--authenticate_http_readwrite="true" --authenticatee="crammd5" --authentication_backoff_factor="1secs"
--authorizer="local" --cgroups_cpu_enable_pids_and_tids_count="false" --cgroups_enable_cfs="false"
--cgroups_hierarchy="/sys/fs/cgroup" --cgroups_limit_swap="false" --cgroups_root="mesos" --container_disk_watch_interval="15secs"
--containerizers="mesos" --credential="/tmp/Endpoint_SlaveEndpointTest_NoAuthorizer_0_xKMuXp/credential"
--default_role="*" --disk_watch_interval="1mins" --docker="docker" --docker_kill_orphans="true"
--docker_registry="https://registry-1.docker.io" --docker_remove_delay="6hrs" --docker_socket="/var/run/docker.sock"
--docker_stop_timeout="0ns" --docker_store_dir="/tmp/Endpoint_SlaveEndpointTest_NoAuthorizer_0_xKMuXp/store/docker"
--docker_volume_checkpoint_dir="/var/run/mesos/isolators/docker/volume" --enforce_container_disk_quota="false"
--executor_registration_timeout="1mins" --executor_reregistration_timeout="2secs" --executor_shutdown_grace_period="5secs"
--fetcher_cache_dir="/tmp/Endpoint_SlaveEndpointTest_NoAuthorizer_0_xKMuXp/fetch" --fetcher_cache_size="2GB"
--frameworks_home="" --gc_delay="1weeks" --gc_disk_headroom="0.1" --hadoop_home="" --help="false"
--hostname_lookup="true" --http_command_executor="false" --http_credentials="/tmp/Endpoint_SlaveEndpointTest_NoAuthorizer_0_xKMuXp/http_credentials"
--http_heartbeat_interval="30secs" --initialize_driver_logging="true" --isolation="posix/cpu,posix/mem"
--launcher="posix" --launcher_dir="/mesos/mesos-1.4.0/_build/src" --logbufsecs="0" --logging_level="INFO"
--max_completed_executors_per_framework="150" --oversubscribed_resources_interval="15secs"
--perf_duration="10secs" --perf_interval="1mins" --port="5051" --qos_correction_interval_min="0ns"
--quiet="false" --recover="reconnect" --recovery_timeout="15mins" --registration_backoff_factor="10ms"
--resources="cpus:2;gpus:0;mem:1024;disk:1024;ports:[31000-32000]" --revocable_cpu_low_priority="true"
--runtime_dir="/tmp/Endpoint_SlaveEndpointTest_NoAuthorizer_0_xKMuXp" --sandbox_directory="/mnt/mesos/sandbox"
--strict="true" --switch_user="true" --systemd_enable_support="true" --systemd_runtime_directory="/run/systemd/system"
--version="false" --work_dir="/tmp/Endpoint_SlaveEndpointTest_NoAuthorizer_0_homAou"
I0612 19:05:15.383404  4602 credentials.hpp:86] Loading credential for authentication from
'/tmp/Endpoint_SlaveEndpointTest_NoAuthorizer_0_xKMuXp/credential'
I0612 19:05:15.383823  4602 slave.cpp:281] Agent using credential for: test-principal
I0612 19:05:15.383900  4602 credentials.hpp:37] Loading credentials for authentication from
'/tmp/Endpoint_SlaveEndpointTest_NoAuthorizer_0_xKMuXp/http_credentials'
I0612 19:05:15.384676  4602 http.cpp:975] Creating default 'basic' HTTP authenticator for
realm 'mesos-agent-readonly'
I0612 19:05:15.385118  4602 http.cpp:975] Creating default 'basic' HTTP authenticator for
realm 'mesos-agent-readwrite'
I0612 19:05:15.387773  4602 slave.cpp:552] Agent resources: cpus(*):2; mem(*):1024; disk(*):1024;
ports(*):[31000-32000]
I0612 19:05:15.388181  4602 slave.cpp:560] Agent attributes: [  ]
I0612 19:05:15.388233  4602 slave.cpp:565] Agent hostname: 361c4817f7f9
I0612 19:05:15.388787  4604 status_update_manager.cpp:177] Pausing sending status updates
I0612 19:05:15.391773  4602 state.cpp:62] Recovering state from '/tmp/Endpoint_SlaveEndpointTest_NoAuthorizer_0_homAou/meta'
I0612 19:05:15.392583  4604 status_update_manager.cpp:203] Recovering status update manager
I0612 19:05:15.392967  4599 containerizer.cpp:582] Recovering containerizer
I0612 19:05:15.395362  4604 provisioner.cpp:416] Provisioner recovery complete
I0612 19:05:15.395978  4604 slave.cpp:6127] Finished recovery
I0612 19:05:15.396719  4604 slave.cpp:6309] Querying resource estimator for oversubscribable
resources
I0612 19:05:15.397109  4604 slave.cpp:6323] Received oversubscribable resources {} from the
resource estimator
I0612 19:05:15.400897  4604 process.cpp:3778] Handling HTTP event for process 'slave(760)'
with path: '/slave(760)/monitor/statistics'
I0612 19:05:15.402885  4604 http.cpp:1115] HTTP GET for /slave(760)/monitor/statistics from
172.17.0.2:39896
I0612 19:05:15.403002  4604 http.cpp:936] Authorizing principal 'test-principal' to GET the
'/monitor/statistics' endpoint
I0612 19:05:15.408280  4601 slave.cpp:817] Agent terminating
[       OK ] Endpoint/SlaveEndpointTest.NoAuthorizer/0 (49 ms)
[ RUN      ] Endpoint/SlaveEndpointTest.NoAuthorizer/1
I0612 19:05:15.423285  4580 containerizer.cpp:230] Using isolation: posix/cpu,posix/mem,filesystem/posix,network/cni,environment_secret
W0612 19:05:15.424098  4580 backend.cpp:76] Failed to create 'overlay' backend: OverlayBackend
requires root privileges
W0612 19:05:15.424283  4580 backend.cpp:76] Failed to create 'bind' backend: BindBackend requires
root privileges
I0612 19:05:15.424335  4580 provisioner.cpp:255] Using default backend 'copy'
I0612 19:05:15.426786  4580 cluster.cpp:448] Creating default 'local' authorizer
I0612 19:05:15.429426  4603 slave.cpp:248] Mesos agent started on (761)@172.17.0.2:35507
I0612 19:05:15.429770  4603 slave.cpp:249] Flags at startup: --acls="" --appc_simple_discovery_uri_prefix="http://"
--appc_store_dir="/tmp/Endpoint_SlaveEndpointTest_NoAuthorizer_1_1vFRE8/store/appc" --authenticate_http_readonly="true"
--authenticate_http_readwrite="true" --authenticatee="crammd5" --authentication_backoff_factor="1secs"
--authorizer="local" --cgroups_cpu_enable_pids_and_tids_count="false" --cgroups_enable_cfs="false"
--cgroups_hierarchy="/sys/fs/cgroup" --cgroups_limit_swap="false" --cgroups_root="mesos" --container_disk_watch_interval="15secs"
--containerizers="mesos" --credential="/tmp/Endpoint_SlaveEndpointTest_NoAuthorizer_1_1vFRE8/credential"
--default_role="*" --disk_watch_interval="1mins" --docker="docker" --docker_kill_orphans="true"
--docker_registry="https://registry-1.docker.io" --docker_remove_delay="6hrs" --docker_socket="/var/run/docker.sock"
--docker_stop_timeout="0ns" --docker_store_dir="/tmp/Endpoint_SlaveEndpointTest_NoAuthorizer_1_1vFRE8/store/docker"
--docker_volume_checkpoint_dir="/var/run/mesos/isolators/docker/volume" --enforce_container_disk_quota="false"
--executor_registration_timeout="1mins" --executor_reregistration_timeout="2secs" --executor_shutdown_grace_period="5secs"
--fetcher_cache_dir="/tmp/Endpoint_SlaveEndpointTest_NoAuthorizer_1_1vFRE8/fetch" --fetcher_cache_size="2GB"
--frameworks_home="" --gc_delay="1weeks" --gc_disk_headroom="0.1" --hadoop_home="" --help="false"
--hostname_lookup="true" --http_command_executor="false" --http_credentials="/tmp/Endpoint_SlaveEndpointTest_NoAuthorizer_1_1vFRE8/http_credentials"
--http_heartbeat_interval="30secs" --initialize_driver_logging="true" --isolation="posix/cpu,posix/mem"
--launcher="posix" --launcher_dir="/mesos/mesos-1.4.0/_build/src" --logbufsecs="0" --logging_level="INFO"
--max_completed_executors_per_framework="150" --oversubscribed_resources_interval="15secs"
--perf_duration="10secs" --perf_interval="1mins" --port="5051" --qos_correction_interval_min="0ns"
--quiet="false" --recover="reconnect" --recovery_timeout="15mins" --registration_backoff_factor="10ms"
--resources="cpus:2;gpus:0;mem:1024;disk:1024;ports:[31000-32000]" --revocable_cpu_low_priority="true"
--runtime_dir="/tmp/Endpoint_SlaveEndpointTest_NoAuthorizer_1_1vFRE8" --sandbox_directory="/mnt/mesos/sandbox"
--strict="true" --switch_user="true" --systemd_enable_support="true" --systemd_runtime_directory="/run/systemd/system"
--version="false" --work_dir="/tmp/Endpoint_SlaveEndpointTest_NoAuthorizer_1_jrBZXc"
I0612 19:05:15.430882  4603 credentials.hpp:86] Loading credential for authentication from
'/tmp/Endpoint_SlaveEndpointTest_NoAuthorizer_1_1vFRE8/credential'
I0612 19:05:15.431419  4603 slave.cpp:281] Agent using credential for: test-principal
I0612 19:05:15.431684  4603 credentials.hpp:37] Loading credentials for authentication from
'/tmp/Endpoint_SlaveEndpointTest_NoAuthorizer_1_1vFRE8/http_credentials'
I0612 19:05:15.432258  4603 http.cpp:975] Creating default 'basic' HTTP authenticator for
realm 'mesos-agent-readonly'
I0612 19:05:15.432818  4603 http.cpp:975] Creating default 'basic' HTTP authenticator for
realm 'mesos-agent-readwrite'
I0612 19:05:15.435395  4603 slave.cpp:552] Agent resources: cpus(*):2; mem(*):1024; disk(*):1024;
ports(*):[31000-32000]
I0612 19:05:15.435822  4603 slave.cpp:560] Agent attributes: [  ]
I0612 19:05:15.435951  4603 slave.cpp:565] Agent hostname: 361c4817f7f9
I0612 19:05:15.436414  4605 status_update_manager.cpp:177] Pausing sending status updates
I0612 19:05:15.438444  4599 state.cpp:62] Recovering state from '/tmp/Endpoint_SlaveEndpointTest_NoAuthorizer_1_jrBZXc/meta'
I0612 19:05:15.439110  4601 status_update_manager.cpp:203] Recovering status update manager
I0612 19:05:15.439410  4606 containerizer.cpp:582] Recovering containerizer
I0612 19:05:15.441799  4606 provisioner.cpp:416] Provisioner recovery complete
I0612 19:05:15.442716  4602 slave.cpp:6127] Finished recovery
I0612 19:05:15.444119  4602 slave.cpp:6309] Querying resource estimator for oversubscribable
resources
I0612 19:05:15.445332  4602 slave.cpp:6323] Received oversubscribable resources {} from the
resource estimator
I0612 19:05:15.449615  4600 process.cpp:3778] Handling HTTP event for process 'slave(761)'
with path: '/slave(761)/monitor/statistics.json'
I0612 19:05:15.452214  4600 http.cpp:1115] HTTP GET for /slave(761)/monitor/statistics.json
from 172.17.0.2:39898
I0612 19:05:15.452643  4600 http.cpp:936] Authorizing principal 'test-principal' to GET the
'/monitor/statistics.json' endpoint
I0612 19:05:15.458602  4603 slave.cpp:817] Agent terminating
[       OK ] Endpoint/SlaveEndpointTest.NoAuthorizer/1 (50 ms)
[ RUN      ] Endpoint/SlaveEndpointTest.NoAuthorizer/2
I0612 19:05:15.473987  4580 containerizer.cpp:230] Using isolation: posix/cpu,posix/mem,filesystem/posix,network/cni,environment_secret
W0612 19:05:15.474789  4580 backend.cpp:76] Failed to create 'overlay' backend: OverlayBackend
requires root privileges
W0612 19:05:15.474972  4580 backend.cpp:76] Failed to create 'bind' backend: BindBackend requires
root privileges
I0612 19:05:15.475021  4580 provisioner.cpp:255] Using default backend 'copy'
I0612 19:05:15.477473  4580 cluster.cpp:448] Creating default 'local' authorizer
I0612 19:05:15.480084  4606 slave.cpp:248] Mesos agent started on (762)@172.17.0.2:35507
I0612 19:05:15.480571  4606 slave.cpp:249] Flags at startup: --acls="" --appc_simple_discovery_uri_prefix="http://"
--appc_store_dir="/tmp/Endpoint_SlaveEndpointTest_NoAuthorizer_2_hGSxSR/store/appc" --authenticate_http_readonly="true"
--authenticate_http_readwrite="true" --authenticatee="crammd5" --authentication_backoff_factor="1secs"
--authorizer="local" --cgroups_cpu_enable_pids_and_tids_count="false" --cgroups_enable_cfs="false"
--cgroups_hierarchy="/sys/fs/cgroup" --cgroups_limit_swap="false" --cgroups_root="mesos" --container_disk_watch_interval="15secs"
--containerizers="mesos" --credential="/tmp/Endpoint_SlaveEndpointTest_NoAuthorizer_2_hGSxSR/credential"
--default_role="*" --disk_watch_interval="1mins" --docker="docker" --docker_kill_orphans="true"
--docker_registry="https://registry-1.docker.io" --docker_remove_delay="6hrs" --docker_socket="/var/run/docker.sock"
--docker_stop_timeout="0ns" --docker_store_dir="/tmp/Endpoint_SlaveEndpointTest_NoAuthorizer_2_hGSxSR/store/docker"
--docker_volume_checkpoint_dir="/var/run/mesos/isolators/docker/volume" --enforce_container_disk_quota="false"
--executor_registration_timeout="1mins" --executor_reregistration_timeout="2secs" --executor_shutdown_grace_period="5secs"
--fetcher_cache_dir="/tmp/Endpoint_SlaveEndpointTest_NoAuthorizer_2_hGSxSR/fetch" --fetcher_cache_size="2GB"
--frameworks_home="" --gc_delay="1weeks" --gc_disk_headroom="0.1" --hadoop_home="" --help="false"
--hostname_lookup="true" --http_command_executor="false" --http_credentials="/tmp/Endpoint_SlaveEndpointTest_NoAuthorizer_2_hGSxSR/http_credentials"
--http_heartbeat_interval="30secs" --initialize_driver_logging="true" --isolation="posix/cpu,posix/mem"
--launcher="posix" --launcher_dir="/mesos/mesos-1.4.0/_build/src" --logbufsecs="0" --logging_level="INFO"
--max_completed_executors_per_framework="150" --oversubscribed_resources_interval="15secs"
--perf_duration="10secs" --perf_interval="1mins" --port="5051" --qos_correction_interval_min="0ns"
--quiet="false" --recover="reconnect" --recovery_timeout="15mins" --registration_backoff_factor="10ms"
--resources="cpus:2;gpus:0;mem:1024;disk:1024;ports:[31000-32000]" --revocable_cpu_low_priority="true"
--runtime_dir="/tmp/Endpoint_SlaveEndpointTest_NoAuthorizer_2_hGSxSR" --sandbox_directory="/mnt/mesos/sandbox"
--strict="true" --switch_user="true" --systemd_enable_support="true" --systemd_runtime_directory="/run/systemd/system"
--version="false" --work_dir="/tmp/Endpoint_SlaveEndpointTest_NoAuthorizer_2_Jm0s3V"
I0612 19:05:15.481551  4606 credentials.hpp:86] Loading credential for authentication from
'/tmp/Endpoint_SlaveEndpointTest_NoAuthorizer_2_hGSxSR/credential'
I0612 19:05:15.482208  4606 slave.cpp:281] Agent using credential for: test-principal
I0612 19:05:15.482512  4606 credentials.hpp:37] Loading credentials for authentication from
'/tmp/Endpoint_SlaveEndpointTest_NoAuthorizer_2_hGSxSR/http_credentials'
I0612 19:05:15.483078  4606 http.cpp:975] Creating default 'basic' HTTP authenticator for
realm 'mesos-agent-readonly'
I0612 19:05:15.483597  4606 http.cpp:975] Creating default 'basic' HTTP authenticator for
realm 'mesos-agent-readwrite'
I0612 19:05:15.486119  4606 slave.cpp:552] Agent resources: cpus(*):2; mem(*):1024; disk(*):1024;
ports(*):[31000-32000]
I0612 19:05:15.486500  4606 slave.cpp:560] Agent attributes: [  ]
I0612 19:05:15.486712  4606 slave.cpp:565] Agent hostname: 361c4817f7f9
I0612 19:05:15.487134  4604 status_update_manager.cpp:177] Pausing sending status updates
I0612 19:05:15.489392  4604 state.cpp:62] Recovering state from '/tmp/Endpoint_SlaveEndpointTest_NoAuthorizer_2_Jm0s3V/meta'
I0612 19:05:15.490077  4599 status_update_manager.cpp:203] Recovering status update manager
I0612 19:05:15.490499  4605 containerizer.cpp:582] Recovering containerizer
I0612 19:05:15.492771  4599 provisioner.cpp:416] Provisioner recovery complete
I0612 19:05:15.494302  4600 slave.cpp:6127] Finished recovery
I0612 19:05:15.495329  4600 slave.cpp:6309] Querying resource estimator for oversubscribable
resources
I0612 19:05:15.496098  4600 slave.cpp:6323] Received oversubscribable resources {} from the
resource estimator
I0612 19:05:15.500454  4604 process.cpp:3778] Handling HTTP event for process 'slave(762)'
with path: '/slave(762)/containers'
I0612 19:05:15.502811  4604 http.cpp:1115] HTTP GET for /slave(762)/containers from 172.17.0.2:39900
I0612 19:05:15.502933  4604 http.cpp:936] Authorizing principal 'test-principal' to GET the
'/containers' endpoint
I0612 19:05:15.511744  4601 slave.cpp:817] Agent terminating
[       OK ] Endpoint/SlaveEndpointTest.NoAuthorizer/2 (52 ms)
[----------] 9 tests from Endpoint/SlaveEndpointTest (496 ms total)

[----------] Global test environment tear-down
[==========] 1589 tests from 176 test cases ran. (724367 ms total)
[  PASSED  ] 1585 tests.
[  FAILED  ] 4 tests, listed below:
[  FAILED  ] DefaultExecutorCheckTest.CommandCheckDeliveredAndReconciled
[  FAILED  ] DefaultExecutorCheckTest.CommandCheckStatusChange
[  FAILED  ] DefaultExecutorCheckTest.CommandCheckSeesParentsEnv
[  FAILED  ] DefaultExecutorCheckTest.CommandCheckSharesWorkDirWithTask

 4 FAILED TESTS
  YOU HAVE 22 DISABLED TESTS

E0612 19:05:15.653584  4607 process.cpp:968] Failed to accept socket: future discarded
make[4]: *** [check-local] Error 1
make[4]: Leaving directory `/mesos/mesos-1.4.0/_build/src'
make[3]: *** [check-am] Error 2
make[3]: Leaving directory `/mesos/mesos-1.4.0/_build/src'
make[2]: *** [check] Error 2
make[2]: Leaving directory `/mesos/mesos-1.4.0/_build/src'
make[1]: *** [check-recursive] Error 1
make[1]: Leaving directory `/mesos/mesos-1.4.0/_build'
make: *** [distcheck] Error 1
+ docker rmi mesos-1497288439-15525
Untagged: mesos-1497288439-15525:latest
Deleted: sha256:f0c8f3baf7b7acc099a954aa3824997614271b9076aac6704066ff9cfff4e785
Deleted: sha256:f2e3969e094708f6a337d3669d067fd253157a767d4b9665388ea576dac63744
Deleted: sha256:f306af541d040ae7f5ad1b2988e51d84feba7e03568bf88fbced2de7f4055d43
Deleted: sha256:065ac264542807006ce07ae9abc72d94f894cf30bef7b12087cb104d20dcf6cc
Deleted: sha256:5318679c3ede4b6aac4cf299964c0c0ee6ad6192f48b7c63541ae19a1ad0461e
Deleted: sha256:3e317f3453ee20c3cc3ac26ecffd033072ac819d7a564992dc13e4b387afa5b1
Deleted: sha256:1bb3cf74d09a6ec57cac63e0ea375b6e28410f5b828b18b290c203a5755d49c5
Deleted: sha256:3b096fc223877e5ddd498394f03b32ee89af72c2742aa5125bb4a0e51ce8df91
Deleted: sha256:41b10071b68890edac3462cdee389b2242b09e4a3fd69ef7c339a9cf0c89d682
Deleted: sha256:43b5c458b855482e56649b6129e71fa8ae7fdf5efc4a28c1752d876517809975
Deleted: sha256:4c92e633fab00a2f5f555a45920100499d1f57f7225345c0c13722d52e5c5205
Deleted: sha256:8058c3eff8779ed188a463da78466bdef7e2bf15cdaa00a7b81c945483f29f4f
Deleted: sha256:3a3a87d96eafbc3f0e7a47f342a04ec39e4a17bb6e222b3fe3fef72b3e8afb33
Deleted: sha256:40e3195ca452e89ae964b68a5c4d65903ae5e6bc9d02e4dcfb2a4c6e6dd3b4e0
Deleted: sha256:ad3b96b3336e02cc660402ade359171817d7447cec0e200b232d930e679c24c6
Deleted: sha256:25e057106c7aa7353e5ba9101cc871f134cacec0c2ce9a2ea3e20c56c2d828f5
Deleted: sha256:8a90119879f12724f0f22dc1c1b18240b14d5b142e735a64dbebe3f42941c91a
Deleted: sha256:603a299da928ab04fa442e1c98baf933187126e8af7d8dfba5f0c67375dcf80e
Deleted: sha256:85b714b3cf7d12625bc53f1851b2e0e2e91f8cb31b8e1981b28142da0ad042f6
Deleted: sha256:317bf054716588c43b625ced38a5bd4612341e0b4c2d88ca6501a597f26db846
Deleted: sha256:75b4c500dec686f8573b60a57dd6c7578733159c67c201dcca76a74256d9d94b
Deleted: sha256:4267e810b46d31e837b95791a201ed283cb0b3056544ebdb200135a160a2b1ce
Deleted: sha256:26e923e8b43e426da45ba0e09c709f3841ed58a4a611feb8987e247f2037d799
Deleted: sha256:3b09a978631d5d6f12a8ec56dda1e4bf84606c0264881fefa4d62f126c84ef00
Build step 'Execute shell' marked build as failure

Mime
View raw message