mesos-builds mailing list archives

Site index · List index
Message view « Date » · « Thread »
Top « Date » · « Thread »
From Apache Jenkins Server <jenk...@builds.apache.org>
Subject Build failed in Jenkins: Mesos-Reviewbot #18387
Date Thu, 15 Jun 2017 00:49:30 GMT
See <https://builds.apache.org/job/Mesos-Reviewbot/18387/display/redirect>

------------------------------------------
[...truncated 28.43 MB...]
I0615 00:49:21.257342  4576 containerizer.cpp:230] Using isolation: posix/cpu,posix/mem,filesystem/posix,network/cni,environment_secret
W0615 00:49:21.258113  4576 backend.cpp:76] Failed to create 'overlay' backend: OverlayBackend
requires root privileges
W0615 00:49:21.258275  4576 backend.cpp:76] Failed to create 'bind' backend: BindBackend requires
root privileges
I0615 00:49:21.258317  4576 provisioner.cpp:255] Using default backend 'copy'
I0615 00:49:21.263537  4599 slave.cpp:248] Mesos agent started on (763)@172.17.0.2:33631
I0615 00:49:21.263628  4599 slave.cpp:249] Flags at startup: --acls="" --appc_simple_discovery_uri_prefix="http://"
--appc_store_dir="/tmp/Endpoint_SlaveEndpointTest_AuthorizedRequest_2_dVsTv9/store/appc" --authenticate_http_readonly="true"
--authenticate_http_readwrite="true" --authenticatee="crammd5" --authentication_backoff_factor="1secs"
--authorizer="local" --cgroups_cpu_enable_pids_and_tids_count="false" --cgroups_enable_cfs="false"
--cgroups_hierarchy="/sys/fs/cgroup" --cgroups_limit_swap="false" --cgroups_root="mesos" --container_disk_watch_interval="15secs"
--containerizers="mesos" --credential="/tmp/Endpoint_SlaveEndpointTest_AuthorizedRequest_2_dVsTv9/credential"
--default_role="*" --disk_watch_interval="1mins" --docker="docker" --docker_kill_orphans="true"
--docker_registry="https://registry-1.docker.io" --docker_remove_delay="6hrs" --docker_socket="/var/run/docker.sock"
--docker_stop_timeout="0ns" --docker_store_dir="/tmp/Endpoint_SlaveEndpointTest_AuthorizedRequest_2_dVsTv9/store/docker"
--docker_volume_checkpoint_dir="/var/run/mesos/isolators/docker/volume" --enforce_container_disk_quota="false"
--executor_registration_timeout="1mins" --executor_reregistration_timeout="2secs" --executor_shutdown_grace_period="5secs"
--fetcher_cache_dir="/tmp/Endpoint_SlaveEndpointTest_AuthorizedRequest_2_dVsTv9/fetch" --fetcher_cache_size="2GB"
--frameworks_home="" --gc_delay="1weeks" --gc_disk_headroom="0.1" --hadoop_home="" --help="false"
--hostname_lookup="true" --http_command_executor="false" --http_credentials="/tmp/Endpoint_SlaveEndpointTest_AuthorizedRequest_2_dVsTv9/http_credentials"
--http_heartbeat_interval="30secs" --initialize_driver_logging="true" --isolation="posix/cpu,posix/mem"
--launcher="posix" --launcher_dir="/mesos/mesos-1.4.0/_build/src" --logbufsecs="0" --logging_level="INFO"
--max_completed_executors_per_framework="150" --oversubscribed_resources_interval="15secs"
--perf_duration="10secs" --perf_interval="1mins" --port="5051" --qos_correction_interval_min="0ns"
--quiet="false" --recover="reconnect" --recovery_timeout="15mins" --registration_backoff_factor="10ms"
--resources="cpus:2;gpus:0;mem:1024;disk:1024;ports:[31000-32000]" --revocable_cpu_low_priority="true"
--runtime_dir="/tmp/Endpoint_SlaveEndpointTest_AuthorizedRequest_2_dVsTv9" --sandbox_directory="/mnt/mesos/sandbox"
--strict="true" --switch_user="true" --systemd_enable_support="true" --systemd_runtime_directory="/run/systemd/system"
--version="false" --work_dir="/tmp/Endpoint_SlaveEndpointTest_AuthorizedRequest_2_l5ZoG5"
I0615 00:49:21.264560  4599 credentials.hpp:86] Loading credential for authentication from
'/tmp/Endpoint_SlaveEndpointTest_AuthorizedRequest_2_dVsTv9/credential'
I0615 00:49:21.265264  4599 slave.cpp:281] Agent using credential for: test-principal
I0615 00:49:21.265399  4599 credentials.hpp:37] Loading credentials for authentication from
'/tmp/Endpoint_SlaveEndpointTest_AuthorizedRequest_2_dVsTv9/http_credentials'
I0615 00:49:21.266013  4599 http.cpp:975] Creating default 'basic' HTTP authenticator for
realm 'mesos-agent-readonly'
I0615 00:49:21.266520  4599 http.cpp:975] Creating default 'basic' HTTP authenticator for
realm 'mesos-agent-readwrite'
I0615 00:49:21.268908  4599 slave.cpp:552] Agent resources: cpus(*):2; mem(*):1024; disk(*):1024;
ports(*):[31000-32000]
I0615 00:49:21.269147  4599 slave.cpp:560] Agent attributes: [  ]
I0615 00:49:21.269220  4599 slave.cpp:565] Agent hostname: d2f34fa2456c
I0615 00:49:21.269529  4602 status_update_manager.cpp:177] Pausing sending status updates
I0615 00:49:21.271702  4602 state.cpp:62] Recovering state from '/tmp/Endpoint_SlaveEndpointTest_AuthorizedRequest_2_l5ZoG5/meta'
I0615 00:49:21.272372  4595 status_update_manager.cpp:203] Recovering status update manager
I0615 00:49:21.272606  4602 containerizer.cpp:582] Recovering containerizer
I0615 00:49:21.275126  4602 provisioner.cpp:416] Provisioner recovery complete
I0615 00:49:21.275880  4602 slave.cpp:6127] Finished recovery
I0615 00:49:21.276448  4602 slave.cpp:6309] Querying resource estimator for oversubscribable
resources
I0615 00:49:21.277313  4602 slave.cpp:6323] Received oversubscribable resources {} from the
resource estimator
I0615 00:49:21.281314  4600 process.cpp:3778] Handling HTTP event for process 'slave(763)'
with path: '/slave(763)/containers'
I0615 00:49:21.283437  4601 http.cpp:1115] HTTP GET for /slave(763)/containers from 172.17.0.2:39168
I0615 00:49:21.283560  4601 http.cpp:936] Authorizing principal 'test-principal' to GET the
'/containers' endpoint
I0615 00:49:21.290043  4597 slave.cpp:817] Agent terminating
[       OK ] Endpoint/SlaveEndpointTest.AuthorizedRequest/2 (48 ms)
[ RUN      ] Endpoint/SlaveEndpointTest.UnauthorizedRequest/0
I0615 00:49:21.305609  4576 containerizer.cpp:230] Using isolation: posix/cpu,posix/mem,filesystem/posix,network/cni,environment_secret
W0615 00:49:21.306393  4576 backend.cpp:76] Failed to create 'overlay' backend: OverlayBackend
requires root privileges
W0615 00:49:21.306558  4576 backend.cpp:76] Failed to create 'bind' backend: BindBackend requires
root privileges
I0615 00:49:21.306602  4576 provisioner.cpp:255] Using default backend 'copy'
I0615 00:49:21.313097  4596 slave.cpp:248] Mesos agent started on (764)@172.17.0.2:33631
I0615 00:49:21.313139  4596 slave.cpp:249] Flags at startup: --acls="" --appc_simple_discovery_uri_prefix="http://"
--appc_store_dir="/tmp/Endpoint_SlaveEndpointTest_UnauthorizedRequest_0_j6qtgp/store/appc"
--authenticate_http_readonly="true" --authenticate_http_readwrite="true" --authenticatee="crammd5"
--authentication_backoff_factor="1secs" --authorizer="local" --cgroups_cpu_enable_pids_and_tids_count="false"
--cgroups_enable_cfs="false" --cgroups_hierarchy="/sys/fs/cgroup" --cgroups_limit_swap="false"
--cgroups_root="mesos" --container_disk_watch_interval="15secs" --containerizers="mesos" --credential="/tmp/Endpoint_SlaveEndpointTest_UnauthorizedRequest_0_j6qtgp/credential"
--default_role="*" --disk_watch_interval="1mins" --docker="docker" --docker_kill_orphans="true"
--docker_registry="https://registry-1.docker.io" --docker_remove_delay="6hrs" --docker_socket="/var/run/docker.sock"
--docker_stop_timeout="0ns" --docker_store_dir="/tmp/Endpoint_SlaveEndpointTest_UnauthorizedRequest_0_j6qtgp/store/docker"
--docker_volume_checkpoint_dir="/var/run/mesos/isolators/docker/volume" --enforce_container_disk_quota="false"
--executor_registration_timeout="1mins" --executor_reregistration_timeout="2secs" --executor_shutdown_grace_period="5secs"
--fetcher_cache_dir="/tmp/Endpoint_SlaveEndpointTest_UnauthorizedRequest_0_j6qtgp/fetch" --fetcher_cache_size="2GB"
--frameworks_home="" --gc_delay="1weeks" --gc_disk_headroom="0.1" --hadoop_home="" --help="false"
--hostname_lookup="true" --http_command_executor="false" --http_credentials="/tmp/Endpoint_SlaveEndpointTest_UnauthorizedRequest_0_j6qtgp/http_credentials"
--http_heartbeat_interval="30secs" --initialize_driver_logging="true" --isolation="posix/cpu,posix/mem"
--launcher="posix" --launcher_dir="/mesos/mesos-1.4.0/_build/src" --logbufsecs="0" --logging_level="INFO"
--max_completed_executors_per_framework="150" --oversubscribed_resources_interval="15secs"
--perf_duration="10secs" --perf_interval="1mins" --port="5051" --qos_correction_interval_min="0ns"
--quiet="false" --recover="reconnect" --recovery_timeout="15mins" --registration_backoff_factor="10ms"
--resources="cpus:2;gpus:0;mem:1024;disk:1024;ports:[31000-32000]" --revocable_cpu_low_priority="true"
--runtime_dir="/tmp/Endpoint_SlaveEndpointTest_UnauthorizedRequest_0_j6qtgp" --sandbox_directory="/mnt/mesos/sandbox"
--strict="true" --switch_user="true" --systemd_enable_support="true" --systemd_runtime_directory="/run/systemd/system"
--version="false" --work_dir="/tmp/Endpoint_SlaveEndpointTest_UnauthorizedRequest_0_n0Kbjl"
I0615 00:49:21.313786  4596 credentials.hpp:86] Loading credential for authentication from
'/tmp/Endpoint_SlaveEndpointTest_UnauthorizedRequest_0_j6qtgp/credential'
I0615 00:49:21.314064  4596 slave.cpp:281] Agent using credential for: test-principal
I0615 00:49:21.314088  4596 credentials.hpp:37] Loading credentials for authentication from
'/tmp/Endpoint_SlaveEndpointTest_UnauthorizedRequest_0_j6qtgp/http_credentials'
I0615 00:49:21.314427  4596 http.cpp:975] Creating default 'basic' HTTP authenticator for
realm 'mesos-agent-readonly'
I0615 00:49:21.314635  4596 http.cpp:975] Creating default 'basic' HTTP authenticator for
realm 'mesos-agent-readwrite'
I0615 00:49:21.316591  4596 slave.cpp:552] Agent resources: cpus(*):2; mem(*):1024; disk(*):1024;
ports(*):[31000-32000]
I0615 00:49:21.316730  4596 slave.cpp:560] Agent attributes: [  ]
I0615 00:49:21.316751  4596 slave.cpp:565] Agent hostname: d2f34fa2456c
I0615 00:49:21.319247  4596 status_update_manager.cpp:177] Pausing sending status updates
I0615 00:49:21.320245  4596 state.cpp:62] Recovering state from '/tmp/Endpoint_SlaveEndpointTest_UnauthorizedRequest_0_n0Kbjl/meta'
I0615 00:49:21.320911  4596 status_update_manager.cpp:203] Recovering status update manager
I0615 00:49:21.321125  4596 containerizer.cpp:582] Recovering containerizer
I0615 00:49:21.323840  4596 provisioner.cpp:416] Provisioner recovery complete
I0615 00:49:21.324661  4598 slave.cpp:6127] Finished recovery
I0615 00:49:21.325289  4598 slave.cpp:6309] Querying resource estimator for oversubscribable
resources
I0615 00:49:21.325762  4602 slave.cpp:6323] Received oversubscribable resources {} from the
resource estimator
I0615 00:49:21.329736  4602 process.cpp:3778] Handling HTTP event for process 'slave(764)'
with path: '/slave(764)/monitor/statistics'
I0615 00:49:21.332170  4602 http.cpp:1115] HTTP GET for /slave(764)/monitor/statistics from
172.17.0.2:39170
I0615 00:49:21.332288  4602 http.cpp:936] Authorizing principal 'test-principal' to GET the
'/monitor/statistics' endpoint
I0615 00:49:21.335806  4600 slave.cpp:817] Agent terminating
[       OK ] Endpoint/SlaveEndpointTest.UnauthorizedRequest/0 (45 ms)
[ RUN      ] Endpoint/SlaveEndpointTest.UnauthorizedRequest/1
I0615 00:49:21.351505  4576 containerizer.cpp:230] Using isolation: posix/cpu,posix/mem,filesystem/posix,network/cni,environment_secret
W0615 00:49:21.352277  4576 backend.cpp:76] Failed to create 'overlay' backend: OverlayBackend
requires root privileges
W0615 00:49:21.352438  4576 backend.cpp:76] Failed to create 'bind' backend: BindBackend requires
root privileges
I0615 00:49:21.352479  4576 provisioner.cpp:255] Using default backend 'copy'
I0615 00:49:21.358757  4601 slave.cpp:248] Mesos agent started on (765)@172.17.0.2:33631
I0615 00:49:21.358800  4601 slave.cpp:249] Flags at startup: --acls="" --appc_simple_discovery_uri_prefix="http://"
--appc_store_dir="/tmp/Endpoint_SlaveEndpointTest_UnauthorizedRequest_1_bcK8oE/store/appc"
--authenticate_http_readonly="true" --authenticate_http_readwrite="true" --authenticatee="crammd5"
--authentication_backoff_factor="1secs" --authorizer="local" --cgroups_cpu_enable_pids_and_tids_count="false"
--cgroups_enable_cfs="false" --cgroups_hierarchy="/sys/fs/cgroup" --cgroups_limit_swap="false"
--cgroups_root="mesos" --container_disk_watch_interval="15secs" --containerizers="mesos" --credential="/tmp/Endpoint_SlaveEndpointTest_UnauthorizedRequest_1_bcK8oE/credential"
--default_role="*" --disk_watch_interval="1mins" --docker="docker" --docker_kill_orphans="true"
--docker_registry="https://registry-1.docker.io" --docker_remove_delay="6hrs" --docker_socket="/var/run/docker.sock"
--docker_stop_timeout="0ns" --docker_store_dir="/tmp/Endpoint_SlaveEndpointTest_UnauthorizedRequest_1_bcK8oE/store/docker"
--docker_volume_checkpoint_dir="/var/run/mesos/isolators/docker/volume" --enforce_container_disk_quota="false"
--executor_registration_timeout="1mins" --executor_reregistration_timeout="2secs" --executor_shutdown_grace_period="5secs"
--fetcher_cache_dir="/tmp/Endpoint_SlaveEndpointTest_UnauthorizedRequest_1_bcK8oE/fetch" --fetcher_cache_size="2GB"
--frameworks_home="" --gc_delay="1weeks" --gc_disk_headroom="0.1" --hadoop_home="" --help="false"
--hostname_lookup="true" --http_command_executor="false" --http_credentials="/tmp/Endpoint_SlaveEndpointTest_UnauthorizedRequest_1_bcK8oE/http_credentials"
--http_heartbeat_interval="30secs" --initialize_driver_logging="true" --isolation="posix/cpu,posix/mem"
--launcher="posix" --launcher_dir="/mesos/mesos-1.4.0/_build/src" --logbufsecs="0" --logging_level="INFO"
--max_completed_executors_per_framework="150" --oversubscribed_resources_interval="15secs"
--perf_duration="10secs" --perf_interval="1mins" --port="5051" --qos_correction_interval_min="0ns"
--quiet="false" --recover="reconnect" --recovery_timeout="15mins" --registration_backoff_factor="10ms"
--resources="cpus:2;gpus:0;mem:1024;disk:1024;ports:[31000-32000]" --revocable_cpu_low_priority="true"
--runtime_dir="/tmp/Endpoint_SlaveEndpointTest_UnauthorizedRequest_1_bcK8oE" --sandbox_directory="/mnt/mesos/sandbox"
--strict="true" --switch_user="true" --systemd_enable_support="true" --systemd_runtime_directory="/run/systemd/system"
--version="false" --work_dir="/tmp/Endpoint_SlaveEndpointTest_UnauthorizedRequest_1_vMjpkA"
I0615 00:49:21.359771  4601 credentials.hpp:86] Loading credential for authentication from
'/tmp/Endpoint_SlaveEndpointTest_UnauthorizedRequest_1_bcK8oE/credential'
I0615 00:49:21.360218  4601 slave.cpp:281] Agent using credential for: test-principal
I0615 00:49:21.360245  4601 credentials.hpp:37] Loading credentials for authentication from
'/tmp/Endpoint_SlaveEndpointTest_UnauthorizedRequest_1_bcK8oE/http_credentials'
I0615 00:49:21.360704  4601 http.cpp:975] Creating default 'basic' HTTP authenticator for
realm 'mesos-agent-readonly'
I0615 00:49:21.361063  4601 http.cpp:975] Creating default 'basic' HTTP authenticator for
realm 'mesos-agent-readwrite'
I0615 00:49:21.363191  4601 slave.cpp:552] Agent resources: cpus(*):2; mem(*):1024; disk(*):1024;
ports(*):[31000-32000]
I0615 00:49:21.363328  4601 slave.cpp:560] Agent attributes: [  ]
I0615 00:49:21.363348  4601 slave.cpp:565] Agent hostname: d2f34fa2456c
I0615 00:49:21.363773  4600 status_update_manager.cpp:177] Pausing sending status updates
I0615 00:49:21.365957  4595 state.cpp:62] Recovering state from '/tmp/Endpoint_SlaveEndpointTest_UnauthorizedRequest_1_vMjpkA/meta'
I0615 00:49:21.366627  4597 status_update_manager.cpp:203] Recovering status update manager
I0615 00:49:21.367055  4599 containerizer.cpp:582] Recovering containerizer
I0615 00:49:21.369640  4600 provisioner.cpp:416] Provisioner recovery complete
I0615 00:49:21.370431  4596 slave.cpp:6127] Finished recovery
I0615 00:49:21.371059  4596 slave.cpp:6309] Querying resource estimator for oversubscribable
resources
I0615 00:49:21.371603  4597 slave.cpp:6323] Received oversubscribable resources {} from the
resource estimator
I0615 00:49:21.376037  4601 process.cpp:3778] Handling HTTP event for process 'slave(765)'
with path: '/slave(765)/monitor/statistics.json'
I0615 00:49:21.378206  4596 http.cpp:1115] HTTP GET for /slave(765)/monitor/statistics.json
from 172.17.0.2:39172
I0615 00:49:21.378324  4596 http.cpp:936] Authorizing principal 'test-principal' to GET the
'/monitor/statistics.json' endpoint
I0615 00:49:21.382908  4597 slave.cpp:817] Agent terminating
[       OK ] Endpoint/SlaveEndpointTest.UnauthorizedRequest/1 (46 ms)
[ RUN      ] Endpoint/SlaveEndpointTest.UnauthorizedRequest/2
I0615 00:49:21.398562  4576 containerizer.cpp:230] Using isolation: posix/cpu,posix/mem,filesystem/posix,network/cni,environment_secret
W0615 00:49:21.399336  4576 backend.cpp:76] Failed to create 'overlay' backend: OverlayBackend
requires root privileges
W0615 00:49:21.399498  4576 backend.cpp:76] Failed to create 'bind' backend: BindBackend requires
root privileges
I0615 00:49:21.399539  4576 provisioner.cpp:255] Using default backend 'copy'
I0615 00:49:21.405972  4597 slave.cpp:248] Mesos agent started on (766)@172.17.0.2:33631
I0615 00:49:21.406013  4597 slave.cpp:249] Flags at startup: --acls="" --appc_simple_discovery_uri_prefix="http://"
--appc_store_dir="/tmp/Endpoint_SlaveEndpointTest_UnauthorizedRequest_2_35Cf8U/store/appc"
--authenticate_http_readonly="true" --authenticate_http_readwrite="true" --authenticatee="crammd5"
--authentication_backoff_factor="1secs" --authorizer="local" --cgroups_cpu_enable_pids_and_tids_count="false"
--cgroups_enable_cfs="false" --cgroups_hierarchy="/sys/fs/cgroup" --cgroups_limit_swap="false"
--cgroups_root="mesos" --container_disk_watch_interval="15secs" --containerizers="mesos" --credential="/tmp/Endpoint_SlaveEndpointTest_UnauthorizedRequest_2_35Cf8U/credential"
--default_role="*" --disk_watch_interval="1mins" --docker="docker" --docker_kill_orphans="true"
--docker_registry="https://registry-1.docker.io" --docker_remove_delay="6hrs" --docker_socket="/var/run/docker.sock"
--docker_stop_timeout="0ns" --docker_store_dir="/tmp/Endpoint_SlaveEndpointTest_UnauthorizedRequest_2_35Cf8U/store/docker"
--docker_volume_checkpoint_dir="/var/run/mesos/isolators/docker/volume" --enforce_container_disk_quota="false"
--executor_registration_timeout="1mins" --executor_reregistration_timeout="2secs" --executor_shutdown_grace_period="5secs"
--fetcher_cache_dir="/tmp/Endpoint_SlaveEndpointTest_UnauthorizedRequest_2_35Cf8U/fetch" --fetcher_cache_size="2GB"
--frameworks_home="" --gc_delay="1weeks" --gc_disk_headroom="0.1" --hadoop_home="" --help="false"
--hostname_lookup="true" --http_command_executor="false" --http_credentials="/tmp/Endpoint_SlaveEndpointTest_UnauthorizedRequest_2_35Cf8U/http_credentials"
--http_heartbeat_interval="30secs" --initialize_driver_logging="true" --isolation="posix/cpu,posix/mem"
--launcher="posix" --launcher_dir="/mesos/mesos-1.4.0/_build/src" --logbufsecs="0" --logging_level="INFO"
--max_completed_executors_per_framework="150" --oversubscribed_resources_interval="15secs"
--perf_duration="10secs" --perf_interval="1mins" --port="5051" --qos_correction_interval_min="0ns"
--quiet="false" --recover="reconnect" --recovery_timeout="15mins" --registration_backoff_factor="10ms"
--resources="cpus:2;gpus:0;mem:1024;disk:1024;ports:[31000-32000]" --revocable_cpu_low_priority="true"
--runtime_dir="/tmp/Endpoint_SlaveEndpointTest_UnauthorizedRequest_2_35Cf8U" --sandbox_directory="/mnt/mesos/sandbox"
--strict="true" --switch_user="true" --systemd_enable_support="true" --systemd_runtime_directory="/run/systemd/system"
--version="false" --work_dir="/tmp/Endpoint_SlaveEndpointTest_UnauthorizedRequest_2_BBETVQ"
I0615 00:49:21.406819  4597 credentials.hpp:86] Loading credential for authentication from
'/tmp/Endpoint_SlaveEndpointTest_UnauthorizedRequest_2_35Cf8U/credential'
I0615 00:49:21.407189  4597 slave.cpp:281] Agent using credential for: test-principal
I0615 00:49:21.407217  4597 credentials.hpp:37] Loading credentials for authentication from
'/tmp/Endpoint_SlaveEndpointTest_UnauthorizedRequest_2_35Cf8U/http_credentials'
I0615 00:49:21.407694  4597 http.cpp:975] Creating default 'basic' HTTP authenticator for
realm 'mesos-agent-readonly'
I0615 00:49:21.408043  4597 http.cpp:975] Creating default 'basic' HTTP authenticator for
realm 'mesos-agent-readwrite'
I0615 00:49:21.410073  4597 slave.cpp:552] Agent resources: cpus(*):2; mem(*):1024; disk(*):1024;
ports(*):[31000-32000]
I0615 00:49:21.410223  4597 slave.cpp:560] Agent attributes: [  ]
I0615 00:49:21.410243  4597 slave.cpp:565] Agent hostname: d2f34fa2456c
I0615 00:49:21.410995  4599 status_update_manager.cpp:177] Pausing sending status updates
I0615 00:49:21.412876  4598 state.cpp:62] Recovering state from '/tmp/Endpoint_SlaveEndpointTest_UnauthorizedRequest_2_BBETVQ/meta'
I0615 00:49:21.413431  4595 status_update_manager.cpp:203] Recovering status update manager
I0615 00:49:21.413808  4595 containerizer.cpp:582] Recovering containerizer
I0615 00:49:21.415853  4599 provisioner.cpp:416] Provisioner recovery complete
I0615 00:49:21.417016  4599 slave.cpp:6127] Finished recovery
I0615 00:49:21.417865  4599 slave.cpp:6309] Querying resource estimator for oversubscribable
resources
I0615 00:49:21.418941  4599 slave.cpp:6323] Received oversubscribable resources {} from the
resource estimator
I0615 00:49:21.423158  4602 process.cpp:3778] Handling HTTP event for process 'slave(766)'
with path: '/slave(766)/containers'
I0615 00:49:21.426389  4602 http.cpp:1115] HTTP GET for /slave(766)/containers from 172.17.0.2:39174
I0615 00:49:21.426515  4602 http.cpp:936] Authorizing principal 'test-principal' to GET the
'/containers' endpoint
I0615 00:49:21.431664  4598 slave.cpp:817] Agent terminating
[       OK ] Endpoint/SlaveEndpointTest.UnauthorizedRequest/2 (48 ms)
[ RUN      ] Endpoint/SlaveEndpointTest.NoAuthorizer/0
I0615 00:49:21.448323  4576 containerizer.cpp:230] Using isolation: posix/cpu,posix/mem,filesystem/posix,network/cni,environment_secret
W0615 00:49:21.449204  4576 backend.cpp:76] Failed to create 'overlay' backend: OverlayBackend
requires root privileges
W0615 00:49:21.449424  4576 backend.cpp:76] Failed to create 'bind' backend: BindBackend requires
root privileges
I0615 00:49:21.449488  4576 provisioner.cpp:255] Using default backend 'copy'
I0615 00:49:21.453047  4576 cluster.cpp:448] Creating default 'local' authorizer
I0615 00:49:21.455685  4597 slave.cpp:248] Mesos agent started on (767)@172.17.0.2:33631
I0615 00:49:21.455736  4597 slave.cpp:249] Flags at startup: --acls="" --appc_simple_discovery_uri_prefix="http://"
--appc_store_dir="/tmp/Endpoint_SlaveEndpointTest_NoAuthorizer_0_tdoDmc/store/appc" --authenticate_http_readonly="true"
--authenticate_http_readwrite="true" --authenticatee="crammd5" --authentication_backoff_factor="1secs"
--authorizer="local" --cgroups_cpu_enable_pids_and_tids_count="false" --cgroups_enable_cfs="false"
--cgroups_hierarchy="/sys/fs/cgroup" --cgroups_limit_swap="false" --cgroups_root="mesos" --container_disk_watch_interval="15secs"
--containerizers="mesos" --credential="/tmp/Endpoint_SlaveEndpointTest_NoAuthorizer_0_tdoDmc/credential"
--default_role="*" --disk_watch_interval="1mins" --docker="docker" --docker_kill_orphans="true"
--docker_registry="https://registry-1.docker.io" --docker_remove_delay="6hrs" --docker_socket="/var/run/docker.sock"
--docker_stop_timeout="0ns" --docker_store_dir="/tmp/Endpoint_SlaveEndpointTest_NoAuthorizer_0_tdoDmc/store/docker"
--docker_volume_checkpoint_dir="/var/run/mesos/isolators/docker/volume" --enforce_container_disk_quota="false"
--executor_registration_timeout="1mins" --executor_reregistration_timeout="2secs" --executor_shutdown_grace_period="5secs"
--fetcher_cache_dir="/tmp/Endpoint_SlaveEndpointTest_NoAuthorizer_0_tdoDmc/fetch" --fetcher_cache_size="2GB"
--frameworks_home="" --gc_delay="1weeks" --gc_disk_headroom="0.1" --hadoop_home="" --help="false"
--hostname_lookup="true" --http_command_executor="false" --http_credentials="/tmp/Endpoint_SlaveEndpointTest_NoAuthorizer_0_tdoDmc/http_credentials"
--http_heartbeat_interval="30secs" --initialize_driver_logging="true" --isolation="posix/cpu,posix/mem"
--launcher="posix" --launcher_dir="/mesos/mesos-1.4.0/_build/src" --logbufsecs="0" --logging_level="INFO"
--max_completed_executors_per_framework="150" --oversubscribed_resources_interval="15secs"
--perf_duration="10secs" --perf_interval="1mins" --port="5051" --qos_correction_interval_min="0ns"
--quiet="false" --recover="reconnect" --recovery_timeout="15mins" --registration_backoff_factor="10ms"
--resources="cpus:2;gpus:0;mem:1024;disk:1024;ports:[31000-32000]" --revocable_cpu_low_priority="true"
--runtime_dir="/tmp/Endpoint_SlaveEndpointTest_NoAuthorizer_0_tdoDmc" --sandbox_directory="/mnt/mesos/sandbox"
--strict="true" --switch_user="true" --systemd_enable_support="true" --systemd_runtime_directory="/run/systemd/system"
--version="false" --work_dir="/tmp/Endpoint_SlaveEndpointTest_NoAuthorizer_0_nMho27"
I0615 00:49:21.457208  4597 credentials.hpp:86] Loading credential for authentication from
'/tmp/Endpoint_SlaveEndpointTest_NoAuthorizer_0_tdoDmc/credential'
I0615 00:49:21.457850  4597 slave.cpp:281] Agent using credential for: test-principal
I0615 00:49:21.457887  4597 credentials.hpp:37] Loading credentials for authentication from
'/tmp/Endpoint_SlaveEndpointTest_NoAuthorizer_0_tdoDmc/http_credentials'
I0615 00:49:21.458703  4597 http.cpp:975] Creating default 'basic' HTTP authenticator for
realm 'mesos-agent-readonly'
I0615 00:49:21.459216  4597 http.cpp:975] Creating default 'basic' HTTP authenticator for
realm 'mesos-agent-readwrite'
I0615 00:49:21.467952  4597 slave.cpp:552] Agent resources: cpus(*):2; mem(*):1024; disk(*):1024;
ports(*):[31000-32000]
I0615 00:49:21.468096  4597 slave.cpp:560] Agent attributes: [  ]
I0615 00:49:21.468116  4597 slave.cpp:565] Agent hostname: d2f34fa2456c
I0615 00:49:21.468657  4599 status_update_manager.cpp:177] Pausing sending status updates
I0615 00:49:21.471012  4598 state.cpp:62] Recovering state from '/tmp/Endpoint_SlaveEndpointTest_NoAuthorizer_0_nMho27/meta'
I0615 00:49:21.471500  4598 status_update_manager.cpp:203] Recovering status update manager
I0615 00:49:21.471720  4596 containerizer.cpp:582] Recovering containerizer
I0615 00:49:21.474148  4600 provisioner.cpp:416] Provisioner recovery complete
I0615 00:49:21.475056  4600 slave.cpp:6127] Finished recovery
I0615 00:49:21.475930  4600 slave.cpp:6309] Querying resource estimator for oversubscribable
resources
I0615 00:49:21.476991  4600 slave.cpp:6323] Received oversubscribable resources {} from the
resource estimator
I0615 00:49:21.481729  4600 process.cpp:3778] Handling HTTP event for process 'slave(767)'
with path: '/slave(767)/monitor/statistics'
I0615 00:49:21.484386  4601 http.cpp:1115] HTTP GET for /slave(767)/monitor/statistics from
172.17.0.2:39176
I0615 00:49:21.484522  4601 http.cpp:936] Authorizing principal 'test-principal' to GET the
'/monitor/statistics' endpoint
I0615 00:49:21.494520  4601 slave.cpp:817] Agent terminating
[       OK ] Endpoint/SlaveEndpointTest.NoAuthorizer/0 (62 ms)
[ RUN      ] Endpoint/SlaveEndpointTest.NoAuthorizer/1
I0615 00:49:21.509960  4576 containerizer.cpp:230] Using isolation: posix/cpu,posix/mem,filesystem/posix,network/cni,environment_secret
W0615 00:49:21.510727  4576 backend.cpp:76] Failed to create 'overlay' backend: OverlayBackend
requires root privileges
W0615 00:49:21.510895  4576 backend.cpp:76] Failed to create 'bind' backend: BindBackend requires
root privileges
I0615 00:49:21.510942  4576 provisioner.cpp:255] Using default backend 'copy'
I0615 00:49:21.513486  4576 cluster.cpp:448] Creating default 'local' authorizer
I0615 00:49:21.516177  4596 slave.cpp:248] Mesos agent started on (768)@172.17.0.2:33631
I0615 00:49:21.516218  4596 slave.cpp:249] Flags at startup: --acls="" --appc_simple_discovery_uri_prefix="http://"
--appc_store_dir="/tmp/Endpoint_SlaveEndpointTest_NoAuthorizer_1_R5rNeu/store/appc" --authenticate_http_readonly="true"
--authenticate_http_readwrite="true" --authenticatee="crammd5" --authentication_backoff_factor="1secs"
--authorizer="local" --cgroups_cpu_enable_pids_and_tids_count="false" --cgroups_enable_cfs="false"
--cgroups_hierarchy="/sys/fs/cgroup" --cgroups_limit_swap="false" --cgroups_root="mesos" --container_disk_watch_interval="15secs"
--containerizers="mesos" --credential="/tmp/Endpoint_SlaveEndpointTest_NoAuthorizer_1_R5rNeu/credential"
--default_role="*" --disk_watch_interval="1mins" --docker="docker" --docker_kill_orphans="true"
--docker_registry="https://registry-1.docker.io" --docker_remove_delay="6hrs" --docker_socket="/var/run/docker.sock"
--docker_stop_timeout="0ns" --docker_store_dir="/tmp/Endpoint_SlaveEndpointTest_NoAuthorizer_1_R5rNeu/store/docker"
--docker_volume_checkpoint_dir="/var/run/mesos/isolators/docker/volume" --enforce_container_disk_quota="false"
--executor_registration_timeout="1mins" --executor_reregistration_timeout="2secs" --executor_shutdown_grace_period="5secs"
--fetcher_cache_dir="/tmp/Endpoint_SlaveEndpointTest_NoAuthorizer_1_R5rNeu/fetch" --fetcher_cache_size="2GB"
--frameworks_home="" --gc_delay="1weeks" --gc_disk_headroom="0.1" --hadoop_home="" --help="false"
--hostname_lookup="true" --http_command_executor="false" --http_credentials="/tmp/Endpoint_SlaveEndpointTest_NoAuthorizer_1_R5rNeu/http_credentials"
--http_heartbeat_interval="30secs" --initialize_driver_logging="true" --isolation="posix/cpu,posix/mem"
--launcher="posix" --launcher_dir="/mesos/mesos-1.4.0/_build/src" --logbufsecs="0" --logging_level="INFO"
--max_completed_executors_per_framework="150" --oversubscribed_resources_interval="15secs"
--perf_duration="10secs" --perf_interval="1mins" --port="5051" --qos_correction_interval_min="0ns"
--quiet="false" --recover="reconnect" --recovery_timeout="15mins" --registration_backoff_factor="10ms"
--resources="cpus:2;gpus:0;mem:1024;disk:1024;ports:[31000-32000]" --revocable_cpu_low_priority="true"
--runtime_dir="/tmp/Endpoint_SlaveEndpointTest_NoAuthorizer_1_R5rNeu" --sandbox_directory="/mnt/mesos/sandbox"
--strict="true" --switch_user="true" --systemd_enable_support="true" --systemd_runtime_directory="/run/systemd/system"
--version="false" --work_dir="/tmp/Endpoint_SlaveEndpointTest_NoAuthorizer_1_veAqKp"
I0615 00:49:21.517098  4596 credentials.hpp:86] Loading credential for authentication from
'/tmp/Endpoint_SlaveEndpointTest_NoAuthorizer_1_R5rNeu/credential'
I0615 00:49:21.517483  4596 slave.cpp:281] Agent using credential for: test-principal
I0615 00:49:21.517515  4596 credentials.hpp:37] Loading credentials for authentication from
'/tmp/Endpoint_SlaveEndpointTest_NoAuthorizer_1_R5rNeu/http_credentials'
I0615 00:49:21.517977  4596 http.cpp:975] Creating default 'basic' HTTP authenticator for
realm 'mesos-agent-readonly'
I0615 00:49:21.518312  4596 http.cpp:975] Creating default 'basic' HTTP authenticator for
realm 'mesos-agent-readwrite'
I0615 00:49:21.520409  4596 slave.cpp:552] Agent resources: cpus(*):2; mem(*):1024; disk(*):1024;
ports(*):[31000-32000]
I0615 00:49:21.520548  4596 slave.cpp:560] Agent attributes: [  ]
I0615 00:49:21.520567  4596 slave.cpp:565] Agent hostname: d2f34fa2456c
I0615 00:49:21.520980  4600 status_update_manager.cpp:177] Pausing sending status updates
I0615 00:49:21.522912  4599 state.cpp:62] Recovering state from '/tmp/Endpoint_SlaveEndpointTest_NoAuthorizer_1_veAqKp/meta'
I0615 00:49:21.523593  4595 status_update_manager.cpp:203] Recovering status update manager
I0615 00:49:21.523980  4596 containerizer.cpp:582] Recovering containerizer
I0615 00:49:21.526226  4599 provisioner.cpp:416] Provisioner recovery complete
I0615 00:49:21.526774  4595 slave.cpp:6127] Finished recovery
I0615 00:49:21.527456  4595 slave.cpp:6309] Querying resource estimator for oversubscribable
resources
I0615 00:49:21.527902  4601 slave.cpp:6323] Received oversubscribable resources {} from the
resource estimator
I0615 00:49:21.532183  4599 process.cpp:3778] Handling HTTP event for process 'slave(768)'
with path: '/slave(768)/monitor/statistics.json'
I0615 00:49:21.545797  4600 http.cpp:1115] HTTP GET for /slave(768)/monitor/statistics.json
from 172.17.0.2:39180
I0615 00:49:21.546083  4600 http.cpp:936] Authorizing principal 'test-principal' to GET the
'/monitor/statistics.json' endpoint
I0615 00:49:21.551365  4601 slave.cpp:817] Agent terminating
[       OK ] Endpoint/SlaveEndpointTest.NoAuthorizer/1 (56 ms)
[ RUN      ] Endpoint/SlaveEndpointTest.NoAuthorizer/2
I0615 00:49:21.566805  4576 containerizer.cpp:230] Using isolation: posix/cpu,posix/mem,filesystem/posix,network/cni,environment_secret
W0615 00:49:21.567596  4576 backend.cpp:76] Failed to create 'overlay' backend: OverlayBackend
requires root privileges
W0615 00:49:21.567770  4576 backend.cpp:76] Failed to create 'bind' backend: BindBackend requires
root privileges
I0615 00:49:21.567817  4576 provisioner.cpp:255] Using default backend 'copy'
I0615 00:49:21.570556  4576 cluster.cpp:448] Creating default 'local' authorizer
I0615 00:49:21.573228  4602 slave.cpp:248] Mesos agent started on (769)@172.17.0.2:33631
I0615 00:49:21.573276  4602 slave.cpp:249] Flags at startup: --acls="" --appc_simple_discovery_uri_prefix="http://"
--appc_store_dir="/tmp/Endpoint_SlaveEndpointTest_NoAuthorizer_2_XguVGM/store/appc" --authenticate_http_readonly="true"
--authenticate_http_readwrite="true" --authenticatee="crammd5" --authentication_backoff_factor="1secs"
--authorizer="local" --cgroups_cpu_enable_pids_and_tids_count="false" --cgroups_enable_cfs="false"
--cgroups_hierarchy="/sys/fs/cgroup" --cgroups_limit_swap="false" --cgroups_root="mesos" --container_disk_watch_interval="15secs"
--containerizers="mesos" --credential="/tmp/Endpoint_SlaveEndpointTest_NoAuthorizer_2_XguVGM/credential"
--default_role="*" --disk_watch_interval="1mins" --docker="docker" --docker_kill_orphans="true"
--docker_registry="https://registry-1.docker.io" --docker_remove_delay="6hrs" --docker_socket="/var/run/docker.sock"
--docker_stop_timeout="0ns" --docker_store_dir="/tmp/Endpoint_SlaveEndpointTest_NoAuthorizer_2_XguVGM/store/docker"
--docker_volume_checkpoint_dir="/var/run/mesos/isolators/docker/volume" --enforce_container_disk_quota="false"
--executor_registration_timeout="1mins" --executor_reregistration_timeout="2secs" --executor_shutdown_grace_period="5secs"
--fetcher_cache_dir="/tmp/Endpoint_SlaveEndpointTest_NoAuthorizer_2_XguVGM/fetch" --fetcher_cache_size="2GB"
--frameworks_home="" --gc_delay="1weeks" --gc_disk_headroom="0.1" --hadoop_home="" --help="false"
--hostname_lookup="true" --http_command_executor="false" --http_credentials="/tmp/Endpoint_SlaveEndpointTest_NoAuthorizer_2_XguVGM/http_credentials"
--http_heartbeat_interval="30secs" --initialize_driver_logging="true" --isolation="posix/cpu,posix/mem"
--launcher="posix" --launcher_dir="/mesos/mesos-1.4.0/_build/src" --logbufsecs="0" --logging_level="INFO"
--max_completed_executors_per_framework="150" --oversubscribed_resources_interval="15secs"
--perf_duration="10secs" --perf_interval="1mins" --port="5051" --qos_correction_interval_min="0ns"
--quiet="false" --recover="reconnect" --recovery_timeout="15mins" --registration_backoff_factor="10ms"
--resources="cpus:2;gpus:0;mem:1024;disk:1024;ports:[31000-32000]" --revocable_cpu_low_priority="true"
--runtime_dir="/tmp/Endpoint_SlaveEndpointTest_NoAuthorizer_2_XguVGM" --sandbox_directory="/mnt/mesos/sandbox"
--strict="true" --switch_user="true" --systemd_enable_support="true" --systemd_runtime_directory="/run/systemd/system"
--version="false" --work_dir="/tmp/Endpoint_SlaveEndpointTest_NoAuthorizer_2_77wl3H"
I0615 00:49:21.574167  4602 credentials.hpp:86] Loading credential for authentication from
'/tmp/Endpoint_SlaveEndpointTest_NoAuthorizer_2_XguVGM/credential'
I0615 00:49:21.574579  4602 slave.cpp:281] Agent using credential for: test-principal
I0615 00:49:21.574611  4602 credentials.hpp:37] Loading credentials for authentication from
'/tmp/Endpoint_SlaveEndpointTest_NoAuthorizer_2_XguVGM/http_credentials'
I0615 00:49:21.575076  4602 http.cpp:975] Creating default 'basic' HTTP authenticator for
realm 'mesos-agent-readonly'
I0615 00:49:21.575410  4602 http.cpp:975] Creating default 'basic' HTTP authenticator for
realm 'mesos-agent-readwrite'
I0615 00:49:21.577464  4602 slave.cpp:552] Agent resources: cpus(*):2; mem(*):1024; disk(*):1024;
ports(*):[31000-32000]
I0615 00:49:21.577603  4602 slave.cpp:560] Agent attributes: [  ]
I0615 00:49:21.577621  4602 slave.cpp:565] Agent hostname: d2f34fa2456c
I0615 00:49:21.577966  4601 status_update_manager.cpp:177] Pausing sending status updates
I0615 00:49:21.580016  4598 state.cpp:62] Recovering state from '/tmp/Endpoint_SlaveEndpointTest_NoAuthorizer_2_77wl3H/meta'
I0615 00:49:21.580533  4598 status_update_manager.cpp:203] Recovering status update manager
I0615 00:49:21.580902  4602 containerizer.cpp:582] Recovering containerizer
I0615 00:49:21.583081  4598 provisioner.cpp:416] Provisioner recovery complete
I0615 00:49:21.583560  4602 slave.cpp:6127] Finished recovery
I0615 00:49:21.584589  4602 slave.cpp:6309] Querying resource estimator for oversubscribable
resources
I0615 00:49:21.585099  4596 slave.cpp:6323] Received oversubscribable resources {} from the
resource estimator
I0615 00:49:21.589287  4596 process.cpp:3778] Handling HTTP event for process 'slave(769)'
with path: '/slave(769)/containers'
I0615 00:49:21.591696  4596 http.cpp:1115] HTTP GET for /slave(769)/containers from 172.17.0.2:39184
I0615 00:49:21.591986  4596 http.cpp:936] Authorizing principal 'test-principal' to GET the
'/containers' endpoint
I0615 00:49:21.597429  4576 slave.cpp:817] Agent terminating
[       OK ] Endpoint/SlaveEndpointTest.NoAuthorizer/2 (45 ms)
[----------] 9 tests from Endpoint/SlaveEndpointTest (446 ms total)

[----------] Global test environment tear-down
[==========] 1596 tests from 176 test cases ran. (740196 ms total)
[  PASSED  ] 1592 tests.
[  FAILED  ] 4 tests, listed below:
[  FAILED  ] DefaultExecutorCheckTest.CommandCheckDeliveredAndReconciled
[  FAILED  ] DefaultExecutorCheckTest.CommandCheckStatusChange
[  FAILED  ] DefaultExecutorCheckTest.CommandCheckSeesParentsEnv
[  FAILED  ] DefaultExecutorCheckTest.CommandCheckSharesWorkDirWithTask

 4 FAILED TESTS
  YOU HAVE 19 DISABLED TESTS

E0615 00:49:21.742663  4603 process.cpp:968] Failed to accept socket: future discarded
make[4]: *** [check-local] Error 1
make[4]: Leaving directory `/mesos/mesos-1.4.0/_build/src'
make[3]: *** [check-am] Error 2
make[3]: Leaving directory `/mesos/mesos-1.4.0/_build/src'
make[2]: *** [check] Error 2
make[2]: Leaving directory `/mesos/mesos-1.4.0/_build/src'
make[1]: *** [check-recursive] Error 1
make[1]: Leaving directory `/mesos/mesos-1.4.0/_build'
make: *** [distcheck] Error 1
+ docker rmi mesos-1497481537-13996
Untagged: mesos-1497481537-13996:latest
Deleted: sha256:ec122b84d625bf3e73c81a02ba46b38beb46979bd0a8a525a8d34ef4be6a5e37
Deleted: sha256:dcb5410e4de6864b7bde1f98c05d984e9c6e70616d59bee03885b3fc445b8ca1
Deleted: sha256:99d16e270db45cf993c52d9cff99600a2425f3bc3d911c11927211346ccdee58
Deleted: sha256:954da717ddaac7270fba687aa9664a0c71a50bbe9e4df028794fc41f321d1ab8
Deleted: sha256:a5041454828e6fc4f57532c764023a6cf829bea73775983f7738088b0381f695
Deleted: sha256:c292e4628c808743615996e947d5774632fcce3e7fd4f8ace638837d4582474f
Deleted: sha256:ceb7f84bf488e31921b73775a30f2560e4d47d9ed99a15c3b7b4da130123c845
Deleted: sha256:a5366a2ca1d5790d9914c6c07d2774f6d28636e59abfc846c3a9692f03548667
Deleted: sha256:3e4afd4dea2580e4e1f0c008369e2d1f7767cccf57e0daaf93ba5c6f79708168
Deleted: sha256:323784b151f4845875c2ba4e6f6ab810345c701398810f48a810d88b9824e7c5
Deleted: sha256:39f38257819e268703fe7ea32daa1a8cb6480efaf3a379965b4061812693600b
Deleted: sha256:c058b2ec165846158b17bc7763b7a85ef4aa19cbf530c4fa0d346c38dc3ff961
Deleted: sha256:40a2b90dd731de11076b1691ccb1a7a798834c1920c59f1bdf0ee6425554c638
Deleted: sha256:cc13b3005709b21c43c944416fab19f5e9063bf25e2a298f5d91e5a9d59bdbef
Deleted: sha256:f8c811e469119a483146ca68e43de567d98c61fe61502ff925ae4b3820863762
Deleted: sha256:f61424d71080eec53b3c849f4f34eecb58cabbca3951f1b0e29721f7477b4217
Deleted: sha256:04981af50694d3cf434f353299c0af3ff19f38e022db42aa00b27460c20adbb8
Deleted: sha256:d5b731e7f1d101f0285213dec4d1812fe30370b193289f35f02d87a551075d62
Deleted: sha256:31b5a3172da4035e4f4c8a5a320152470c1d42a8ba9d77b86abc46011751a445
Deleted: sha256:6f239ddab588256b6adab1b64cb047db5116585b6727ae8a733d95f460bbd455
Deleted: sha256:b57a36a1bf873cad5283789a790e34ffb85e415a696b75392556789db5705bd6
Deleted: sha256:4c8282ff4971d63f030843df7717732a73cfe4b0f3778319c43f0988575b158b
Deleted: sha256:503a47dedd5ed58a6cd3636b7e6f675ffe48434ba7f06ef843da297047a804b5
Deleted: sha256:9fb6bc8fd7603d9915cc1241dc241daef8f1227e66ca21bc203ca652ae4c9d92
Build step 'Execute shell' marked build as failure

Mime
View raw message