mesos-builds mailing list archives

Site index · List index
Message view « Date » · « Thread »
Top « Date » · « Thread »
From Apache Jenkins Server <jenk...@builds.apache.org>
Subject Build failed in Jenkins: Mesos-Buildbot » autotools,gcc,--verbose,GLOG_v=1 MESOS_VERBOSE=1,ubuntu:14.04,(ubuntu)&&(!ubuntu-us1)&&(!ubuntu-eu2) #3841
Date Tue, 27 Jun 2017 05:27:22 GMT
See <https://builds.apache.org/job/Mesos-Buildbot/BUILDTOOL=autotools,COMPILER=gcc,CONFIGURATION=--verbose,ENVIRONMENT=GLOG_v=1%20MESOS_VERBOSE=1,OS=ubuntu%3A14.04,label_exp=(ubuntu)&&(!ubuntu-us1)&&(!ubuntu-eu2)/3841/display/redirect?page=changes>

Changes:

[neil.conway] Cleaned up zookeeper binding code slightly.

[neil.conway] Fixed bug in GroupTest.ConnectTimer, GroupTest.TimerCleanup.

------------------------------------------
[...truncated 29.48 MB...]
[       OK ] Endpoint/SlaveEndpointTest.AuthorizedRequest/1 (42 ms)
[ RUN      ] Endpoint/SlaveEndpointTest.AuthorizedRequest/2
I0627 05:27:15.955732  4917 containerizer.cpp:230] Using isolation: posix/cpu,posix/mem,filesystem/posix,network/cni,environment_secret
W0627 05:27:15.956815  4917 backend.cpp:76] Failed to create 'aufs' backend: AufsBackend requires
root privileges
W0627 05:27:15.957109  4917 backend.cpp:76] Failed to create 'bind' backend: BindBackend requires
root privileges
I0627 05:27:15.957316  4917 provisioner.cpp:255] Using default backend 'copy'
I0627 05:27:15.961978  4938 slave.cpp:249] Mesos agent started on (770)@172.17.0.4:41747
I0627 05:27:15.962004  4938 slave.cpp:250] Flags at startup: --acls="" --appc_simple_discovery_uri_prefix="http://"
--appc_store_dir="/tmp/Endpoint_SlaveEndpointTest_AuthorizedRequest_2_FZmP9T/store/appc" --authenticate_http_readonly="true"
--authenticate_http_readwrite="true" --authenticatee="crammd5" --authentication_backoff_factor="1secs"
--authorizer="local" --cgroups_cpu_enable_pids_and_tids_count="false" --cgroups_enable_cfs="false"
--cgroups_hierarchy="/sys/fs/cgroup" --cgroups_limit_swap="false" --cgroups_root="mesos" --container_disk_watch_interval="15secs"
--containerizers="mesos" --credential="/tmp/Endpoint_SlaveEndpointTest_AuthorizedRequest_2_FZmP9T/credential"
--default_role="*" --disk_watch_interval="1mins" --docker="docker" --docker_kill_orphans="true"
--docker_registry="https://registry-1.docker.io" --docker_remove_delay="6hrs" --docker_socket="/var/run/docker.sock"
--docker_stop_timeout="0ns" --docker_store_dir="/tmp/Endpoint_SlaveEndpointTest_AuthorizedRequest_2_FZmP9T/store/docker"
--docker_volume_checkpoint_dir="/var/run/mesos/isolators/docker/volume" --enforce_container_disk_quota="false"
--executor_registration_timeout="1mins" --executor_reregistration_timeout="2secs" --executor_shutdown_grace_period="5secs"
--fetcher_cache_dir="/tmp/Endpoint_SlaveEndpointTest_AuthorizedRequest_2_FZmP9T/fetch" --fetcher_cache_size="2GB"
--frameworks_home="" --gc_delay="1weeks" --gc_disk_headroom="0.1" --hadoop_home="" --help="false"
--hostname_lookup="true" --http_command_executor="false" --http_credentials="/tmp/Endpoint_SlaveEndpointTest_AuthorizedRequest_2_FZmP9T/http_credentials"
--http_heartbeat_interval="30secs" --initialize_driver_logging="true" --isolation="posix/cpu,posix/mem"
--launcher="posix" --launcher_dir="/mesos/mesos-1.4.0/_build/src" --logbufsecs="0" --logging_level="INFO"
--max_completed_executors_per_framework="150" --oversubscribed_resources_interval="15secs"
--perf_duration="10secs" --perf_interval="1mins" --port="5051" --qos_correction_interval_min="0ns"
--quiet="false" --recover="reconnect" --recovery_timeout="15mins" --registration_backoff_factor="10ms"
--resources="cpus:2;gpus:0;mem:1024;disk:1024;ports:[31000-32000]" --revocable_cpu_low_priority="true"
--runtime_dir="/tmp/Endpoint_SlaveEndpointTest_AuthorizedRequest_2_FZmP9T" --sandbox_directory="/mnt/mesos/sandbox"
--strict="true" --switch_user="true" --systemd_enable_support="true" --systemd_runtime_directory="/run/systemd/system"
--version="false" --work_dir="/tmp/Endpoint_SlaveEndpointTest_AuthorizedRequest_2_XFZXiG"
I0627 05:27:15.962441  4938 credentials.hpp:86] Loading credential for authentication from
'/tmp/Endpoint_SlaveEndpointTest_AuthorizedRequest_2_FZmP9T/credential'
I0627 05:27:15.962620  4938 slave.cpp:282] Agent using credential for: test-principal
I0627 05:27:15.962638  4938 credentials.hpp:37] Loading credentials for authentication from
'/tmp/Endpoint_SlaveEndpointTest_AuthorizedRequest_2_FZmP9T/http_credentials'
I0627 05:27:15.962905  4938 http.cpp:974] Creating default 'basic' HTTP authenticator for
realm 'mesos-agent-readonly'
I0627 05:27:15.963264  4938 http.cpp:974] Creating default 'basic' HTTP authenticator for
realm 'mesos-agent-readwrite'
I0627 05:27:15.964781  4938 slave.cpp:553] Agent resources: [{"name":"cpus","scalar":{"value":2.0},"type":"SCALAR"},{"name":"mem","scalar":{"value":1024.0},"type":"SCALAR"},{"name":"disk","scalar":{"value":1024.0},"type":"SCALAR"},{"name":"ports","ranges":{"range":[{"begin":31000,"end":32000}]},"type":"RANGES"}]
I0627 05:27:15.965051  4938 slave.cpp:561] Agent attributes: [  ]
I0627 05:27:15.965065  4938 slave.cpp:566] Agent hostname: c43debbe7e32
I0627 05:27:15.965201  4956 status_update_manager.cpp:177] Pausing sending status updates
I0627 05:27:15.966766  4943 state.cpp:64] Recovering state from '/tmp/Endpoint_SlaveEndpointTest_AuthorizedRequest_2_XFZXiG/meta'
I0627 05:27:15.967191  4950 status_update_manager.cpp:203] Recovering status update manager
I0627 05:27:15.967456  4940 containerizer.cpp:582] Recovering containerizer
I0627 05:27:15.969413  4953 provisioner.cpp:416] Provisioner recovery complete
I0627 05:27:15.969907  4938 slave.cpp:6168] Finished recovery
I0627 05:27:15.970630  4938 slave.cpp:6350] Querying resource estimator for oversubscribable
resources
I0627 05:27:15.971024  4945 slave.cpp:6364] Received oversubscribable resources {} from the
resource estimator
I0627 05:27:15.974545  4937 process.cpp:3779] Handling HTTP event for process 'slave(770)'
with path: '/slave(770)/containers'
I0627 05:27:15.976706  4937 http.cpp:1114] HTTP GET for /slave(770)/containers from 172.17.0.4:43042
I0627 05:27:15.978302  4937 http.cpp:935] Authorizing principal 'test-principal' to GET the
'/containers' endpoint
I0627 05:27:15.982163  4939 slave.cpp:818] Agent terminating
[       OK ] Endpoint/SlaveEndpointTest.AuthorizedRequest/2 (40 ms)
[ RUN      ] Endpoint/SlaveEndpointTest.UnauthorizedRequest/0
I0627 05:27:15.996327  4917 containerizer.cpp:230] Using isolation: posix/cpu,posix/mem,filesystem/posix,network/cni,environment_secret
W0627 05:27:15.997117  4917 backend.cpp:76] Failed to create 'aufs' backend: AufsBackend requires
root privileges
W0627 05:27:15.997268  4917 backend.cpp:76] Failed to create 'bind' backend: BindBackend requires
root privileges
I0627 05:27:15.997313  4917 provisioner.cpp:255] Using default backend 'copy'
I0627 05:27:16.001147  4953 slave.cpp:249] Mesos agent started on (771)@172.17.0.4:41747
I0627 05:27:16.001168  4953 slave.cpp:250] Flags at startup: --acls="" --appc_simple_discovery_uri_prefix="http://"
--appc_store_dir="/tmp/Endpoint_SlaveEndpointTest_UnauthorizedRequest_0_3UfJTN/store/appc"
--authenticate_http_readonly="true" --authenticate_http_readwrite="true" --authenticatee="crammd5"
--authentication_backoff_factor="1secs" --authorizer="local" --cgroups_cpu_enable_pids_and_tids_count="false"
--cgroups_enable_cfs="false" --cgroups_hierarchy="/sys/fs/cgroup" --cgroups_limit_swap="false"
--cgroups_root="mesos" --container_disk_watch_interval="15secs" --containerizers="mesos" --credential="/tmp/Endpoint_SlaveEndpointTest_UnauthorizedRequest_0_3UfJTN/credential"
--default_role="*" --disk_watch_interval="1mins" --docker="docker" --docker_kill_orphans="true"
--docker_registry="https://registry-1.docker.io" --docker_remove_delay="6hrs" --docker_socket="/var/run/docker.sock"
--docker_stop_timeout="0ns" --docker_store_dir="/tmp/Endpoint_SlaveEndpointTest_UnauthorizedRequest_0_3UfJTN/store/docker"
--docker_volume_checkpoint_dir="/var/run/mesos/isolators/docker/volume" --enforce_container_disk_quota="false"
--executor_registration_timeout="1mins" --executor_reregistration_timeout="2secs" --executor_shutdown_grace_period="5secs"
--fetcher_cache_dir="/tmp/Endpoint_SlaveEndpointTest_UnauthorizedRequest_0_3UfJTN/fetch" --fetcher_cache_size="2GB"
--frameworks_home="" --gc_delay="1weeks" --gc_disk_headroom="0.1" --hadoop_home="" --help="false"
--hostname_lookup="true" --http_command_executor="false" --http_credentials="/tmp/Endpoint_SlaveEndpointTest_UnauthorizedRequest_0_3UfJTN/http_credentials"
--http_heartbeat_interval="30secs" --initialize_driver_logging="true" --isolation="posix/cpu,posix/mem"
--launcher="posix" --launcher_dir="/mesos/mesos-1.4.0/_build/src" --logbufsecs="0" --logging_level="INFO"
--max_completed_executors_per_framework="150" --oversubscribed_resources_interval="15secs"
--perf_duration="10secs" --perf_interval="1mins" --port="5051" --qos_correction_interval_min="0ns"
--quiet="false" --recover="reconnect" --recovery_timeout="15mins" --registration_backoff_factor="10ms"
--resources="cpus:2;gpus:0;mem:1024;disk:1024;ports:[31000-32000]" --revocable_cpu_low_priority="true"
--runtime_dir="/tmp/Endpoint_SlaveEndpointTest_UnauthorizedRequest_0_3UfJTN" --sandbox_directory="/mnt/mesos/sandbox"
--strict="true" --switch_user="true" --systemd_enable_support="true" --systemd_runtime_directory="/run/systemd/system"
--version="false" --work_dir="/tmp/Endpoint_SlaveEndpointTest_UnauthorizedRequest_0_DbKNWz"
I0627 05:27:16.001596  4953 credentials.hpp:86] Loading credential for authentication from
'/tmp/Endpoint_SlaveEndpointTest_UnauthorizedRequest_0_3UfJTN/credential'
I0627 05:27:16.001817  4953 slave.cpp:282] Agent using credential for: test-principal
I0627 05:27:16.001840  4953 credentials.hpp:37] Loading credentials for authentication from
'/tmp/Endpoint_SlaveEndpointTest_UnauthorizedRequest_0_3UfJTN/http_credentials'
I0627 05:27:16.002106  4953 http.cpp:974] Creating default 'basic' HTTP authenticator for
realm 'mesos-agent-readonly'
I0627 05:27:16.002341  4953 http.cpp:974] Creating default 'basic' HTTP authenticator for
realm 'mesos-agent-readwrite'
I0627 05:27:16.003967  4953 slave.cpp:553] Agent resources: [{"name":"cpus","scalar":{"value":2.0},"type":"SCALAR"},{"name":"mem","scalar":{"value":1024.0},"type":"SCALAR"},{"name":"disk","scalar":{"value":1024.0},"type":"SCALAR"},{"name":"ports","ranges":{"range":[{"begin":31000,"end":32000}]},"type":"RANGES"}]
I0627 05:27:16.004240  4953 slave.cpp:561] Agent attributes: [  ]
I0627 05:27:16.004300  4953 slave.cpp:566] Agent hostname: c43debbe7e32
I0627 05:27:16.004441  4952 status_update_manager.cpp:177] Pausing sending status updates
I0627 05:27:16.005903  4952 state.cpp:64] Recovering state from '/tmp/Endpoint_SlaveEndpointTest_UnauthorizedRequest_0_DbKNWz/meta'
I0627 05:27:16.006213  4941 status_update_manager.cpp:203] Recovering status update manager
I0627 05:27:16.006444  4954 containerizer.cpp:582] Recovering containerizer
I0627 05:27:16.008046  4937 provisioner.cpp:416] Provisioner recovery complete
I0627 05:27:16.008471  4936 slave.cpp:6168] Finished recovery
I0627 05:27:16.008987  4936 slave.cpp:6350] Querying resource estimator for oversubscribable
resources
I0627 05:27:16.009212  4952 slave.cpp:6364] Received oversubscribable resources {} from the
resource estimator
I0627 05:27:16.011488  4945 process.cpp:3779] Handling HTTP event for process 'slave(771)'
with path: '/slave(771)/monitor/statistics'
I0627 05:27:16.012908  4936 http.cpp:1114] HTTP GET for /slave(771)/monitor/statistics from
172.17.0.4:43044
I0627 05:27:16.012981  4936 http.cpp:935] Authorizing principal 'test-principal' to GET the
'/monitor/statistics' endpoint
I0627 05:27:16.015971  4954 slave.cpp:818] Agent terminating
[       OK ] Endpoint/SlaveEndpointTest.UnauthorizedRequest/0 (31 ms)
[ RUN      ] Endpoint/SlaveEndpointTest.UnauthorizedRequest/1
I0627 05:27:16.025094  4917 containerizer.cpp:230] Using isolation: posix/cpu,posix/mem,filesystem/posix,network/cni,environment_secret
W0627 05:27:16.025584  4917 backend.cpp:76] Failed to create 'aufs' backend: AufsBackend requires
root privileges
W0627 05:27:16.025696  4917 backend.cpp:76] Failed to create 'bind' backend: BindBackend requires
root privileges
I0627 05:27:16.025871  4917 provisioner.cpp:255] Using default backend 'copy'
I0627 05:27:16.028798  4950 slave.cpp:249] Mesos agent started on (772)@172.17.0.4:41747
I0627 05:27:16.028820  4950 slave.cpp:250] Flags at startup: --acls="" --appc_simple_discovery_uri_prefix="http://"
--appc_store_dir="/tmp/Endpoint_SlaveEndpointTest_UnauthorizedRequest_1_N2BUWH/store/appc"
--authenticate_http_readonly="true" --authenticate_http_readwrite="true" --authenticatee="crammd5"
--authentication_backoff_factor="1secs" --authorizer="local" --cgroups_cpu_enable_pids_and_tids_count="false"
--cgroups_enable_cfs="false" --cgroups_hierarchy="/sys/fs/cgroup" --cgroups_limit_swap="false"
--cgroups_root="mesos" --container_disk_watch_interval="15secs" --containerizers="mesos" --credential="/tmp/Endpoint_SlaveEndpointTest_UnauthorizedRequest_1_N2BUWH/credential"
--default_role="*" --disk_watch_interval="1mins" --docker="docker" --docker_kill_orphans="true"
--docker_registry="https://registry-1.docker.io" --docker_remove_delay="6hrs" --docker_socket="/var/run/docker.sock"
--docker_stop_timeout="0ns" --docker_store_dir="/tmp/Endpoint_SlaveEndpointTest_UnauthorizedRequest_1_N2BUWH/store/docker"
--docker_volume_checkpoint_dir="/var/run/mesos/isolators/docker/volume" --enforce_container_disk_quota="false"
--executor_registration_timeout="1mins" --executor_reregistration_timeout="2secs" --executor_shutdown_grace_period="5secs"
--fetcher_cache_dir="/tmp/Endpoint_SlaveEndpointTest_UnauthorizedRequest_1_N2BUWH/fetch" --fetcher_cache_size="2GB"
--frameworks_home="" --gc_delay="1weeks" --gc_disk_headroom="0.1" --hadoop_home="" --help="false"
--hostname_lookup="true" --http_command_executor="false" --http_credentials="/tmp/Endpoint_SlaveEndpointTest_UnauthorizedRequest_1_N2BUWH/http_credentials"
--http_heartbeat_interval="30secs" --initialize_driver_logging="true" --isolation="posix/cpu,posix/mem"
--launcher="posix" --launcher_dir="/mesos/mesos-1.4.0/_build/src" --logbufsecs="0" --logging_level="INFO"
--max_completed_executors_per_framework="150" --oversubscribed_resources_interval="15secs"
--perf_duration="10secs" --perf_interval="1mins" --port="5051" --qos_correction_interval_min="0ns"
--quiet="false" --recover="reconnect" --recovery_timeout="15mins" --registration_backoff_factor="10ms"
--resources="cpus:2;gpus:0;mem:1024;disk:1024;ports:[31000-32000]" --revocable_cpu_low_priority="true"
--runtime_dir="/tmp/Endpoint_SlaveEndpointTest_UnauthorizedRequest_1_N2BUWH" --sandbox_directory="/mnt/mesos/sandbox"
--strict="true" --switch_user="true" --systemd_enable_support="true" --systemd_runtime_directory="/run/systemd/system"
--version="false" --work_dir="/tmp/Endpoint_SlaveEndpointTest_UnauthorizedRequest_1_CbxwVt"
I0627 05:27:16.029208  4950 credentials.hpp:86] Loading credential for authentication from
'/tmp/Endpoint_SlaveEndpointTest_UnauthorizedRequest_1_N2BUWH/credential'
I0627 05:27:16.029379  4950 slave.cpp:282] Agent using credential for: test-principal
I0627 05:27:16.029536  4950 credentials.hpp:37] Loading credentials for authentication from
'/tmp/Endpoint_SlaveEndpointTest_UnauthorizedRequest_1_N2BUWH/http_credentials'
I0627 05:27:16.029825  4950 http.cpp:974] Creating default 'basic' HTTP authenticator for
realm 'mesos-agent-readonly'
I0627 05:27:16.029990  4950 http.cpp:974] Creating default 'basic' HTTP authenticator for
realm 'mesos-agent-readwrite'
I0627 05:27:16.031263  4950 slave.cpp:553] Agent resources: [{"name":"cpus","scalar":{"value":2.0},"type":"SCALAR"},{"name":"mem","scalar":{"value":1024.0},"type":"SCALAR"},{"name":"disk","scalar":{"value":1024.0},"type":"SCALAR"},{"name":"ports","ranges":{"range":[{"begin":31000,"end":32000}]},"type":"RANGES"}]
I0627 05:27:16.031478  4950 slave.cpp:561] Agent attributes: [  ]
I0627 05:27:16.031498  4950 slave.cpp:566] Agent hostname: c43debbe7e32
I0627 05:27:16.031628  4944 status_update_manager.cpp:177] Pausing sending status updates
I0627 05:27:16.032801  4947 state.cpp:64] Recovering state from '/tmp/Endpoint_SlaveEndpointTest_UnauthorizedRequest_1_CbxwVt/meta'
I0627 05:27:16.033005  4939 status_update_manager.cpp:203] Recovering status update manager
I0627 05:27:16.033222  4938 containerizer.cpp:582] Recovering containerizer
I0627 05:27:16.034579  4948 provisioner.cpp:416] Provisioner recovery complete
I0627 05:27:16.034905  4940 slave.cpp:6168] Finished recovery
I0627 05:27:16.035302  4940 slave.cpp:6350] Querying resource estimator for oversubscribable
resources
I0627 05:27:16.035518  4943 slave.cpp:6364] Received oversubscribable resources {} from the
resource estimator
I0627 05:27:16.037446  4955 process.cpp:3779] Handling HTTP event for process 'slave(772)'
with path: '/slave(772)/monitor/statistics.json'
I0627 05:27:16.038489  4944 http.cpp:1114] HTTP GET for /slave(772)/monitor/statistics.json
from 172.17.0.4:43046
I0627 05:27:16.038558  4944 http.cpp:935] Authorizing principal 'test-principal' to GET the
'/monitor/statistics.json' endpoint
I0627 05:27:16.040606  4940 slave.cpp:818] Agent terminating
[       OK ] Endpoint/SlaveEndpointTest.UnauthorizedRequest/1 (25 ms)
[ RUN      ] Endpoint/SlaveEndpointTest.UnauthorizedRequest/2
I0627 05:27:16.049957  4917 containerizer.cpp:230] Using isolation: posix/cpu,posix/mem,filesystem/posix,network/cni,environment_secret
W0627 05:27:16.050400  4917 backend.cpp:76] Failed to create 'aufs' backend: AufsBackend requires
root privileges
W0627 05:27:16.050499  4917 backend.cpp:76] Failed to create 'bind' backend: BindBackend requires
root privileges
I0627 05:27:16.050534  4917 provisioner.cpp:255] Using default backend 'copy'
I0627 05:27:16.053288  4942 slave.cpp:249] Mesos agent started on (773)@172.17.0.4:41747
I0627 05:27:16.053308  4942 slave.cpp:250] Flags at startup: --acls="" --appc_simple_discovery_uri_prefix="http://"
--appc_store_dir="/tmp/Endpoint_SlaveEndpointTest_UnauthorizedRequest_2_ip07eC/store/appc"
--authenticate_http_readonly="true" --authenticate_http_readwrite="true" --authenticatee="crammd5"
--authentication_backoff_factor="1secs" --authorizer="local" --cgroups_cpu_enable_pids_and_tids_count="false"
--cgroups_enable_cfs="false" --cgroups_hierarchy="/sys/fs/cgroup" --cgroups_limit_swap="false"
--cgroups_root="mesos" --container_disk_watch_interval="15secs" --containerizers="mesos" --credential="/tmp/Endpoint_SlaveEndpointTest_UnauthorizedRequest_2_ip07eC/credential"
--default_role="*" --disk_watch_interval="1mins" --docker="docker" --docker_kill_orphans="true"
--docker_registry="https://registry-1.docker.io" --docker_remove_delay="6hrs" --docker_socket="/var/run/docker.sock"
--docker_stop_timeout="0ns" --docker_store_dir="/tmp/Endpoint_SlaveEndpointTest_UnauthorizedRequest_2_ip07eC/store/docker"
--docker_volume_checkpoint_dir="/var/run/mesos/isolators/docker/volume" --enforce_container_disk_quota="false"
--executor_registration_timeout="1mins" --executor_reregistration_timeout="2secs" --executor_shutdown_grace_period="5secs"
--fetcher_cache_dir="/tmp/Endpoint_SlaveEndpointTest_UnauthorizedRequest_2_ip07eC/fetch" --fetcher_cache_size="2GB"
--frameworks_home="" --gc_delay="1weeks" --gc_disk_headroom="0.1" --hadoop_home="" --help="false"
--hostname_lookup="true" --http_command_executor="false" --http_credentials="/tmp/Endpoint_SlaveEndpointTest_UnauthorizedRequest_2_ip07eC/http_credentials"
--http_heartbeat_interval="30secs" --initialize_driver_logging="true" --isolation="posix/cpu,posix/mem"
--launcher="posix" --launcher_dir="/mesos/mesos-1.4.0/_build/src" --logbufsecs="0" --logging_level="INFO"
--max_completed_executors_per_framework="150" --oversubscribed_resources_interval="15secs"
--perf_duration="10secs" --perf_interval="1mins" --port="5051" --qos_correction_interval_min="0ns"
--quiet="false" --recover="reconnect" --recovery_timeout="15mins" --registration_backoff_factor="10ms"
--resources="cpus:2;gpus:0;mem:1024;disk:1024;ports:[31000-32000]" --revocable_cpu_low_priority="true"
--runtime_dir="/tmp/Endpoint_SlaveEndpointTest_UnauthorizedRequest_2_ip07eC" --sandbox_directory="/mnt/mesos/sandbox"
--strict="true" --switch_user="true" --systemd_enable_support="true" --systemd_runtime_directory="/run/systemd/system"
--version="false" --work_dir="/tmp/Endpoint_SlaveEndpointTest_UnauthorizedRequest_2_16i29n"
I0627 05:27:16.053694  4942 credentials.hpp:86] Loading credential for authentication from
'/tmp/Endpoint_SlaveEndpointTest_UnauthorizedRequest_2_ip07eC/credential'
I0627 05:27:16.053825  4942 slave.cpp:282] Agent using credential for: test-principal
I0627 05:27:16.053845  4942 credentials.hpp:37] Loading credentials for authentication from
'/tmp/Endpoint_SlaveEndpointTest_UnauthorizedRequest_2_ip07eC/http_credentials'
I0627 05:27:16.054057  4942 http.cpp:974] Creating default 'basic' HTTP authenticator for
realm 'mesos-agent-readonly'
I0627 05:27:16.054183  4942 http.cpp:974] Creating default 'basic' HTTP authenticator for
realm 'mesos-agent-readwrite'
I0627 05:27:16.055312  4942 slave.cpp:553] Agent resources: [{"name":"cpus","scalar":{"value":2.0},"type":"SCALAR"},{"name":"mem","scalar":{"value":1024.0},"type":"SCALAR"},{"name":"disk","scalar":{"value":1024.0},"type":"SCALAR"},{"name":"ports","ranges":{"range":[{"begin":31000,"end":32000}]},"type":"RANGES"}]
I0627 05:27:16.055511  4942 slave.cpp:561] Agent attributes: [  ]
I0627 05:27:16.055524  4942 slave.cpp:566] Agent hostname: c43debbe7e32
I0627 05:27:16.055627  4940 status_update_manager.cpp:177] Pausing sending status updates
I0627 05:27:16.056737  4949 state.cpp:64] Recovering state from '/tmp/Endpoint_SlaveEndpointTest_UnauthorizedRequest_2_16i29n/meta'
I0627 05:27:16.057211  4950 status_update_manager.cpp:203] Recovering status update manager
I0627 05:27:16.057509  4957 containerizer.cpp:582] Recovering containerizer
I0627 05:27:16.059188  4941 provisioner.cpp:416] Provisioner recovery complete
I0627 05:27:16.059552  4946 slave.cpp:6168] Finished recovery
I0627 05:27:16.060170  4946 slave.cpp:6350] Querying resource estimator for oversubscribable
resources
I0627 05:27:16.060446  4954 slave.cpp:6364] Received oversubscribable resources {} from the
resource estimator
I0627 05:27:16.062731  4939 process.cpp:3779] Handling HTTP event for process 'slave(773)'
with path: '/slave(773)/containers'
I0627 05:27:16.063957  4948 http.cpp:1114] HTTP GET for /slave(773)/containers from 172.17.0.4:43048
I0627 05:27:16.064019  4948 http.cpp:935] Authorizing principal 'test-principal' to GET the
'/containers' endpoint
I0627 05:27:16.066231  4943 slave.cpp:818] Agent terminating
[       OK ] Endpoint/SlaveEndpointTest.UnauthorizedRequest/2 (26 ms)
[ RUN      ] Endpoint/SlaveEndpointTest.NoAuthorizer/0
I0627 05:27:16.077430  4917 containerizer.cpp:230] Using isolation: posix/cpu,posix/mem,filesystem/posix,network/cni,environment_secret
W0627 05:27:16.077983  4917 backend.cpp:76] Failed to create 'aufs' backend: AufsBackend requires
root privileges
W0627 05:27:16.078107  4917 backend.cpp:76] Failed to create 'bind' backend: BindBackend requires
root privileges
I0627 05:27:16.078157  4917 provisioner.cpp:255] Using default backend 'copy'
I0627 05:27:16.080281  4917 cluster.cpp:448] Creating default 'local' authorizer
I0627 05:27:16.081990  4946 slave.cpp:249] Mesos agent started on (774)@172.17.0.4:41747
I0627 05:27:16.082015  4946 slave.cpp:250] Flags at startup: --acls="" --appc_simple_discovery_uri_prefix="http://"
--appc_store_dir="/tmp/Endpoint_SlaveEndpointTest_NoAuthorizer_0_VApOGv/store/appc" --authenticate_http_readonly="true"
--authenticate_http_readwrite="true" --authenticatee="crammd5" --authentication_backoff_factor="1secs"
--authorizer="local" --cgroups_cpu_enable_pids_and_tids_count="false" --cgroups_enable_cfs="false"
--cgroups_hierarchy="/sys/fs/cgroup" --cgroups_limit_swap="false" --cgroups_root="mesos" --container_disk_watch_interval="15secs"
--containerizers="mesos" --credential="/tmp/Endpoint_SlaveEndpointTest_NoAuthorizer_0_VApOGv/credential"
--default_role="*" --disk_watch_interval="1mins" --docker="docker" --docker_kill_orphans="true"
--docker_registry="https://registry-1.docker.io" --docker_remove_delay="6hrs" --docker_socket="/var/run/docker.sock"
--docker_stop_timeout="0ns" --docker_store_dir="/tmp/Endpoint_SlaveEndpointTest_NoAuthorizer_0_VApOGv/store/docker"
--docker_volume_checkpoint_dir="/var/run/mesos/isolators/docker/volume" --enforce_container_disk_quota="false"
--executor_registration_timeout="1mins" --executor_reregistration_timeout="2secs" --executor_shutdown_grace_period="5secs"
--fetcher_cache_dir="/tmp/Endpoint_SlaveEndpointTest_NoAuthorizer_0_VApOGv/fetch" --fetcher_cache_size="2GB"
--frameworks_home="" --gc_delay="1weeks" --gc_disk_headroom="0.1" --hadoop_home="" --help="false"
--hostname_lookup="true" --http_command_executor="false" --http_credentials="/tmp/Endpoint_SlaveEndpointTest_NoAuthorizer_0_VApOGv/http_credentials"
--http_heartbeat_interval="30secs" --initialize_driver_logging="true" --isolation="posix/cpu,posix/mem"
--launcher="posix" --launcher_dir="/mesos/mesos-1.4.0/_build/src" --logbufsecs="0" --logging_level="INFO"
--max_completed_executors_per_framework="150" --oversubscribed_resources_interval="15secs"
--perf_duration="10secs" --perf_interval="1mins" --port="5051" --qos_correction_interval_min="0ns"
--quiet="false" --recover="reconnect" --recovery_timeout="15mins" --registration_backoff_factor="10ms"
--resources="cpus:2;gpus:0;mem:1024;disk:1024;ports:[31000-32000]" --revocable_cpu_low_priority="true"
--runtime_dir="/tmp/Endpoint_SlaveEndpointTest_NoAuthorizer_0_VApOGv" --sandbox_directory="/mnt/mesos/sandbox"
--strict="true" --switch_user="true" --systemd_enable_support="true" --systemd_runtime_directory="/run/systemd/system"
--version="false" --work_dir="/tmp/Endpoint_SlaveEndpointTest_NoAuthorizer_0_WKbJxh"
I0627 05:27:16.082398  4946 credentials.hpp:86] Loading credential for authentication from
'/tmp/Endpoint_SlaveEndpointTest_NoAuthorizer_0_VApOGv/credential'
I0627 05:27:16.082536  4946 slave.cpp:282] Agent using credential for: test-principal
I0627 05:27:16.082556  4946 credentials.hpp:37] Loading credentials for authentication from
'/tmp/Endpoint_SlaveEndpointTest_NoAuthorizer_0_VApOGv/http_credentials'
I0627 05:27:16.082761  4946 http.cpp:974] Creating default 'basic' HTTP authenticator for
realm 'mesos-agent-readonly'
I0627 05:27:16.082890  4946 http.cpp:974] Creating default 'basic' HTTP authenticator for
realm 'mesos-agent-readwrite'
I0627 05:27:16.084095  4946 slave.cpp:553] Agent resources: [{"name":"cpus","scalar":{"value":2.0},"type":"SCALAR"},{"name":"mem","scalar":{"value":1024.0},"type":"SCALAR"},{"name":"disk","scalar":{"value":1024.0},"type":"SCALAR"},{"name":"ports","ranges":{"range":[{"begin":31000,"end":32000}]},"type":"RANGES"}]
I0627 05:27:16.084288  4946 slave.cpp:561] Agent attributes: [  ]
I0627 05:27:16.084300  4946 slave.cpp:566] Agent hostname: c43debbe7e32
I0627 05:27:16.084403  4955 status_update_manager.cpp:177] Pausing sending status updates
I0627 05:27:16.085366  4944 state.cpp:64] Recovering state from '/tmp/Endpoint_SlaveEndpointTest_NoAuthorizer_0_WKbJxh/meta'
I0627 05:27:16.085670  4953 status_update_manager.cpp:203] Recovering status update manager
I0627 05:27:16.085872  4954 containerizer.cpp:582] Recovering containerizer
I0627 05:27:16.087457  4947 provisioner.cpp:416] Provisioner recovery complete
I0627 05:27:16.087788  4945 slave.cpp:6168] Finished recovery
I0627 05:27:16.088496  4945 slave.cpp:6350] Querying resource estimator for oversubscribable
resources
I0627 05:27:16.088799  4937 slave.cpp:6364] Received oversubscribable resources {} from the
resource estimator
I0627 05:27:16.090911  4943 process.cpp:3779] Handling HTTP event for process 'slave(774)'
with path: '/slave(774)/monitor/statistics'
I0627 05:27:16.092064  4951 http.cpp:1114] HTTP GET for /slave(774)/monitor/statistics from
172.17.0.4:43050
I0627 05:27:16.092149  4951 http.cpp:935] Authorizing principal 'test-principal' to GET the
'/monitor/statistics' endpoint
I0627 05:27:16.095500  4938 slave.cpp:818] Agent terminating
[       OK ] Endpoint/SlaveEndpointTest.NoAuthorizer/0 (29 ms)
[ RUN      ] Endpoint/SlaveEndpointTest.NoAuthorizer/1
I0627 05:27:16.111529  4917 containerizer.cpp:230] Using isolation: posix/cpu,posix/mem,filesystem/posix,network/cni,environment_secret
W0627 05:27:16.112746  4917 backend.cpp:76] Failed to create 'aufs' backend: AufsBackend requires
root privileges
W0627 05:27:16.112924  4917 backend.cpp:76] Failed to create 'bind' backend: BindBackend requires
root privileges
I0627 05:27:16.112962  4917 provisioner.cpp:255] Using default backend 'copy'
I0627 05:27:16.115229  4917 cluster.cpp:448] Creating default 'local' authorizer
I0627 05:27:16.117233  4939 slave.cpp:249] Mesos agent started on (775)@172.17.0.4:41747
I0627 05:27:16.117259  4939 slave.cpp:250] Flags at startup: --acls="" --appc_simple_discovery_uri_prefix="http://"
--appc_store_dir="/tmp/Endpoint_SlaveEndpointTest_NoAuthorizer_1_SRlPwq/store/appc" --authenticate_http_readonly="true"
--authenticate_http_readwrite="true" --authenticatee="crammd5" --authentication_backoff_factor="1secs"
--authorizer="local" --cgroups_cpu_enable_pids_and_tids_count="false" --cgroups_enable_cfs="false"
--cgroups_hierarchy="/sys/fs/cgroup" --cgroups_limit_swap="false" --cgroups_root="mesos" --container_disk_watch_interval="15secs"
--containerizers="mesos" --credential="/tmp/Endpoint_SlaveEndpointTest_NoAuthorizer_1_SRlPwq/credential"
--default_role="*" --disk_watch_interval="1mins" --docker="docker" --docker_kill_orphans="true"
--docker_registry="https://registry-1.docker.io" --docker_remove_delay="6hrs" --docker_socket="/var/run/docker.sock"
--docker_stop_timeout="0ns" --docker_store_dir="/tmp/Endpoint_SlaveEndpointTest_NoAuthorizer_1_SRlPwq/store/docker"
--docker_volume_checkpoint_dir="/var/run/mesos/isolators/docker/volume" --enforce_container_disk_quota="false"
--executor_registration_timeout="1mins" --executor_reregistration_timeout="2secs" --executor_shutdown_grace_period="5secs"
--fetcher_cache_dir="/tmp/Endpoint_SlaveEndpointTest_NoAuthorizer_1_SRlPwq/fetch" --fetcher_cache_size="2GB"
--frameworks_home="" --gc_delay="1weeks" --gc_disk_headroom="0.1" --hadoop_home="" --help="false"
--hostname_lookup="true" --http_command_executor="false" --http_credentials="/tmp/Endpoint_SlaveEndpointTest_NoAuthorizer_1_SRlPwq/http_credentials"
--http_heartbeat_interval="30secs" --initialize_driver_logging="true" --isolation="posix/cpu,posix/mem"
--launcher="posix" --launcher_dir="/mesos/mesos-1.4.0/_build/src" --logbufsecs="0" --logging_level="INFO"
--max_completed_executors_per_framework="150" --oversubscribed_resources_interval="15secs"
--perf_duration="10secs" --perf_interval="1mins" --port="5051" --qos_correction_interval_min="0ns"
--quiet="false" --recover="reconnect" --recovery_timeout="15mins" --registration_backoff_factor="10ms"
--resources="cpus:2;gpus:0;mem:1024;disk:1024;ports:[31000-32000]" --revocable_cpu_low_priority="true"
--runtime_dir="/tmp/Endpoint_SlaveEndpointTest_NoAuthorizer_1_SRlPwq" --sandbox_directory="/mnt/mesos/sandbox"
--strict="true" --switch_user="true" --systemd_enable_support="true" --systemd_runtime_directory="/run/systemd/system"
--version="false" --work_dir="/tmp/Endpoint_SlaveEndpointTest_NoAuthorizer_1_Iaz1ic"
I0627 05:27:16.117671  4939 credentials.hpp:86] Loading credential for authentication from
'/tmp/Endpoint_SlaveEndpointTest_NoAuthorizer_1_SRlPwq/credential'
I0627 05:27:16.117938  4939 slave.cpp:282] Agent using credential for: test-principal
I0627 05:27:16.117964  4939 credentials.hpp:37] Loading credentials for authentication from
'/tmp/Endpoint_SlaveEndpointTest_NoAuthorizer_1_SRlPwq/http_credentials'
I0627 05:27:16.118249  4939 http.cpp:974] Creating default 'basic' HTTP authenticator for
realm 'mesos-agent-readonly'
I0627 05:27:16.118583  4939 http.cpp:974] Creating default 'basic' HTTP authenticator for
realm 'mesos-agent-readwrite'
I0627 05:27:16.120079  4939 slave.cpp:553] Agent resources: [{"name":"cpus","scalar":{"value":2.0},"type":"SCALAR"},{"name":"mem","scalar":{"value":1024.0},"type":"SCALAR"},{"name":"disk","scalar":{"value":1024.0},"type":"SCALAR"},{"name":"ports","ranges":{"range":[{"begin":31000,"end":32000}]},"type":"RANGES"}]
I0627 05:27:16.120306  4939 slave.cpp:561] Agent attributes: [  ]
I0627 05:27:16.120368  4939 slave.cpp:566] Agent hostname: c43debbe7e32
I0627 05:27:16.121348  4957 status_update_manager.cpp:177] Pausing sending status updates
I0627 05:27:16.121978  4938 state.cpp:64] Recovering state from '/tmp/Endpoint_SlaveEndpointTest_NoAuthorizer_1_Iaz1ic/meta'
I0627 05:27:16.122516  4938 status_update_manager.cpp:203] Recovering status update manager
I0627 05:27:16.122725  4951 containerizer.cpp:582] Recovering containerizer
I0627 05:27:16.124465  4939 provisioner.cpp:416] Provisioner recovery complete
I0627 05:27:16.125067  4939 slave.cpp:6168] Finished recovery
I0627 05:27:16.125741  4939 slave.cpp:6350] Querying resource estimator for oversubscribable
resources
I0627 05:27:16.126477  4939 slave.cpp:6364] Received oversubscribable resources {} from the
resource estimator
I0627 05:27:16.129580  4943 process.cpp:3779] Handling HTTP event for process 'slave(775)'
with path: '/slave(775)/monitor/statistics.json'
I0627 05:27:16.131148  4957 http.cpp:1114] HTTP GET for /slave(775)/monitor/statistics.json
from 172.17.0.4:43052
I0627 05:27:16.131268  4957 http.cpp:935] Authorizing principal 'test-principal' to GET the
'/monitor/statistics.json' endpoint
I0627 05:27:16.135381  4951 slave.cpp:818] Agent terminating
[       OK ] Endpoint/SlaveEndpointTest.NoAuthorizer/1 (39 ms)
[ RUN      ] Endpoint/SlaveEndpointTest.NoAuthorizer/2
I0627 05:27:16.146926  4917 containerizer.cpp:230] Using isolation: posix/cpu,posix/mem,filesystem/posix,network/cni,environment_secret
W0627 05:27:16.147604  4917 backend.cpp:76] Failed to create 'aufs' backend: AufsBackend requires
root privileges
W0627 05:27:16.147712  4917 backend.cpp:76] Failed to create 'bind' backend: BindBackend requires
root privileges
I0627 05:27:16.147756  4917 provisioner.cpp:255] Using default backend 'copy'
I0627 05:27:16.150333  4917 cluster.cpp:448] Creating default 'local' authorizer
I0627 05:27:16.153169  4944 slave.cpp:249] Mesos agent started on (776)@172.17.0.4:41747
I0627 05:27:16.153190  4944 slave.cpp:250] Flags at startup: --acls="" --appc_simple_discovery_uri_prefix="http://"
--appc_store_dir="/tmp/Endpoint_SlaveEndpointTest_NoAuthorizer_2_gGusJl/store/appc" --authenticate_http_readonly="true"
--authenticate_http_readwrite="true" --authenticatee="crammd5" --authentication_backoff_factor="1secs"
--authorizer="local" --cgroups_cpu_enable_pids_and_tids_count="false" --cgroups_enable_cfs="false"
--cgroups_hierarchy="/sys/fs/cgroup" --cgroups_limit_swap="false" --cgroups_root="mesos" --container_disk_watch_interval="15secs"
--containerizers="mesos" --credential="/tmp/Endpoint_SlaveEndpointTest_NoAuthorizer_2_gGusJl/credential"
--default_role="*" --disk_watch_interval="1mins" --docker="docker" --docker_kill_orphans="true"
--docker_registry="https://registry-1.docker.io" --docker_remove_delay="6hrs" --docker_socket="/var/run/docker.sock"
--docker_stop_timeout="0ns" --docker_store_dir="/tmp/Endpoint_SlaveEndpointTest_NoAuthorizer_2_gGusJl/store/docker"
--docker_volume_checkpoint_dir="/var/run/mesos/isolators/docker/volume" --enforce_container_disk_quota="false"
--executor_registration_timeout="1mins" --executor_reregistration_timeout="2secs" --executor_shutdown_grace_period="5secs"
--fetcher_cache_dir="/tmp/Endpoint_SlaveEndpointTest_NoAuthorizer_2_gGusJl/fetch" --fetcher_cache_size="2GB"
--frameworks_home="" --gc_delay="1weeks" --gc_disk_headroom="0.1" --hadoop_home="" --help="false"
--hostname_lookup="true" --http_command_executor="false" --http_credentials="/tmp/Endpoint_SlaveEndpointTest_NoAuthorizer_2_gGusJl/http_credentials"
--http_heartbeat_interval="30secs" --initialize_driver_logging="true" --isolation="posix/cpu,posix/mem"
--launcher="posix" --launcher_dir="/mesos/mesos-1.4.0/_build/src" --logbufsecs="0" --logging_level="INFO"
--max_completed_executors_per_framework="150" --oversubscribed_resources_interval="15secs"
--perf_duration="10secs" --perf_interval="1mins" --port="5051" --qos_correction_interval_min="0ns"
--quiet="false" --recover="reconnect" --recovery_timeout="15mins" --registration_backoff_factor="10ms"
--resources="cpus:2;gpus:0;mem:1024;disk:1024;ports:[31000-32000]" --revocable_cpu_low_priority="true"
--runtime_dir="/tmp/Endpoint_SlaveEndpointTest_NoAuthorizer_2_gGusJl" --sandbox_directory="/mnt/mesos/sandbox"
--strict="true" --switch_user="true" --systemd_enable_support="true" --systemd_runtime_directory="/run/systemd/system"
--version="false" --work_dir="/tmp/Endpoint_SlaveEndpointTest_NoAuthorizer_2_BK60p7"
I0627 05:27:16.153702  4944 credentials.hpp:86] Loading credential for authentication from
'/tmp/Endpoint_SlaveEndpointTest_NoAuthorizer_2_gGusJl/credential'
I0627 05:27:16.153983  4944 slave.cpp:282] Agent using credential for: test-principal
I0627 05:27:16.154003  4944 credentials.hpp:37] Loading credentials for authentication from
'/tmp/Endpoint_SlaveEndpointTest_NoAuthorizer_2_gGusJl/http_credentials'
I0627 05:27:16.154312  4944 http.cpp:974] Creating default 'basic' HTTP authenticator for
realm 'mesos-agent-readonly'
I0627 05:27:16.154503  4944 http.cpp:974] Creating default 'basic' HTTP authenticator for
realm 'mesos-agent-readwrite'
I0627 05:27:16.155804  4944 slave.cpp:553] Agent resources: [{"name":"cpus","scalar":{"value":2.0},"type":"SCALAR"},{"name":"mem","scalar":{"value":1024.0},"type":"SCALAR"},{"name":"disk","scalar":{"value":1024.0},"type":"SCALAR"},{"name":"ports","ranges":{"range":[{"begin":31000,"end":32000}]},"type":"RANGES"}]
I0627 05:27:16.156097  4944 slave.cpp:561] Agent attributes: [  ]
I0627 05:27:16.156113  4944 slave.cpp:566] Agent hostname: c43debbe7e32
I0627 05:27:16.156343  4946 status_update_manager.cpp:177] Pausing sending status updates
I0627 05:27:16.158008  4940 state.cpp:64] Recovering state from '/tmp/Endpoint_SlaveEndpointTest_NoAuthorizer_2_BK60p7/meta'
I0627 05:27:16.158447  4957 status_update_manager.cpp:203] Recovering status update manager
I0627 05:27:16.158766  4946 containerizer.cpp:582] Recovering containerizer
I0627 05:27:16.165447  4946 provisioner.cpp:416] Provisioner recovery complete
I0627 05:27:16.165938  4948 slave.cpp:6168] Finished recovery
I0627 05:27:16.167281  4948 slave.cpp:6350] Querying resource estimator for oversubscribable
resources
I0627 05:27:16.167806  4952 slave.cpp:6364] Received oversubscribable resources {} from the
resource estimator
I0627 05:27:16.170841  4936 process.cpp:3779] Handling HTTP event for process 'slave(776)'
with path: '/slave(776)/containers'
I0627 05:27:16.172297  4945 http.cpp:1114] HTTP GET for /slave(776)/containers from 172.17.0.4:43054
I0627 05:27:16.172394  4945 http.cpp:935] Authorizing principal 'test-principal' to GET the
'/containers' endpoint
I0627 05:27:16.176260  4937 slave.cpp:818] Agent terminating
[       OK ] Endpoint/SlaveEndpointTest.NoAuthorizer/2 (41 ms)
[----------] 9 tests from Endpoint/SlaveEndpointTest (312 ms total)

[----------] Global test environment tear-down
[==========] 1618 tests from 178 test cases ran. (533527 ms total)
[  PASSED  ] 1617 tests.
[  FAILED  ] 1 test, listed below:
[  FAILED  ] MasterTest.IgnoreOldAgentReregistration

 1 FAILED TEST
  YOU HAVE 20 DISABLED TESTS

I0627 05:27:16.253495  4960 process.cpp:968] Failed to accept socket: future discarded
make[4]: *** [check-local] Error 1
make[4]: Leaving directory `/mesos/mesos-1.4.0/_build/src'
make[3]: *** [check-am] Error 2
make[3]: Leaving directory `/mesos/mesos-1.4.0/_build/src'
make[2]: *** [check] Error 2
make[2]: Leaving directory `/mesos/mesos-1.4.0/_build/src'
make[1]: *** [check-recursive] Error 1
make[1]: Leaving directory `/mesos/mesos-1.4.0/_build'
make: *** [distcheck] Error 1
+ docker rmi mesos-1498537973-24484
Untagged: mesos-1498537973-24484:latest
Deleted: sha256:bc0a7a13006e10424b76313dea258e0db1587761336dd9d236c126dc59ffa08a
Deleted: sha256:d5dcf2f060cd4e9693e721ea40c75a065fe8518d8829f450d9ac45be04dce59d
Deleted: sha256:7c41620d7c6dff59b875240070751b10dc77d199bb5659223987c3c393e82b29
Deleted: sha256:132d62f5431dd274b09006fea525ee81585c0fe91d5bdcbfa261ec5d5f5c487d
Deleted: sha256:4fb3ac3bafb9789b38f5a8bbe12117014c8f30047e21347321c0eb7e8074c69e
Deleted: sha256:5760eca018ed642ef557ad1479cafefaaed4bb92f1fa43d9bc5f81babcdee2f4
Deleted: sha256:69b836e8d89117121a4603ef543c2273ab2658adcfa28f0951bd0a9afe9ae407
Deleted: sha256:3776bc3f0c59e15edc5ef8e98d4630237f93abb2af643800e029c00bcdd1bcea
Deleted: sha256:aba056b53e731ee4f84acef69a315e2d18f14ac0089561c7c538caa875dc7bb6
Deleted: sha256:5106b3342b269fd4b88c71643f7cedd53aabfa5213449894fae5c265f3db7547
Deleted: sha256:4a30276de110de26165aea9614f63405832640df002f77d28d3267301000318c
Deleted: sha256:42562cb0d6c04909293dc665cf0c047f13c4f666f580e6b93909316c845e4ac2
Deleted: sha256:946c822966f572180a925b4a2aeaf5298ffff745feefed006b6e87b63ad43056
Deleted: sha256:b89cbbc897ebafd9ad7919eea52166483df1aec367ae45b1335b33289dad060b
Deleted: sha256:ae1741b1ce0b74adcd49a2d0f1a7ab2cdffadc396b96e4ae13c8cce8fabf7c2e
Deleted: sha256:728a37273920e5239f0b21cbc5942e693ea51bbda1183f1e1a82ee5c4f482c23
Deleted: sha256:23ea1b94abd4f5147775ed248fbae0b6f706aabcc25007b5e94366b9a9095591
Deleted: sha256:1c6118b6ab54b98c290533af532d61eb47ffdf4af7a64509c6e51f34890974e4
Deleted: sha256:055406b952324f9928058cc952c14e747a9650f6ca79a85e91ff728f7ad087ba
Deleted: sha256:47f36aa905582de73970ac7c0f4d38653ea92afd98effd38e29611c0e5a063ae
Deleted: sha256:c4eb310ce8422a7d1fa674750fd458fde6a20277d3bcea5f84becade2503b7f2
Deleted: sha256:e2766d7438026688cdcc2d378b635a30f5bb24d62612061281d9cd33be6fe11f
Deleted: sha256:14703a9f5a97d9470a958b80420eb499afa0657274ec0a62fc54e96c205c912d
Deleted: sha256:a0c8010cef66097581a7bfd5f124d0c3c9371b96b07b1a703655426d65cdd0f1
Build step 'Execute shell' marked build as failure
Not sending mail to unregistered user neil.conway@gmail.com

Mime
View raw message