mesos-builds mailing list archives

Site index · List index
Message view « Date » · « Thread »
Top « Date » · « Thread »
From Apache Jenkins Server <jenk...@builds.apache.org>
Subject Build failed in Jenkins: Mesos-Reviewbot #18305
Date Thu, 08 Jun 2017 16:33:41 GMT
See <https://builds.apache.org/job/Mesos-Reviewbot/18305/display/redirect>

------------------------------------------
[...truncated 28.19 MB...]
I0608 16:33:34.852284  4512 containerizer.cpp:230] Using isolation: posix/cpu,posix/mem,filesystem/posix,network/cni,environment_secret
W0608 16:33:34.853335  4512 backend.cpp:76] Failed to create 'overlay' backend: OverlayBackend
requires root privileges
W0608 16:33:34.853704  4512 backend.cpp:76] Failed to create 'bind' backend: BindBackend requires
root privileges
I0608 16:33:34.853754  4512 provisioner.cpp:255] Using default backend 'copy'
I0608 16:33:34.860232  4537 slave.cpp:248] Mesos agent started on (756)@172.17.0.2:43853
I0608 16:33:34.860285  4537 slave.cpp:249] Flags at startup: --acls="" --appc_simple_discovery_uri_prefix="http://"
--appc_store_dir="/tmp/Endpoint_SlaveEndpointTest_AuthorizedRequest_2_GxT7As/store/appc" --authenticate_http_readonly="true"
--authenticate_http_readwrite="true" --authenticatee="crammd5" --authentication_backoff_factor="1secs"
--authorizer="local" --cgroups_cpu_enable_pids_and_tids_count="false" --cgroups_enable_cfs="false"
--cgroups_hierarchy="/sys/fs/cgroup" --cgroups_limit_swap="false" --cgroups_root="mesos" --container_disk_watch_interval="15secs"
--containerizers="mesos" --credential="/tmp/Endpoint_SlaveEndpointTest_AuthorizedRequest_2_GxT7As/credential"
--default_role="*" --disk_watch_interval="1mins" --docker="docker" --docker_kill_orphans="true"
--docker_registry="https://registry-1.docker.io" --docker_remove_delay="6hrs" --docker_socket="/var/run/docker.sock"
--docker_stop_timeout="0ns" --docker_store_dir="/tmp/Endpoint_SlaveEndpointTest_AuthorizedRequest_2_GxT7As/store/docker"
--docker_volume_checkpoint_dir="/var/run/mesos/isolators/docker/volume" --enforce_container_disk_quota="false"
--executor_registration_timeout="1mins" --executor_reregistration_timeout="2secs" --executor_shutdown_grace_period="5secs"
--fetcher_cache_dir="/tmp/Endpoint_SlaveEndpointTest_AuthorizedRequest_2_GxT7As/fetch" --fetcher_cache_size="2GB"
--frameworks_home="" --gc_delay="1weeks" --gc_disk_headroom="0.1" --hadoop_home="" --help="false"
--hostname_lookup="true" --http_command_executor="false" --http_credentials="/tmp/Endpoint_SlaveEndpointTest_AuthorizedRequest_2_GxT7As/http_credentials"
--http_heartbeat_interval="30secs" --initialize_driver_logging="true" --isolation="posix/cpu,posix/mem"
--launcher="posix" --launcher_dir="/mesos/mesos-1.4.0/_build/src" --logbufsecs="0" --logging_level="INFO"
--max_completed_executors_per_framework="150" --oversubscribed_resources_interval="15secs"
--perf_duration="10secs" --perf_interval="1mins" --port="5051" --qos_correction_interval_min="0ns"
--quiet="false" --recover="reconnect" --recovery_timeout="15mins" --registration_backoff_factor="10ms"
--resources="cpus:2;gpus:0;mem:1024;disk:1024;ports:[31000-32000]" --revocable_cpu_low_priority="true"
--runtime_dir="/tmp/Endpoint_SlaveEndpointTest_AuthorizedRequest_2_GxT7As" --sandbox_directory="/mnt/mesos/sandbox"
--strict="true" --switch_user="true" --systemd_enable_support="true" --systemd_runtime_directory="/run/systemd/system"
--version="false" --work_dir="/tmp/Endpoint_SlaveEndpointTest_AuthorizedRequest_2_q7lqu2"
I0608 16:33:34.861165  4537 credentials.hpp:86] Loading credential for authentication from
'/tmp/Endpoint_SlaveEndpointTest_AuthorizedRequest_2_GxT7As/credential'
I0608 16:33:34.861582  4537 slave.cpp:281] Agent using credential for: test-principal
I0608 16:33:34.861626  4537 credentials.hpp:37] Loading credentials for authentication from
'/tmp/Endpoint_SlaveEndpointTest_AuthorizedRequest_2_GxT7As/http_credentials'
I0608 16:33:34.862198  4537 http.cpp:975] Creating default 'basic' HTTP authenticator for
realm 'mesos-agent-readonly'
I0608 16:33:34.862584  4537 http.cpp:975] Creating default 'basic' HTTP authenticator for
realm 'mesos-agent-readwrite'
I0608 16:33:34.865270  4537 slave.cpp:552] Agent resources: cpus(*):2; mem(*):1024; disk(*):1024;
ports(*):[31000-32000]
I0608 16:33:34.865872  4537 slave.cpp:560] Agent attributes: [  ]
I0608 16:33:34.865900  4537 slave.cpp:565] Agent hostname: 19c7d99a2312
I0608 16:33:34.866749  4535 status_update_manager.cpp:177] Pausing sending status updates
I0608 16:33:34.870504  4536 state.cpp:62] Recovering state from '/tmp/Endpoint_SlaveEndpointTest_AuthorizedRequest_2_q7lqu2/meta'
I0608 16:33:34.871073  4536 status_update_manager.cpp:203] Recovering status update manager
I0608 16:33:34.871754  4536 containerizer.cpp:582] Recovering containerizer
I0608 16:33:34.874641  4536 provisioner.cpp:416] Provisioner recovery complete
I0608 16:33:34.875457  4534 slave.cpp:6127] Finished recovery
I0608 16:33:34.876220  4534 slave.cpp:6309] Querying resource estimator for oversubscribable
resources
I0608 16:33:34.876688  4532 slave.cpp:6323] Received oversubscribable resources {} from the
resource estimator
I0608 16:33:34.881211  4536 process.cpp:3778] Handling HTTP event for process 'slave(756)'
with path: '/slave(756)/containers'
I0608 16:33:34.883607  4536 http.cpp:1115] HTTP GET for /slave(756)/containers from 172.17.0.2:48924
I0608 16:33:34.883806  4536 http.cpp:936] Authorizing principal 'test-principal' to GET the
'/containers' endpoint
I0608 16:33:34.890080  4512 slave.cpp:817] Agent terminating
[       OK ] Endpoint/SlaveEndpointTest.AuthorizedRequest/2 (52 ms)
[ RUN      ] Endpoint/SlaveEndpointTest.UnauthorizedRequest/0
I0608 16:33:34.905109  4512 containerizer.cpp:230] Using isolation: posix/cpu,posix/mem,filesystem/posix,network/cni,environment_secret
W0608 16:33:34.906237  4512 backend.cpp:76] Failed to create 'overlay' backend: OverlayBackend
requires root privileges
W0608 16:33:34.906630  4512 backend.cpp:76] Failed to create 'bind' backend: BindBackend requires
root privileges
I0608 16:33:34.906678  4512 provisioner.cpp:255] Using default backend 'copy'
I0608 16:33:34.912734  4534 slave.cpp:248] Mesos agent started on (757)@172.17.0.2:43853
I0608 16:33:34.912776  4534 slave.cpp:249] Flags at startup: --acls="" --appc_simple_discovery_uri_prefix="http://"
--appc_store_dir="/tmp/Endpoint_SlaveEndpointTest_UnauthorizedRequest_0_qrcqv9/store/appc"
--authenticate_http_readonly="true" --authenticate_http_readwrite="true" --authenticatee="crammd5"
--authentication_backoff_factor="1secs" --authorizer="local" --cgroups_cpu_enable_pids_and_tids_count="false"
--cgroups_enable_cfs="false" --cgroups_hierarchy="/sys/fs/cgroup" --cgroups_limit_swap="false"
--cgroups_root="mesos" --container_disk_watch_interval="15secs" --containerizers="mesos" --credential="/tmp/Endpoint_SlaveEndpointTest_UnauthorizedRequest_0_qrcqv9/credential"
--default_role="*" --disk_watch_interval="1mins" --docker="docker" --docker_kill_orphans="true"
--docker_registry="https://registry-1.docker.io" --docker_remove_delay="6hrs" --docker_socket="/var/run/docker.sock"
--docker_stop_timeout="0ns" --docker_store_dir="/tmp/Endpoint_SlaveEndpointTest_UnauthorizedRequest_0_qrcqv9/store/docker"
--docker_volume_checkpoint_dir="/var/run/mesos/isolators/docker/volume" --enforce_container_disk_quota="false"
--executor_registration_timeout="1mins" --executor_reregistration_timeout="2secs" --executor_shutdown_grace_period="5secs"
--fetcher_cache_dir="/tmp/Endpoint_SlaveEndpointTest_UnauthorizedRequest_0_qrcqv9/fetch" --fetcher_cache_size="2GB"
--frameworks_home="" --gc_delay="1weeks" --gc_disk_headroom="0.1" --hadoop_home="" --help="false"
--hostname_lookup="true" --http_command_executor="false" --http_credentials="/tmp/Endpoint_SlaveEndpointTest_UnauthorizedRequest_0_qrcqv9/http_credentials"
--http_heartbeat_interval="30secs" --initialize_driver_logging="true" --isolation="posix/cpu,posix/mem"
--launcher="posix" --launcher_dir="/mesos/mesos-1.4.0/_build/src" --logbufsecs="0" --logging_level="INFO"
--max_completed_executors_per_framework="150" --oversubscribed_resources_interval="15secs"
--perf_duration="10secs" --perf_interval="1mins" --port="5051" --qos_correction_interval_min="0ns"
--quiet="false" --recover="reconnect" --recovery_timeout="15mins" --registration_backoff_factor="10ms"
--resources="cpus:2;gpus:0;mem:1024;disk:1024;ports:[31000-32000]" --revocable_cpu_low_priority="true"
--runtime_dir="/tmp/Endpoint_SlaveEndpointTest_UnauthorizedRequest_0_qrcqv9" --sandbox_directory="/mnt/mesos/sandbox"
--strict="true" --switch_user="true" --systemd_enable_support="true" --systemd_runtime_directory="/run/systemd/system"
--version="false" --work_dir="/tmp/Endpoint_SlaveEndpointTest_UnauthorizedRequest_0_2G6cgJ"
I0608 16:33:34.913606  4534 credentials.hpp:86] Loading credential for authentication from
'/tmp/Endpoint_SlaveEndpointTest_UnauthorizedRequest_0_qrcqv9/credential'
I0608 16:33:34.914072  4534 slave.cpp:281] Agent using credential for: test-principal
I0608 16:33:34.914106  4534 credentials.hpp:37] Loading credentials for authentication from
'/tmp/Endpoint_SlaveEndpointTest_UnauthorizedRequest_0_qrcqv9/http_credentials'
I0608 16:33:34.914603  4534 http.cpp:975] Creating default 'basic' HTTP authenticator for
realm 'mesos-agent-readonly'
I0608 16:33:34.914945  4534 http.cpp:975] Creating default 'basic' HTTP authenticator for
realm 'mesos-agent-readwrite'
I0608 16:33:34.917006  4534 slave.cpp:552] Agent resources: cpus(*):2; mem(*):1024; disk(*):1024;
ports(*):[31000-32000]
I0608 16:33:34.917148  4534 slave.cpp:560] Agent attributes: [  ]
I0608 16:33:34.917167  4534 slave.cpp:565] Agent hostname: 19c7d99a2312
I0608 16:33:34.919976  4534 status_update_manager.cpp:177] Pausing sending status updates
I0608 16:33:34.920750  4538 state.cpp:62] Recovering state from '/tmp/Endpoint_SlaveEndpointTest_UnauthorizedRequest_0_2G6cgJ/meta'
I0608 16:33:34.921262  4532 status_update_manager.cpp:203] Recovering status update manager
I0608 16:33:34.921792  4536 containerizer.cpp:582] Recovering containerizer
I0608 16:33:34.924271  4533 provisioner.cpp:416] Provisioner recovery complete
I0608 16:33:34.924803  4534 slave.cpp:6127] Finished recovery
I0608 16:33:34.925921  4534 slave.cpp:6309] Querying resource estimator for oversubscribable
resources
I0608 16:33:34.926301  4534 slave.cpp:6323] Received oversubscribable resources {} from the
resource estimator
I0608 16:33:34.931128  4535 process.cpp:3778] Handling HTTP event for process 'slave(757)'
with path: '/slave(757)/monitor/statistics'
I0608 16:33:34.934129  4537 http.cpp:1115] HTTP GET for /slave(757)/monitor/statistics from
172.17.0.2:48926
I0608 16:33:34.934272  4537 http.cpp:936] Authorizing principal 'test-principal' to GET the
'/monitor/statistics' endpoint
I0608 16:33:34.939453  4536 slave.cpp:817] Agent terminating
[       OK ] Endpoint/SlaveEndpointTest.UnauthorizedRequest/0 (49 ms)
[ RUN      ] Endpoint/SlaveEndpointTest.UnauthorizedRequest/1
I0608 16:33:34.954867  4512 containerizer.cpp:230] Using isolation: posix/cpu,posix/mem,filesystem/posix,network/cni,environment_secret
W0608 16:33:34.956014  4512 backend.cpp:76] Failed to create 'overlay' backend: OverlayBackend
requires root privileges
W0608 16:33:34.956444  4512 backend.cpp:76] Failed to create 'bind' backend: BindBackend requires
root privileges
I0608 16:33:34.956496  4512 provisioner.cpp:255] Using default backend 'copy'
I0608 16:33:34.962862  4533 slave.cpp:248] Mesos agent started on (758)@172.17.0.2:43853
I0608 16:33:34.962911  4533 slave.cpp:249] Flags at startup: --acls="" --appc_simple_discovery_uri_prefix="http://"
--appc_store_dir="/tmp/Endpoint_SlaveEndpointTest_UnauthorizedRequest_1_QyRWVQ/store/appc"
--authenticate_http_readonly="true" --authenticate_http_readwrite="true" --authenticatee="crammd5"
--authentication_backoff_factor="1secs" --authorizer="local" --cgroups_cpu_enable_pids_and_tids_count="false"
--cgroups_enable_cfs="false" --cgroups_hierarchy="/sys/fs/cgroup" --cgroups_limit_swap="false"
--cgroups_root="mesos" --container_disk_watch_interval="15secs" --containerizers="mesos" --credential="/tmp/Endpoint_SlaveEndpointTest_UnauthorizedRequest_1_QyRWVQ/credential"
--default_role="*" --disk_watch_interval="1mins" --docker="docker" --docker_kill_orphans="true"
--docker_registry="https://registry-1.docker.io" --docker_remove_delay="6hrs" --docker_socket="/var/run/docker.sock"
--docker_stop_timeout="0ns" --docker_store_dir="/tmp/Endpoint_SlaveEndpointTest_UnauthorizedRequest_1_QyRWVQ/store/docker"
--docker_volume_checkpoint_dir="/var/run/mesos/isolators/docker/volume" --enforce_container_disk_quota="false"
--executor_registration_timeout="1mins" --executor_reregistration_timeout="2secs" --executor_shutdown_grace_period="5secs"
--fetcher_cache_dir="/tmp/Endpoint_SlaveEndpointTest_UnauthorizedRequest_1_QyRWVQ/fetch" --fetcher_cache_size="2GB"
--frameworks_home="" --gc_delay="1weeks" --gc_disk_headroom="0.1" --hadoop_home="" --help="false"
--hostname_lookup="true" --http_command_executor="false" --http_credentials="/tmp/Endpoint_SlaveEndpointTest_UnauthorizedRequest_1_QyRWVQ/http_credentials"
--http_heartbeat_interval="30secs" --initialize_driver_logging="true" --isolation="posix/cpu,posix/mem"
--launcher="posix" --launcher_dir="/mesos/mesos-1.4.0/_build/src" --logbufsecs="0" --logging_level="INFO"
--max_completed_executors_per_framework="150" --oversubscribed_resources_interval="15secs"
--perf_duration="10secs" --perf_interval="1mins" --port="5051" --qos_correction_interval_min="0ns"
--quiet="false" --recover="reconnect" --recovery_timeout="15mins" --registration_backoff_factor="10ms"
--resources="cpus:2;gpus:0;mem:1024;disk:1024;ports:[31000-32000]" --revocable_cpu_low_priority="true"
--runtime_dir="/tmp/Endpoint_SlaveEndpointTest_UnauthorizedRequest_1_QyRWVQ" --sandbox_directory="/mnt/mesos/sandbox"
--strict="true" --switch_user="true" --systemd_enable_support="true" --systemd_runtime_directory="/run/systemd/system"
--version="false" --work_dir="/tmp/Endpoint_SlaveEndpointTest_UnauthorizedRequest_1_qJHEyq"
I0608 16:33:34.964095  4533 credentials.hpp:86] Loading credential for authentication from
'/tmp/Endpoint_SlaveEndpointTest_UnauthorizedRequest_1_QyRWVQ/credential'
I0608 16:33:34.964522  4533 slave.cpp:281] Agent using credential for: test-principal
I0608 16:33:34.964565  4533 credentials.hpp:37] Loading credentials for authentication from
'/tmp/Endpoint_SlaveEndpointTest_UnauthorizedRequest_1_QyRWVQ/http_credentials'
I0608 16:33:34.965121  4533 http.cpp:975] Creating default 'basic' HTTP authenticator for
realm 'mesos-agent-readonly'
I0608 16:33:34.965625  4533 http.cpp:975] Creating default 'basic' HTTP authenticator for
realm 'mesos-agent-readwrite'
I0608 16:33:34.968277  4533 slave.cpp:552] Agent resources: cpus(*):2; mem(*):1024; disk(*):1024;
ports(*):[31000-32000]
I0608 16:33:34.968431  4533 slave.cpp:560] Agent attributes: [  ]
I0608 16:33:34.968451  4533 slave.cpp:565] Agent hostname: 19c7d99a2312
I0608 16:33:34.968680  4531 status_update_manager.cpp:177] Pausing sending status updates
I0608 16:33:34.971144  4532 state.cpp:62] Recovering state from '/tmp/Endpoint_SlaveEndpointTest_UnauthorizedRequest_1_qJHEyq/meta'
I0608 16:33:34.971801  4536 status_update_manager.cpp:203] Recovering status update manager
I0608 16:33:34.972234  4536 containerizer.cpp:582] Recovering containerizer
I0608 16:33:34.975111  4532 provisioner.cpp:416] Provisioner recovery complete
I0608 16:33:34.976114  4532 slave.cpp:6127] Finished recovery
I0608 16:33:34.976872  4532 slave.cpp:6309] Querying resource estimator for oversubscribable
resources
I0608 16:33:34.977907  4532 slave.cpp:6323] Received oversubscribable resources {} from the
resource estimator
I0608 16:33:34.983127  4538 process.cpp:3778] Handling HTTP event for process 'slave(758)'
with path: '/slave(758)/monitor/statistics.json'
I0608 16:33:34.987305  4538 http.cpp:1115] HTTP GET for /slave(758)/monitor/statistics.json
from 172.17.0.2:48928
I0608 16:33:34.987445  4538 http.cpp:936] Authorizing principal 'test-principal' to GET the
'/monitor/statistics.json' endpoint
I0608 16:33:34.992736  4536 slave.cpp:817] Agent terminating
[       OK ] Endpoint/SlaveEndpointTest.UnauthorizedRequest/1 (52 ms)
[ RUN      ] Endpoint/SlaveEndpointTest.UnauthorizedRequest/2
I0608 16:33:35.008811  4512 containerizer.cpp:230] Using isolation: posix/cpu,posix/mem,filesystem/posix,network/cni,environment_secret
W0608 16:33:35.009937  4512 backend.cpp:76] Failed to create 'overlay' backend: OverlayBackend
requires root privileges
W0608 16:33:35.010366  4512 backend.cpp:76] Failed to create 'bind' backend: BindBackend requires
root privileges
I0608 16:33:35.010419  4512 provisioner.cpp:255] Using default backend 'copy'
I0608 16:33:35.016649  4531 slave.cpp:248] Mesos agent started on (759)@172.17.0.2:43853
I0608 16:33:35.016692  4531 slave.cpp:249] Flags at startup: --acls="" --appc_simple_discovery_uri_prefix="http://"
--appc_store_dir="/tmp/Endpoint_SlaveEndpointTest_UnauthorizedRequest_2_aVnLUy/store/appc"
--authenticate_http_readonly="true" --authenticate_http_readwrite="true" --authenticatee="crammd5"
--authentication_backoff_factor="1secs" --authorizer="local" --cgroups_cpu_enable_pids_and_tids_count="false"
--cgroups_enable_cfs="false" --cgroups_hierarchy="/sys/fs/cgroup" --cgroups_limit_swap="false"
--cgroups_root="mesos" --container_disk_watch_interval="15secs" --containerizers="mesos" --credential="/tmp/Endpoint_SlaveEndpointTest_UnauthorizedRequest_2_aVnLUy/credential"
--default_role="*" --disk_watch_interval="1mins" --docker="docker" --docker_kill_orphans="true"
--docker_registry="https://registry-1.docker.io" --docker_remove_delay="6hrs" --docker_socket="/var/run/docker.sock"
--docker_stop_timeout="0ns" --docker_store_dir="/tmp/Endpoint_SlaveEndpointTest_UnauthorizedRequest_2_aVnLUy/store/docker"
--docker_volume_checkpoint_dir="/var/run/mesos/isolators/docker/volume" --enforce_container_disk_quota="false"
--executor_registration_timeout="1mins" --executor_reregistration_timeout="2secs" --executor_shutdown_grace_period="5secs"
--fetcher_cache_dir="/tmp/Endpoint_SlaveEndpointTest_UnauthorizedRequest_2_aVnLUy/fetch" --fetcher_cache_size="2GB"
--frameworks_home="" --gc_delay="1weeks" --gc_disk_headroom="0.1" --hadoop_home="" --help="false"
--hostname_lookup="true" --http_command_executor="false" --http_credentials="/tmp/Endpoint_SlaveEndpointTest_UnauthorizedRequest_2_aVnLUy/http_credentials"
--http_heartbeat_interval="30secs" --initialize_driver_logging="true" --isolation="posix/cpu,posix/mem"
--launcher="posix" --launcher_dir="/mesos/mesos-1.4.0/_build/src" --logbufsecs="0" --logging_level="INFO"
--max_completed_executors_per_framework="150" --oversubscribed_resources_interval="15secs"
--perf_duration="10secs" --perf_interval="1mins" --port="5051" --qos_correction_interval_min="0ns"
--quiet="false" --recover="reconnect" --recovery_timeout="15mins" --registration_backoff_factor="10ms"
--resources="cpus:2;gpus:0;mem:1024;disk:1024;ports:[31000-32000]" --revocable_cpu_low_priority="true"
--runtime_dir="/tmp/Endpoint_SlaveEndpointTest_UnauthorizedRequest_2_aVnLUy" --sandbox_directory="/mnt/mesos/sandbox"
--strict="true" --switch_user="true" --systemd_enable_support="true" --systemd_runtime_directory="/run/systemd/system"
--version="false" --work_dir="/tmp/Endpoint_SlaveEndpointTest_UnauthorizedRequest_2_KjRNo8"
I0608 16:33:35.017422  4531 credentials.hpp:86] Loading credential for authentication from
'/tmp/Endpoint_SlaveEndpointTest_UnauthorizedRequest_2_aVnLUy/credential'
I0608 16:33:35.017777  4531 slave.cpp:281] Agent using credential for: test-principal
I0608 16:33:35.017809  4531 credentials.hpp:37] Loading credentials for authentication from
'/tmp/Endpoint_SlaveEndpointTest_UnauthorizedRequest_2_aVnLUy/http_credentials'
I0608 16:33:35.018286  4531 http.cpp:975] Creating default 'basic' HTTP authenticator for
realm 'mesos-agent-readonly'
I0608 16:33:35.018559  4531 http.cpp:975] Creating default 'basic' HTTP authenticator for
realm 'mesos-agent-readwrite'
I0608 16:33:35.020542  4531 slave.cpp:552] Agent resources: cpus(*):2; mem(*):1024; disk(*):1024;
ports(*):[31000-32000]
I0608 16:33:35.020683  4531 slave.cpp:560] Agent attributes: [  ]
I0608 16:33:35.020934  4531 slave.cpp:565] Agent hostname: 19c7d99a2312
I0608 16:33:35.021229  4534 status_update_manager.cpp:177] Pausing sending status updates
I0608 16:33:35.023233  4532 state.cpp:62] Recovering state from '/tmp/Endpoint_SlaveEndpointTest_UnauthorizedRequest_2_KjRNo8/meta'
I0608 16:33:35.024121  4536 status_update_manager.cpp:203] Recovering status update manager
I0608 16:33:35.024435  4536 containerizer.cpp:582] Recovering containerizer
I0608 16:33:35.026582  4536 provisioner.cpp:416] Provisioner recovery complete
I0608 16:33:35.027398  4535 slave.cpp:6127] Finished recovery
I0608 16:33:35.034466  4535 slave.cpp:6309] Querying resource estimator for oversubscribable
resources
I0608 16:33:35.043164  4535 slave.cpp:6323] Received oversubscribable resources {} from the
resource estimator
I0608 16:33:35.048043  4531 process.cpp:3778] Handling HTTP event for process 'slave(759)'
with path: '/slave(759)/containers'
I0608 16:33:35.050571  4537 http.cpp:1115] HTTP GET for /slave(759)/containers from 172.17.0.2:48930
I0608 16:33:35.051149  4537 http.cpp:936] Authorizing principal 'test-principal' to GET the
'/containers' endpoint
I0608 16:33:35.056388  4536 slave.cpp:817] Agent terminating
[       OK ] Endpoint/SlaveEndpointTest.UnauthorizedRequest/2 (63 ms)
[ RUN      ] Endpoint/SlaveEndpointTest.NoAuthorizer/0
I0608 16:33:35.072476  4512 containerizer.cpp:230] Using isolation: posix/cpu,posix/mem,filesystem/posix,network/cni,environment_secret
W0608 16:33:35.073591  4512 backend.cpp:76] Failed to create 'overlay' backend: OverlayBackend
requires root privileges
W0608 16:33:35.074095  4512 backend.cpp:76] Failed to create 'bind' backend: BindBackend requires
root privileges
I0608 16:33:35.074156  4512 provisioner.cpp:255] Using default backend 'copy'
I0608 16:33:35.076925  4512 cluster.cpp:448] Creating default 'local' authorizer
I0608 16:33:35.081055  4532 slave.cpp:248] Mesos agent started on (760)@172.17.0.2:43853
I0608 16:33:35.081097  4532 slave.cpp:249] Flags at startup: --acls="" --appc_simple_discovery_uri_prefix="http://"
--appc_store_dir="/tmp/Endpoint_SlaveEndpointTest_NoAuthorizer_0_a94Hxh/store/appc" --authenticate_http_readonly="true"
--authenticate_http_readwrite="true" --authenticatee="crammd5" --authentication_backoff_factor="1secs"
--authorizer="local" --cgroups_cpu_enable_pids_and_tids_count="false" --cgroups_enable_cfs="false"
--cgroups_hierarchy="/sys/fs/cgroup" --cgroups_limit_swap="false" --cgroups_root="mesos" --container_disk_watch_interval="15secs"
--containerizers="mesos" --credential="/tmp/Endpoint_SlaveEndpointTest_NoAuthorizer_0_a94Hxh/credential"
--default_role="*" --disk_watch_interval="1mins" --docker="docker" --docker_kill_orphans="true"
--docker_registry="https://registry-1.docker.io" --docker_remove_delay="6hrs" --docker_socket="/var/run/docker.sock"
--docker_stop_timeout="0ns" --docker_store_dir="/tmp/Endpoint_SlaveEndpointTest_NoAuthorizer_0_a94Hxh/store/docker"
--docker_volume_checkpoint_dir="/var/run/mesos/isolators/docker/volume" --enforce_container_disk_quota="false"
--executor_registration_timeout="1mins" --executor_reregistration_timeout="2secs" --executor_shutdown_grace_period="5secs"
--fetcher_cache_dir="/tmp/Endpoint_SlaveEndpointTest_NoAuthorizer_0_a94Hxh/fetch" --fetcher_cache_size="2GB"
--frameworks_home="" --gc_delay="1weeks" --gc_disk_headroom="0.1" --hadoop_home="" --help="false"
--hostname_lookup="true" --http_command_executor="false" --http_credentials="/tmp/Endpoint_SlaveEndpointTest_NoAuthorizer_0_a94Hxh/http_credentials"
--http_heartbeat_interval="30secs" --initialize_driver_logging="true" --isolation="posix/cpu,posix/mem"
--launcher="posix" --launcher_dir="/mesos/mesos-1.4.0/_build/src" --logbufsecs="0" --logging_level="INFO"
--max_completed_executors_per_framework="150" --oversubscribed_resources_interval="15secs"
--perf_duration="10secs" --perf_interval="1mins" --port="5051" --qos_correction_interval_min="0ns"
--quiet="false" --recover="reconnect" --recovery_timeout="15mins" --registration_backoff_factor="10ms"
--resources="cpus:2;gpus:0;mem:1024;disk:1024;ports:[31000-32000]" --revocable_cpu_low_priority="true"
--runtime_dir="/tmp/Endpoint_SlaveEndpointTest_NoAuthorizer_0_a94Hxh" --sandbox_directory="/mnt/mesos/sandbox"
--strict="true" --switch_user="true" --systemd_enable_support="true" --systemd_runtime_directory="/run/systemd/system"
--version="false" --work_dir="/tmp/Endpoint_SlaveEndpointTest_NoAuthorizer_0_YO7tRQ"
I0608 16:33:35.082059  4532 credentials.hpp:86] Loading credential for authentication from
'/tmp/Endpoint_SlaveEndpointTest_NoAuthorizer_0_a94Hxh/credential'
I0608 16:33:35.082484  4532 slave.cpp:281] Agent using credential for: test-principal
I0608 16:33:35.082516  4532 credentials.hpp:37] Loading credentials for authentication from
'/tmp/Endpoint_SlaveEndpointTest_NoAuthorizer_0_a94Hxh/http_credentials'
I0608 16:33:35.083017  4532 http.cpp:975] Creating default 'basic' HTTP authenticator for
realm 'mesos-agent-readonly'
I0608 16:33:35.083420  4532 http.cpp:975] Creating default 'basic' HTTP authenticator for
realm 'mesos-agent-readwrite'
I0608 16:33:35.085701  4532 slave.cpp:552] Agent resources: cpus(*):2; mem(*):1024; disk(*):1024;
ports(*):[31000-32000]
I0608 16:33:35.085844  4532 slave.cpp:560] Agent attributes: [  ]
I0608 16:33:35.085870  4532 slave.cpp:565] Agent hostname: 19c7d99a2312
I0608 16:33:35.086561  4538 status_update_manager.cpp:177] Pausing sending status updates
I0608 16:33:35.088368  4532 state.cpp:62] Recovering state from '/tmp/Endpoint_SlaveEndpointTest_NoAuthorizer_0_YO7tRQ/meta'
I0608 16:33:35.088840  4536 status_update_manager.cpp:203] Recovering status update manager
I0608 16:33:35.089231  4536 containerizer.cpp:582] Recovering containerizer
I0608 16:33:35.092191  4536 provisioner.cpp:416] Provisioner recovery complete
I0608 16:33:35.093185  4536 slave.cpp:6127] Finished recovery
I0608 16:33:35.094207  4536 slave.cpp:6309] Querying resource estimator for oversubscribable
resources
I0608 16:33:35.094775  4533 slave.cpp:6323] Received oversubscribable resources {} from the
resource estimator
I0608 16:33:35.099189  4534 process.cpp:3778] Handling HTTP event for process 'slave(760)'
with path: '/slave(760)/monitor/statistics'
I0608 16:33:35.102044  4534 http.cpp:1115] HTTP GET for /slave(760)/monitor/statistics from
172.17.0.2:48932
I0608 16:33:35.102162  4534 http.cpp:936] Authorizing principal 'test-principal' to GET the
'/monitor/statistics' endpoint
I0608 16:33:35.108180  4533 slave.cpp:817] Agent terminating
[       OK ] Endpoint/SlaveEndpointTest.NoAuthorizer/0 (52 ms)
[ RUN      ] Endpoint/SlaveEndpointTest.NoAuthorizer/1
I0608 16:33:35.124297  4512 containerizer.cpp:230] Using isolation: posix/cpu,posix/mem,filesystem/posix,network/cni,environment_secret
W0608 16:33:35.125504  4512 backend.cpp:76] Failed to create 'overlay' backend: OverlayBackend
requires root privileges
W0608 16:33:35.125967  4512 backend.cpp:76] Failed to create 'bind' backend: BindBackend requires
root privileges
I0608 16:33:35.126020  4512 provisioner.cpp:255] Using default backend 'copy'
I0608 16:33:35.128645  4512 cluster.cpp:448] Creating default 'local' authorizer
I0608 16:33:35.133174  4535 slave.cpp:248] Mesos agent started on (761)@172.17.0.2:43853
I0608 16:33:35.133215  4535 slave.cpp:249] Flags at startup: --acls="" --appc_simple_discovery_uri_prefix="http://"
--appc_store_dir="/tmp/Endpoint_SlaveEndpointTest_NoAuthorizer_1_SZuuJ0/store/appc" --authenticate_http_readonly="true"
--authenticate_http_readwrite="true" --authenticatee="crammd5" --authentication_backoff_factor="1secs"
--authorizer="local" --cgroups_cpu_enable_pids_and_tids_count="false" --cgroups_enable_cfs="false"
--cgroups_hierarchy="/sys/fs/cgroup" --cgroups_limit_swap="false" --cgroups_root="mesos" --container_disk_watch_interval="15secs"
--containerizers="mesos" --credential="/tmp/Endpoint_SlaveEndpointTest_NoAuthorizer_1_SZuuJ0/credential"
--default_role="*" --disk_watch_interval="1mins" --docker="docker" --docker_kill_orphans="true"
--docker_registry="https://registry-1.docker.io" --docker_remove_delay="6hrs" --docker_socket="/var/run/docker.sock"
--docker_stop_timeout="0ns" --docker_store_dir="/tmp/Endpoint_SlaveEndpointTest_NoAuthorizer_1_SZuuJ0/store/docker"
--docker_volume_checkpoint_dir="/var/run/mesos/isolators/docker/volume" --enforce_container_disk_quota="false"
--executor_registration_timeout="1mins" --executor_reregistration_timeout="2secs" --executor_shutdown_grace_period="5secs"
--fetcher_cache_dir="/tmp/Endpoint_SlaveEndpointTest_NoAuthorizer_1_SZuuJ0/fetch" --fetcher_cache_size="2GB"
--frameworks_home="" --gc_delay="1weeks" --gc_disk_headroom="0.1" --hadoop_home="" --help="false"
--hostname_lookup="true" --http_command_executor="false" --http_credentials="/tmp/Endpoint_SlaveEndpointTest_NoAuthorizer_1_SZuuJ0/http_credentials"
--http_heartbeat_interval="30secs" --initialize_driver_logging="true" --isolation="posix/cpu,posix/mem"
--launcher="posix" --launcher_dir="/mesos/mesos-1.4.0/_build/src" --logbufsecs="0" --logging_level="INFO"
--max_completed_executors_per_framework="150" --oversubscribed_resources_interval="15secs"
--perf_duration="10secs" --perf_interval="1mins" --port="5051" --qos_correction_interval_min="0ns"
--quiet="false" --recover="reconnect" --recovery_timeout="15mins" --registration_backoff_factor="10ms"
--resources="cpus:2;gpus:0;mem:1024;disk:1024;ports:[31000-32000]" --revocable_cpu_low_priority="true"
--runtime_dir="/tmp/Endpoint_SlaveEndpointTest_NoAuthorizer_1_SZuuJ0" --sandbox_directory="/mnt/mesos/sandbox"
--strict="true" --switch_user="true" --systemd_enable_support="true" --systemd_runtime_directory="/run/systemd/system"
--version="false" --work_dir="/tmp/Endpoint_SlaveEndpointTest_NoAuthorizer_1_izKSUz"
I0608 16:33:35.134052  4535 credentials.hpp:86] Loading credential for authentication from
'/tmp/Endpoint_SlaveEndpointTest_NoAuthorizer_1_SZuuJ0/credential'
I0608 16:33:35.134471  4535 slave.cpp:281] Agent using credential for: test-principal
I0608 16:33:35.134502  4535 credentials.hpp:37] Loading credentials for authentication from
'/tmp/Endpoint_SlaveEndpointTest_NoAuthorizer_1_SZuuJ0/http_credentials'
I0608 16:33:35.135031  4535 http.cpp:975] Creating default 'basic' HTTP authenticator for
realm 'mesos-agent-readonly'
I0608 16:33:35.135375  4535 http.cpp:975] Creating default 'basic' HTTP authenticator for
realm 'mesos-agent-readwrite'
I0608 16:33:35.137411  4535 slave.cpp:552] Agent resources: cpus(*):2; mem(*):1024; disk(*):1024;
ports(*):[31000-32000]
I0608 16:33:35.137553  4535 slave.cpp:560] Agent attributes: [  ]
I0608 16:33:35.137575  4535 slave.cpp:565] Agent hostname: 19c7d99a2312
I0608 16:33:35.138190  4538 status_update_manager.cpp:177] Pausing sending status updates
I0608 16:33:35.140146  4533 state.cpp:62] Recovering state from '/tmp/Endpoint_SlaveEndpointTest_NoAuthorizer_1_izKSUz/meta'
I0608 16:33:35.140571  4535 status_update_manager.cpp:203] Recovering status update manager
I0608 16:33:35.141181  4531 containerizer.cpp:582] Recovering containerizer
I0608 16:33:35.144140  4531 provisioner.cpp:416] Provisioner recovery complete
I0608 16:33:35.144875  4534 slave.cpp:6127] Finished recovery
I0608 16:33:35.145656  4534 slave.cpp:6309] Querying resource estimator for oversubscribable
resources
I0608 16:33:35.146332  4533 slave.cpp:6323] Received oversubscribable resources {} from the
resource estimator
I0608 16:33:35.150951  4535 process.cpp:3778] Handling HTTP event for process 'slave(761)'
with path: '/slave(761)/monitor/statistics.json'
I0608 16:33:35.153445  4536 http.cpp:1115] HTTP GET for /slave(761)/monitor/statistics.json
from 172.17.0.2:48934
I0608 16:33:35.153626  4536 http.cpp:936] Authorizing principal 'test-principal' to GET the
'/monitor/statistics.json' endpoint
I0608 16:33:35.159030  4538 slave.cpp:817] Agent terminating
[       OK ] Endpoint/SlaveEndpointTest.NoAuthorizer/1 (51 ms)
[ RUN      ] Endpoint/SlaveEndpointTest.NoAuthorizer/2
I0608 16:33:35.174525  4512 containerizer.cpp:230] Using isolation: posix/cpu,posix/mem,filesystem/posix,network/cni,environment_secret
W0608 16:33:35.175688  4512 backend.cpp:76] Failed to create 'overlay' backend: OverlayBackend
requires root privileges
W0608 16:33:35.176115  4512 backend.cpp:76] Failed to create 'bind' backend: BindBackend requires
root privileges
I0608 16:33:35.176167  4512 provisioner.cpp:255] Using default backend 'copy'
I0608 16:33:35.178793  4512 cluster.cpp:448] Creating default 'local' authorizer
I0608 16:33:35.182647  4534 slave.cpp:248] Mesos agent started on (762)@172.17.0.2:43853
I0608 16:33:35.182689  4534 slave.cpp:249] Flags at startup: --acls="" --appc_simple_discovery_uri_prefix="http://"
--appc_store_dir="/tmp/Endpoint_SlaveEndpointTest_NoAuthorizer_2_o02isK/store/appc" --authenticate_http_readonly="true"
--authenticate_http_readwrite="true" --authenticatee="crammd5" --authentication_backoff_factor="1secs"
--authorizer="local" --cgroups_cpu_enable_pids_and_tids_count="false" --cgroups_enable_cfs="false"
--cgroups_hierarchy="/sys/fs/cgroup" --cgroups_limit_swap="false" --cgroups_root="mesos" --container_disk_watch_interval="15secs"
--containerizers="mesos" --credential="/tmp/Endpoint_SlaveEndpointTest_NoAuthorizer_2_o02isK/credential"
--default_role="*" --disk_watch_interval="1mins" --docker="docker" --docker_kill_orphans="true"
--docker_registry="https://registry-1.docker.io" --docker_remove_delay="6hrs" --docker_socket="/var/run/docker.sock"
--docker_stop_timeout="0ns" --docker_store_dir="/tmp/Endpoint_SlaveEndpointTest_NoAuthorizer_2_o02isK/store/docker"
--docker_volume_checkpoint_dir="/var/run/mesos/isolators/docker/volume" --enforce_container_disk_quota="false"
--executor_registration_timeout="1mins" --executor_reregistration_timeout="2secs" --executor_shutdown_grace_period="5secs"
--fetcher_cache_dir="/tmp/Endpoint_SlaveEndpointTest_NoAuthorizer_2_o02isK/fetch" --fetcher_cache_size="2GB"
--frameworks_home="" --gc_delay="1weeks" --gc_disk_headroom="0.1" --hadoop_home="" --help="false"
--hostname_lookup="true" --http_command_executor="false" --http_credentials="/tmp/Endpoint_SlaveEndpointTest_NoAuthorizer_2_o02isK/http_credentials"
--http_heartbeat_interval="30secs" --initialize_driver_logging="true" --isolation="posix/cpu,posix/mem"
--launcher="posix" --launcher_dir="/mesos/mesos-1.4.0/_build/src" --logbufsecs="0" --logging_level="INFO"
--max_completed_executors_per_framework="150" --oversubscribed_resources_interval="15secs"
--perf_duration="10secs" --perf_interval="1mins" --port="5051" --qos_correction_interval_min="0ns"
--quiet="false" --recover="reconnect" --recovery_timeout="15mins" --registration_backoff_factor="10ms"
--resources="cpus:2;gpus:0;mem:1024;disk:1024;ports:[31000-32000]" --revocable_cpu_low_priority="true"
--runtime_dir="/tmp/Endpoint_SlaveEndpointTest_NoAuthorizer_2_o02isK" --sandbox_directory="/mnt/mesos/sandbox"
--strict="true" --switch_user="true" --systemd_enable_support="true" --systemd_runtime_directory="/run/systemd/system"
--version="false" --work_dir="/tmp/Endpoint_SlaveEndpointTest_NoAuthorizer_2_Euotvj"
I0608 16:33:35.183524  4534 credentials.hpp:86] Loading credential for authentication from
'/tmp/Endpoint_SlaveEndpointTest_NoAuthorizer_2_o02isK/credential'
I0608 16:33:35.183960  4534 slave.cpp:281] Agent using credential for: test-principal
I0608 16:33:35.183995  4534 credentials.hpp:37] Loading credentials for authentication from
'/tmp/Endpoint_SlaveEndpointTest_NoAuthorizer_2_o02isK/http_credentials'
I0608 16:33:35.185406  4534 http.cpp:975] Creating default 'basic' HTTP authenticator for
realm 'mesos-agent-readonly'
I0608 16:33:35.185751  4534 http.cpp:975] Creating default 'basic' HTTP authenticator for
realm 'mesos-agent-readwrite'
I0608 16:33:35.187997  4534 slave.cpp:552] Agent resources: cpus(*):2; mem(*):1024; disk(*):1024;
ports(*):[31000-32000]
I0608 16:33:35.188143  4534 slave.cpp:560] Agent attributes: [  ]
I0608 16:33:35.188165  4534 slave.cpp:565] Agent hostname: 19c7d99a2312
I0608 16:33:35.188578  4536 status_update_manager.cpp:177] Pausing sending status updates
I0608 16:33:35.190595  4538 state.cpp:62] Recovering state from '/tmp/Endpoint_SlaveEndpointTest_NoAuthorizer_2_Euotvj/meta'
I0608 16:33:35.191085  4536 status_update_manager.cpp:203] Recovering status update manager
I0608 16:33:35.191443  4532 containerizer.cpp:582] Recovering containerizer
I0608 16:33:35.193893  4531 provisioner.cpp:416] Provisioner recovery complete
I0608 16:33:35.194521  4532 slave.cpp:6127] Finished recovery
I0608 16:33:35.195464  4532 slave.cpp:6309] Querying resource estimator for oversubscribable
resources
I0608 16:33:35.196243  4532 slave.cpp:6323] Received oversubscribable resources {} from the
resource estimator
I0608 16:33:35.200748  4536 process.cpp:3778] Handling HTTP event for process 'slave(762)'
with path: '/slave(762)/containers'
I0608 16:33:35.203246  4536 http.cpp:1115] HTTP GET for /slave(762)/containers from 172.17.0.2:48936
I0608 16:33:35.203438  4536 http.cpp:936] Authorizing principal 'test-principal' to GET the
'/containers' endpoint
I0608 16:33:35.209440  4512 slave.cpp:817] Agent terminating
[       OK ] Endpoint/SlaveEndpointTest.NoAuthorizer/2 (50 ms)
[----------] 9 tests from Endpoint/SlaveEndpointTest (481 ms total)

[----------] Global test environment tear-down
[==========] 1589 tests from 176 test cases ran. (744292 ms total)
[  PASSED  ] 1585 tests.
[  FAILED  ] 4 tests, listed below:
[  FAILED  ] DefaultExecutorCheckTest.CommandCheckDeliveredAndReconciled
[  FAILED  ] DefaultExecutorCheckTest.CommandCheckStatusChange
[  FAILED  ] DefaultExecutorCheckTest.CommandCheckSeesParentsEnv
[  FAILED  ] DefaultExecutorCheckTest.CommandCheckSharesWorkDirWithTask

 4 FAILED TESTS
  YOU HAVE 22 DISABLED TESTS

E0608 16:33:35.354523  4539 process.cpp:968] Failed to accept socket: future discarded
make[4]: *** [check-local] Error 1
make[4]: Leaving directory `/mesos/mesos-1.4.0/_build/src'
make[3]: *** [check-am] Error 2
make[3]: Leaving directory `/mesos/mesos-1.4.0/_build/src'
make[2]: *** [check] Error 2
make[2]: Leaving directory `/mesos/mesos-1.4.0/_build/src'
make[1]: *** [check-recursive] Error 1
make[1]: Leaving directory `/mesos/mesos-1.4.0/_build'
make: *** [distcheck] Error 1
+ docker rmi mesos-1496933680-10926
Untagged: mesos-1496933680-10926:latest
Deleted: sha256:1bfc8555de5716bed2b83de2113c30c64ce4ed720b52ef8ea9fff65eec45e6a4
Deleted: sha256:b7c11ef62369a6cc205279d5ae2e85233283b180cdb303f4a2487036d0081083
Deleted: sha256:b207d84d695571eed4d22b508a17793a423ed7d2eb5abea0f88127466ace2365
Deleted: sha256:3630b1cb1a1466b0a67c4e0a34aafe84467e33c20ee2f0eb7cb53647563e58f9
Deleted: sha256:80d1d77888612a1f6474d3a1c616e34d94493ced999d8ad1351e9d1d9f5bc903
Deleted: sha256:bdb34b729464eba2263989d452345813d99eb10d926ee18afce86e8ce69665ff
Deleted: sha256:ac215531e6e3a531be39aabe2fbe0459eeae058cc0f4d75928774b0fe71e1963
Deleted: sha256:84fb957cd13878cc1d6820b237ad2f4734da0fa9d62481f9d64f907ad4f024b2
Deleted: sha256:0bd5715f9b144a45eec976a625a3c0115c7426a745d4c13d69c33748cac2951f
Deleted: sha256:440f74d5d8132d4b03df064e22424ccb1ad0949f427979a4c896369b53206deb
Deleted: sha256:b4a5111daea1575556a34add6f11a020222d376b1b217b321813803e2fbf1ae2
Deleted: sha256:4f2d2ad43b0f1ccfb20f9f26dec89f4bf04a288ededbaee537d260986eaf5dc3
Deleted: sha256:ea015091e5ee51fb51258aa1731c33f49235d189b55a9133df7daa08a52e3fea
Deleted: sha256:4a4c612d862a218e5ed06fb75001b90d609b400adbfd06f3f8d1ca69830550f0
Deleted: sha256:377fb0cf9f5dc78049a2a51622fc94fb3a2a6ac83bf9b53331b6772e9a6722ce
Deleted: sha256:16ee10e445b3fbd40318c7c3358f721358fe10d33e1ce05cb1070f35d294fc3c
Deleted: sha256:d69f1fb5a4634cc462f23021ec6feee7c9f771476f78827ff4ba29a69434ebc8
Deleted: sha256:842585d6f6def91fee4777520ed9ddc83bb54f7ea181a03d928024fcab85685f
Deleted: sha256:86543be0f9575235a9071c98af30fa7c9d1547b09f63e412cd3f64fe0fd37300
Deleted: sha256:961d7e88992087047cc730f3fc520204a012a2b08be01be5a16d9e310ff81400
Deleted: sha256:2e346f85905f3d7ef8c33a2fc5d6cb10faf85f1135bf82bc28fa7320b0b12f71
Deleted: sha256:741c69a1d232b41b930d32410edd9803b7e5d4c88f6be2f442d1a66642ecdb14
Deleted: sha256:0beaf985fbdf35bacbcf528d42ba7c357f0773cacd0711d2a2c83c9f6edd2ece
Deleted: sha256:450d9bfd7902ca762748f47e93b75654b9de505090813535d861804ad3d7df7d
Build step 'Execute shell' marked build as failure

Mime
View raw message