mesos-builds mailing list archives

Site index · List index
Message view « Date » · « Thread »
Top « Date » · « Thread »
From Apache Jenkins Server <jenk...@builds.apache.org>
Subject Build failed in Jenkins: Mesos-Buildbot » cmake,clang,--verbose,GLOG_v=1 MESOS_VERBOSE=1,ubuntu:14.04,(ubuntu)&&(!ubuntu-us1)&&(!ubuntu-eu2) #3850
Date Thu, 29 Jun 2017 11:05:57 GMT
See <https://builds.apache.org/job/Mesos-Buildbot/BUILDTOOL=cmake,COMPILER=clang,CONFIGURATION=--verbose,ENVIRONMENT=GLOG_v=1%20MESOS_VERBOSE=1,OS=ubuntu%3A14.04,label_exp=(ubuntu)&&(!ubuntu-us1)&&(!ubuntu-eu2)/3850/display/redirect?page=changes>

Changes:

[vinodkone] Fixed parameters in JNI call for disconnected event.

[vinodkone] Logged operator API subscribed removal.

[bmahler] Fixed a regression in support/apply-reviews.py.

------------------------------------------
[...truncated 27.40 MB...]
I0629 11:05:48.946992 30649 http.cpp:1114] HTTP GET for /slave(766)/monitor/statistics.json
from 172.17.0.2:34204
I0629 11:05:48.947105 30649 http.cpp:935] Authorizing principal 'test-principal' to GET the
'/monitor/statistics.json' endpoint
I0629 11:05:48.952275 30645 slave.cpp:818] Agent terminating
[       OK ] Endpoint/SlaveEndpointTest.AuthorizedRequest/1 (46 ms)
[ RUN      ] Endpoint/SlaveEndpointTest.AuthorizedRequest/2
I0629 11:05:48.966945 30641 containerizer.cpp:230] Using isolation: posix/cpu,posix/mem,filesystem/posix,network/cni,environment_secret
W0629 11:05:48.967798 30641 backend.cpp:76] Failed to create 'overlay' backend: OverlayBackend
requires root privileges
W0629 11:05:48.968062 30641 backend.cpp:76] Failed to create 'bind' backend: BindBackend requires
root privileges
I0629 11:05:48.968106 30641 provisioner.cpp:255] Using default backend 'copy'
I0629 11:05:48.973906 30642 slave.cpp:249] Mesos agent started on (767)@172.17.0.2:45281
I0629 11:05:48.973959 30642 slave.cpp:250] Flags at startup: --acls="" --appc_simple_discovery_uri_prefix="http://"
--appc_store_dir="/tmp/Endpoint_SlaveEndpointTest_AuthorizedRequest_2_QdXmU1/store/appc" --authenticate_http_readonly="true"
--authenticate_http_readwrite="true" --authenticatee="crammd5" --authentication_backoff_factor="1secs"
--authorizer="local" --cgroups_cpu_enable_pids_and_tids_count="false" --cgroups_enable_cfs="false"
--cgroups_hierarchy="/sys/fs/cgroup" --cgroups_limit_swap="false" --cgroups_root="mesos" --container_disk_watch_interval="15secs"
--containerizers="mesos" --credential="/tmp/Endpoint_SlaveEndpointTest_AuthorizedRequest_2_QdXmU1/credential"
--default_role="*" --disk_watch_interval="1mins" --docker="docker" --docker_kill_orphans="true"
--docker_registry="https://registry-1.docker.io" --docker_remove_delay="6hrs" --docker_socket="/var/run/docker.sock"
--docker_stop_timeout="0ns" --docker_store_dir="/tmp/Endpoint_SlaveEndpointTest_AuthorizedRequest_2_QdXmU1/store/docker"
--docker_volume_checkpoint_dir="/var/run/mesos/isolators/docker/volume" --enforce_container_disk_quota="false"
--executor_registration_timeout="1mins" --executor_reregistration_timeout="2secs" --executor_shutdown_grace_period="5secs"
--fetcher_cache_dir="/tmp/Endpoint_SlaveEndpointTest_AuthorizedRequest_2_QdXmU1/fetch" --fetcher_cache_size="2GB"
--frameworks_home="" --gc_delay="1weeks" --gc_disk_headroom="0.1" --hadoop_home="" --help="false"
--hostname_lookup="true" --http_command_executor="false" --http_credentials="/tmp/Endpoint_SlaveEndpointTest_AuthorizedRequest_2_QdXmU1/http_credentials"
--http_heartbeat_interval="30secs" --initialize_driver_logging="true" --isolation="posix/cpu,posix/mem"
--launcher="posix" --launcher_dir="/mesos/build/src" --logbufsecs="0" --logging_level="INFO"
--max_completed_executors_per_framework="150" --oversubscribed_resources_interval="15secs"
--perf_duration="10secs" --perf_interval="1mins" --port="5051" --qos_correction_interval_min="0ns"
--quiet="false" --recover="reconnect" --recovery_timeout="15mins" --registration_backoff_factor="10ms"
--resources="cpus:2;gpus:0;mem:1024;disk:1024;ports:[31000-32000]" --revocable_cpu_low_priority="true"
--runtime_dir="/tmp/Endpoint_SlaveEndpointTest_AuthorizedRequest_2_QdXmU1" --sandbox_directory="/mnt/mesos/sandbox"
--strict="true" --switch_user="true" --systemd_enable_support="true" --systemd_runtime_directory="/run/systemd/system"
--version="false" --work_dir="/tmp/Endpoint_SlaveEndpointTest_AuthorizedRequest_2_3eQlxc"
I0629 11:05:48.974797 30642 credentials.hpp:86] Loading credential for authentication from
'/tmp/Endpoint_SlaveEndpointTest_AuthorizedRequest_2_QdXmU1/credential'
I0629 11:05:48.975252 30642 slave.cpp:282] Agent using credential for: test-principal
I0629 11:05:48.975277 30642 credentials.hpp:37] Loading credentials for authentication from
'/tmp/Endpoint_SlaveEndpointTest_AuthorizedRequest_2_QdXmU1/http_credentials'
I0629 11:05:48.975811 30642 http.cpp:974] Creating default 'basic' HTTP authenticator for
realm 'mesos-agent-readonly'
I0629 11:05:48.976222 30642 http.cpp:974] Creating default 'basic' HTTP authenticator for
realm 'mesos-agent-readwrite'
I0629 11:05:48.978255 30642 slave.cpp:553] Agent resources: [{"name":"cpus","scalar":{"value":2.0},"type":"SCALAR"},{"name":"mem","scalar":{"value":1024.0},"type":"SCALAR"},{"name":"disk","scalar":{"value":1024.0},"type":"SCALAR"},{"name":"ports","ranges":{"range":[{"begin":31000,"end":32000}]},"type":"RANGES"}]
I0629 11:05:48.979112 30642 slave.cpp:561] Agent attributes: [  ]
I0629 11:05:48.979136 30642 slave.cpp:566] Agent hostname: 3a58f1b6825b
I0629 11:05:48.979465 30647 status_update_manager.cpp:177] Pausing sending status updates
I0629 11:05:48.981434 30646 state.cpp:64] Recovering state from '/tmp/Endpoint_SlaveEndpointTest_AuthorizedRequest_2_3eQlxc/meta'
I0629 11:05:48.982278 30646 status_update_manager.cpp:203] Recovering status update manager
I0629 11:05:48.982620 30642 containerizer.cpp:582] Recovering containerizer
I0629 11:05:48.986066 30644 provisioner.cpp:416] Provisioner recovery complete
I0629 11:05:48.986963 30644 slave.cpp:6168] Finished recovery
I0629 11:05:48.987727 30644 slave.cpp:6350] Querying resource estimator for oversubscribable
resources
I0629 11:05:48.988240 30646 slave.cpp:6364] Received oversubscribable resources {} from the
resource estimator
I0629 11:05:48.991843 30649 process.cpp:3779] Handling HTTP event for process 'slave(767)'
with path: '/slave(767)/containers'
I0629 11:05:48.993741 30643 http.cpp:1114] HTTP GET for /slave(767)/containers from 172.17.0.2:34206
I0629 11:05:48.993932 30643 http.cpp:935] Authorizing principal 'test-principal' to GET the
'/containers' endpoint
I0629 11:05:48.999034 30649 slave.cpp:818] Agent terminating
[       OK ] Endpoint/SlaveEndpointTest.AuthorizedRequest/2 (46 ms)
[ RUN      ] Endpoint/SlaveEndpointTest.UnauthorizedRequest/0
I0629 11:05:49.013690 30641 containerizer.cpp:230] Using isolation: posix/cpu,posix/mem,filesystem/posix,network/cni,environment_secret
W0629 11:05:49.014554 30641 backend.cpp:76] Failed to create 'overlay' backend: OverlayBackend
requires root privileges
W0629 11:05:49.014842 30641 backend.cpp:76] Failed to create 'bind' backend: BindBackend requires
root privileges
I0629 11:05:49.014886 30641 provisioner.cpp:255] Using default backend 'copy'
I0629 11:05:49.020490 30644 slave.cpp:249] Mesos agent started on (768)@172.17.0.2:45281
I0629 11:05:49.020579 30644 slave.cpp:250] Flags at startup: --acls="" --appc_simple_discovery_uri_prefix="http://"
--appc_store_dir="/tmp/Endpoint_SlaveEndpointTest_UnauthorizedRequest_0_Kw7JOl/store/appc"
--authenticate_http_readonly="true" --authenticate_http_readwrite="true" --authenticatee="crammd5"
--authentication_backoff_factor="1secs" --authorizer="local" --cgroups_cpu_enable_pids_and_tids_count="false"
--cgroups_enable_cfs="false" --cgroups_hierarchy="/sys/fs/cgroup" --cgroups_limit_swap="false"
--cgroups_root="mesos" --container_disk_watch_interval="15secs" --containerizers="mesos" --credential="/tmp/Endpoint_SlaveEndpointTest_UnauthorizedRequest_0_Kw7JOl/credential"
--default_role="*" --disk_watch_interval="1mins" --docker="docker" --docker_kill_orphans="true"
--docker_registry="https://registry-1.docker.io" --docker_remove_delay="6hrs" --docker_socket="/var/run/docker.sock"
--docker_stop_timeout="0ns" --docker_store_dir="/tmp/Endpoint_SlaveEndpointTest_UnauthorizedRequest_0_Kw7JOl/store/docker"
--docker_volume_checkpoint_dir="/var/run/mesos/isolators/docker/volume" --enforce_container_disk_quota="false"
--executor_registration_timeout="1mins" --executor_reregistration_timeout="2secs" --executor_shutdown_grace_period="5secs"
--fetcher_cache_dir="/tmp/Endpoint_SlaveEndpointTest_UnauthorizedRequest_0_Kw7JOl/fetch" --fetcher_cache_size="2GB"
--frameworks_home="" --gc_delay="1weeks" --gc_disk_headroom="0.1" --hadoop_home="" --help="false"
--hostname_lookup="true" --http_command_executor="false" --http_credentials="/tmp/Endpoint_SlaveEndpointTest_UnauthorizedRequest_0_Kw7JOl/http_credentials"
--http_heartbeat_interval="30secs" --initialize_driver_logging="true" --isolation="posix/cpu,posix/mem"
--launcher="posix" --launcher_dir="/mesos/build/src" --logbufsecs="0" --logging_level="INFO"
--max_completed_executors_per_framework="150" --oversubscribed_resources_interval="15secs"
--perf_duration="10secs" --perf_interval="1mins" --port="5051" --qos_correction_interval_min="0ns"
--quiet="false" --recover="reconnect" --recovery_timeout="15mins" --registration_backoff_factor="10ms"
--resources="cpus:2;gpus:0;mem:1024;disk:1024;ports:[31000-32000]" --revocable_cpu_low_priority="true"
--runtime_dir="/tmp/Endpoint_SlaveEndpointTest_UnauthorizedRequest_0_Kw7JOl" --sandbox_directory="/mnt/mesos/sandbox"
--strict="true" --switch_user="true" --systemd_enable_support="true" --systemd_runtime_directory="/run/systemd/system"
--version="false" --work_dir="/tmp/Endpoint_SlaveEndpointTest_UnauthorizedRequest_0_hOB8jw"
I0629 11:05:49.021339 30644 credentials.hpp:86] Loading credential for authentication from
'/tmp/Endpoint_SlaveEndpointTest_UnauthorizedRequest_0_Kw7JOl/credential'
I0629 11:05:49.021643 30644 slave.cpp:282] Agent using credential for: test-principal
I0629 11:05:49.021692 30644 credentials.hpp:37] Loading credentials for authentication from
'/tmp/Endpoint_SlaveEndpointTest_UnauthorizedRequest_0_Kw7JOl/http_credentials'
I0629 11:05:49.022091 30644 http.cpp:974] Creating default 'basic' HTTP authenticator for
realm 'mesos-agent-readonly'
I0629 11:05:49.022387 30644 http.cpp:974] Creating default 'basic' HTTP authenticator for
realm 'mesos-agent-readwrite'
I0629 11:05:49.024926 30644 slave.cpp:553] Agent resources: [{"name":"cpus","scalar":{"value":2.0},"type":"SCALAR"},{"name":"mem","scalar":{"value":1024.0},"type":"SCALAR"},{"name":"disk","scalar":{"value":1024.0},"type":"SCALAR"},{"name":"ports","ranges":{"range":[{"begin":31000,"end":32000}]},"type":"RANGES"}]
I0629 11:05:49.025303 30644 slave.cpp:561] Agent attributes: [  ]
I0629 11:05:49.025446 30644 slave.cpp:566] Agent hostname: 3a58f1b6825b
I0629 11:05:49.025743 30643 status_update_manager.cpp:177] Pausing sending status updates
I0629 11:05:49.027683 30649 state.cpp:64] Recovering state from '/tmp/Endpoint_SlaveEndpointTest_UnauthorizedRequest_0_hOB8jw/meta'
I0629 11:05:49.028084 30643 status_update_manager.cpp:203] Recovering status update manager
I0629 11:05:49.028484 30642 containerizer.cpp:582] Recovering containerizer
I0629 11:05:49.030663 30648 provisioner.cpp:416] Provisioner recovery complete
I0629 11:05:49.031283 30643 slave.cpp:6168] Finished recovery
I0629 11:05:49.032042 30643 slave.cpp:6350] Querying resource estimator for oversubscribable
resources
I0629 11:05:49.032447 30643 slave.cpp:6364] Received oversubscribable resources {} from the
resource estimator
I0629 11:05:49.035985 30646 process.cpp:3779] Handling HTTP event for process 'slave(768)'
with path: '/slave(768)/monitor/statistics'
I0629 11:05:49.037890 30643 http.cpp:1114] HTTP GET for /slave(768)/monitor/statistics from
172.17.0.2:34208
I0629 11:05:49.038054 30643 http.cpp:935] Authorizing principal 'test-principal' to GET the
'/monitor/statistics' endpoint
I0629 11:05:49.041082 30644 slave.cpp:818] Agent terminating
[       OK ] Endpoint/SlaveEndpointTest.UnauthorizedRequest/0 (41 ms)
[ RUN      ] Endpoint/SlaveEndpointTest.UnauthorizedRequest/1
I0629 11:05:49.055730 30641 containerizer.cpp:230] Using isolation: posix/cpu,posix/mem,filesystem/posix,network/cni,environment_secret
W0629 11:05:49.056592 30641 backend.cpp:76] Failed to create 'overlay' backend: OverlayBackend
requires root privileges
W0629 11:05:49.056895 30641 backend.cpp:76] Failed to create 'bind' backend: BindBackend requires
root privileges
I0629 11:05:49.056939 30641 provisioner.cpp:255] Using default backend 'copy'
I0629 11:05:49.061758 30644 slave.cpp:249] Mesos agent started on (769)@172.17.0.2:45281
I0629 11:05:49.061866 30644 slave.cpp:250] Flags at startup: --acls="" --appc_simple_discovery_uri_prefix="http://"
--appc_store_dir="/tmp/Endpoint_SlaveEndpointTest_UnauthorizedRequest_1_YVJFaG/store/appc"
--authenticate_http_readonly="true" --authenticate_http_readwrite="true" --authenticatee="crammd5"
--authentication_backoff_factor="1secs" --authorizer="local" --cgroups_cpu_enable_pids_and_tids_count="false"
--cgroups_enable_cfs="false" --cgroups_hierarchy="/sys/fs/cgroup" --cgroups_limit_swap="false"
--cgroups_root="mesos" --container_disk_watch_interval="15secs" --containerizers="mesos" --credential="/tmp/Endpoint_SlaveEndpointTest_UnauthorizedRequest_1_YVJFaG/credential"
--default_role="*" --disk_watch_interval="1mins" --docker="docker" --docker_kill_orphans="true"
--docker_registry="https://registry-1.docker.io" --docker_remove_delay="6hrs" --docker_socket="/var/run/docker.sock"
--docker_stop_timeout="0ns" --docker_store_dir="/tmp/Endpoint_SlaveEndpointTest_UnauthorizedRequest_1_YVJFaG/store/docker"
--docker_volume_checkpoint_dir="/var/run/mesos/isolators/docker/volume" --enforce_container_disk_quota="false"
--executor_registration_timeout="1mins" --executor_reregistration_timeout="2secs" --executor_shutdown_grace_period="5secs"
--fetcher_cache_dir="/tmp/Endpoint_SlaveEndpointTest_UnauthorizedRequest_1_YVJFaG/fetch" --fetcher_cache_size="2GB"
--frameworks_home="" --gc_delay="1weeks" --gc_disk_headroom="0.1" --hadoop_home="" --help="false"
--hostname_lookup="true" --http_command_executor="false" --http_credentials="/tmp/Endpoint_SlaveEndpointTest_UnauthorizedRequest_1_YVJFaG/http_credentials"
--http_heartbeat_interval="30secs" --initialize_driver_logging="true" --isolation="posix/cpu,posix/mem"
--launcher="posix" --launcher_dir="/mesos/build/src" --logbufsecs="0" --logging_level="INFO"
--max_completed_executors_per_framework="150" --oversubscribed_resources_interval="15secs"
--perf_duration="10secs" --perf_interval="1mins" --port="5051" --qos_correction_interval_min="0ns"
--quiet="false" --recover="reconnect" --recovery_timeout="15mins" --registration_backoff_factor="10ms"
--resources="cpus:2;gpus:0;mem:1024;disk:1024;ports:[31000-32000]" --revocable_cpu_low_priority="true"
--runtime_dir="/tmp/Endpoint_SlaveEndpointTest_UnauthorizedRequest_1_YVJFaG" --sandbox_directory="/mnt/mesos/sandbox"
--strict="true" --switch_user="true" --systemd_enable_support="true" --systemd_runtime_directory="/run/systemd/system"
--version="false" --work_dir="/tmp/Endpoint_SlaveEndpointTest_UnauthorizedRequest_1_76ygzQ"
I0629 11:05:49.062635 30644 credentials.hpp:86] Loading credential for authentication from
'/tmp/Endpoint_SlaveEndpointTest_UnauthorizedRequest_1_YVJFaG/credential'
I0629 11:05:49.062927 30644 slave.cpp:282] Agent using credential for: test-principal
I0629 11:05:49.062975 30644 credentials.hpp:37] Loading credentials for authentication from
'/tmp/Endpoint_SlaveEndpointTest_UnauthorizedRequest_1_YVJFaG/http_credentials'
I0629 11:05:49.063359 30644 http.cpp:974] Creating default 'basic' HTTP authenticator for
realm 'mesos-agent-readonly'
I0629 11:05:49.063689 30644 http.cpp:974] Creating default 'basic' HTTP authenticator for
realm 'mesos-agent-readwrite'
I0629 11:05:49.065834 30644 slave.cpp:553] Agent resources: [{"name":"cpus","scalar":{"value":2.0},"type":"SCALAR"},{"name":"mem","scalar":{"value":1024.0},"type":"SCALAR"},{"name":"disk","scalar":{"value":1024.0},"type":"SCALAR"},{"name":"ports","ranges":{"range":[{"begin":31000,"end":32000}]},"type":"RANGES"}]
I0629 11:05:49.066208 30644 slave.cpp:561] Agent attributes: [  ]
I0629 11:05:49.066321 30644 slave.cpp:566] Agent hostname: 3a58f1b6825b
I0629 11:05:49.066645 30648 status_update_manager.cpp:177] Pausing sending status updates
I0629 11:05:49.068493 30643 state.cpp:64] Recovering state from '/tmp/Endpoint_SlaveEndpointTest_UnauthorizedRequest_1_76ygzQ/meta'
I0629 11:05:49.069126 30643 status_update_manager.cpp:203] Recovering status update manager
I0629 11:05:49.069525 30643 containerizer.cpp:582] Recovering containerizer
I0629 11:05:49.074700 30647 provisioner.cpp:416] Provisioner recovery complete
I0629 11:05:49.076613 30647 slave.cpp:6168] Finished recovery
I0629 11:05:49.078004 30647 slave.cpp:6350] Querying resource estimator for oversubscribable
resources
I0629 11:05:49.078354 30647 slave.cpp:6364] Received oversubscribable resources {} from the
resource estimator
I0629 11:05:49.082882 30649 process.cpp:3779] Handling HTTP event for process 'slave(769)'
with path: '/slave(769)/monitor/statistics.json'
I0629 11:05:49.084643 30647 http.cpp:1114] HTTP GET for /slave(769)/monitor/statistics.json
from 172.17.0.2:34210
I0629 11:05:49.084794 30647 http.cpp:935] Authorizing principal 'test-principal' to GET the
'/monitor/statistics.json' endpoint
I0629 11:05:49.088011 30641 slave.cpp:818] Agent terminating
[       OK ] Endpoint/SlaveEndpointTest.UnauthorizedRequest/1 (46 ms)
[ RUN      ] Endpoint/SlaveEndpointTest.UnauthorizedRequest/2
I0629 11:05:49.132966 30641 containerizer.cpp:230] Using isolation: posix/cpu,posix/mem,filesystem/posix,network/cni,environment_secret
W0629 11:05:49.133819 30641 backend.cpp:76] Failed to create 'overlay' backend: OverlayBackend
requires root privileges
W0629 11:05:49.134100 30641 backend.cpp:76] Failed to create 'bind' backend: BindBackend requires
root privileges
I0629 11:05:49.134174 30641 provisioner.cpp:255] Using default backend 'copy'
I0629 11:05:49.139173 30648 slave.cpp:249] Mesos agent started on (770)@172.17.0.2:45281
I0629 11:05:49.139226 30648 slave.cpp:250] Flags at startup: --acls="" --appc_simple_discovery_uri_prefix="http://"
--appc_store_dir="/tmp/Endpoint_SlaveEndpointTest_UnauthorizedRequest_2_SYREf1/store/appc"
--authenticate_http_readonly="true" --authenticate_http_readwrite="true" --authenticatee="crammd5"
--authentication_backoff_factor="1secs" --authorizer="local" --cgroups_cpu_enable_pids_and_tids_count="false"
--cgroups_enable_cfs="false" --cgroups_hierarchy="/sys/fs/cgroup" --cgroups_limit_swap="false"
--cgroups_root="mesos" --container_disk_watch_interval="15secs" --containerizers="mesos" --credential="/tmp/Endpoint_SlaveEndpointTest_UnauthorizedRequest_2_SYREf1/credential"
--default_role="*" --disk_watch_interval="1mins" --docker="docker" --docker_kill_orphans="true"
--docker_registry="https://registry-1.docker.io" --docker_remove_delay="6hrs" --docker_socket="/var/run/docker.sock"
--docker_stop_timeout="0ns" --docker_store_dir="/tmp/Endpoint_SlaveEndpointTest_UnauthorizedRequest_2_SYREf1/store/docker"
--docker_volume_checkpoint_dir="/var/run/mesos/isolators/docker/volume" --enforce_container_disk_quota="false"
--executor_registration_timeout="1mins" --executor_reregistration_timeout="2secs" --executor_shutdown_grace_period="5secs"
--fetcher_cache_dir="/tmp/Endpoint_SlaveEndpointTest_UnauthorizedRequest_2_SYREf1/fetch" --fetcher_cache_size="2GB"
--frameworks_home="" --gc_delay="1weeks" --gc_disk_headroom="0.1" --hadoop_home="" --help="false"
--hostname_lookup="true" --http_command_executor="false" --http_credentials="/tmp/Endpoint_SlaveEndpointTest_UnauthorizedRequest_2_SYREf1/http_credentials"
--http_heartbeat_interval="30secs" --initialize_driver_logging="true" --isolation="posix/cpu,posix/mem"
--launcher="posix" --launcher_dir="/mesos/build/src" --logbufsecs="0" --logging_level="INFO"
--max_completed_executors_per_framework="150" --oversubscribed_resources_interval="15secs"
--perf_duration="10secs" --perf_interval="1mins" --port="5051" --qos_correction_interval_min="0ns"
--quiet="false" --recover="reconnect" --recovery_timeout="15mins" --registration_backoff_factor="10ms"
--resources="cpus:2;gpus:0;mem:1024;disk:1024;ports:[31000-32000]" --revocable_cpu_low_priority="true"
--runtime_dir="/tmp/Endpoint_SlaveEndpointTest_UnauthorizedRequest_2_SYREf1" --sandbox_directory="/mnt/mesos/sandbox"
--strict="true" --switch_user="true" --systemd_enable_support="true" --systemd_runtime_directory="/run/systemd/system"
--version="false" --work_dir="/tmp/Endpoint_SlaveEndpointTest_UnauthorizedRequest_2_5ZQIrb"
I0629 11:05:49.140144 30648 credentials.hpp:86] Loading credential for authentication from
'/tmp/Endpoint_SlaveEndpointTest_UnauthorizedRequest_2_SYREf1/credential'
I0629 11:05:49.140381 30648 slave.cpp:282] Agent using credential for: test-principal
I0629 11:05:49.140406 30648 credentials.hpp:37] Loading credentials for authentication from
'/tmp/Endpoint_SlaveEndpointTest_UnauthorizedRequest_2_SYREf1/http_credentials'
I0629 11:05:49.141094 30648 http.cpp:974] Creating default 'basic' HTTP authenticator for
realm 'mesos-agent-readonly'
I0629 11:05:49.141305 30648 http.cpp:974] Creating default 'basic' HTTP authenticator for
realm 'mesos-agent-readwrite'
I0629 11:05:49.143762 30648 slave.cpp:553] Agent resources: [{"name":"cpus","scalar":{"value":2.0},"type":"SCALAR"},{"name":"mem","scalar":{"value":1024.0},"type":"SCALAR"},{"name":"disk","scalar":{"value":1024.0},"type":"SCALAR"},{"name":"ports","ranges":{"range":[{"begin":31000,"end":32000}]},"type":"RANGES"}]
I0629 11:05:49.144121 30648 slave.cpp:561] Agent attributes: [  ]
I0629 11:05:49.144136 30648 slave.cpp:566] Agent hostname: 3a58f1b6825b
I0629 11:05:49.144392 30649 status_update_manager.cpp:177] Pausing sending status updates
I0629 11:05:49.146381 30649 state.cpp:64] Recovering state from '/tmp/Endpoint_SlaveEndpointTest_UnauthorizedRequest_2_5ZQIrb/meta'
I0629 11:05:49.146996 30649 status_update_manager.cpp:203] Recovering status update manager
I0629 11:05:49.147263 30646 containerizer.cpp:582] Recovering containerizer
I0629 11:05:49.149715 30642 provisioner.cpp:416] Provisioner recovery complete
I0629 11:05:49.150430 30642 slave.cpp:6168] Finished recovery
I0629 11:05:49.151300 30642 slave.cpp:6350] Querying resource estimator for oversubscribable
resources
I0629 11:05:49.151798 30644 slave.cpp:6364] Received oversubscribable resources {} from the
resource estimator
I0629 11:05:49.155778 30645 process.cpp:3779] Handling HTTP event for process 'slave(770)'
with path: '/slave(770)/containers'
I0629 11:05:49.157609 30649 http.cpp:1114] HTTP GET for /slave(770)/containers from 172.17.0.2:34212
I0629 11:05:49.157721 30649 http.cpp:935] Authorizing principal 'test-principal' to GET the
'/containers' endpoint
I0629 11:05:49.161468 30641 slave.cpp:818] Agent terminating
[       OK ] Endpoint/SlaveEndpointTest.UnauthorizedRequest/2 (43 ms)
[ RUN      ] Endpoint/SlaveEndpointTest.NoAuthorizer/0
I0629 11:05:49.176856 30641 containerizer.cpp:230] Using isolation: posix/cpu,posix/mem,filesystem/posix,network/cni,environment_secret
W0629 11:05:49.177673 30641 backend.cpp:76] Failed to create 'overlay' backend: OverlayBackend
requires root privileges
W0629 11:05:49.177945 30641 backend.cpp:76] Failed to create 'bind' backend: BindBackend requires
root privileges
I0629 11:05:49.177987 30641 provisioner.cpp:255] Using default backend 'copy'
I0629 11:05:49.180420 30641 cluster.cpp:448] Creating default 'local' authorizer
I0629 11:05:49.182879 30649 slave.cpp:249] Mesos agent started on (771)@172.17.0.2:45281
I0629 11:05:49.182961 30649 slave.cpp:250] Flags at startup: --acls="" --appc_simple_discovery_uri_prefix="http://"
--appc_store_dir="/tmp/Endpoint_SlaveEndpointTest_NoAuthorizer_0_wdAmRm/store/appc" --authenticate_http_readonly="true"
--authenticate_http_readwrite="true" --authenticatee="crammd5" --authentication_backoff_factor="1secs"
--authorizer="local" --cgroups_cpu_enable_pids_and_tids_count="false" --cgroups_enable_cfs="false"
--cgroups_hierarchy="/sys/fs/cgroup" --cgroups_limit_swap="false" --cgroups_root="mesos" --container_disk_watch_interval="15secs"
--containerizers="mesos" --credential="/tmp/Endpoint_SlaveEndpointTest_NoAuthorizer_0_wdAmRm/credential"
--default_role="*" --disk_watch_interval="1mins" --docker="docker" --docker_kill_orphans="true"
--docker_registry="https://registry-1.docker.io" --docker_remove_delay="6hrs" --docker_socket="/var/run/docker.sock"
--docker_stop_timeout="0ns" --docker_store_dir="/tmp/Endpoint_SlaveEndpointTest_NoAuthorizer_0_wdAmRm/store/docker"
--docker_volume_checkpoint_dir="/var/run/mesos/isolators/docker/volume" --enforce_container_disk_quota="false"
--executor_registration_timeout="1mins" --executor_reregistration_timeout="2secs" --executor_shutdown_grace_period="5secs"
--fetcher_cache_dir="/tmp/Endpoint_SlaveEndpointTest_NoAuthorizer_0_wdAmRm/fetch" --fetcher_cache_size="2GB"
--frameworks_home="" --gc_delay="1weeks" --gc_disk_headroom="0.1" --hadoop_home="" --help="false"
--hostname_lookup="true" --http_command_executor="false" --http_credentials="/tmp/Endpoint_SlaveEndpointTest_NoAuthorizer_0_wdAmRm/http_credentials"
--http_heartbeat_interval="30secs" --initialize_driver_logging="true" --isolation="posix/cpu,posix/mem"
--launcher="posix" --launcher_dir="/mesos/build/src" --logbufsecs="0" --logging_level="INFO"
--max_completed_executors_per_framework="150" --oversubscribed_resources_interval="15secs"
--perf_duration="10secs" --perf_interval="1mins" --port="5051" --qos_correction_interval_min="0ns"
--quiet="false" --recover="reconnect" --recovery_timeout="15mins" --registration_backoff_factor="10ms"
--resources="cpus:2;gpus:0;mem:1024;disk:1024;ports:[31000-32000]" --revocable_cpu_low_priority="true"
--runtime_dir="/tmp/Endpoint_SlaveEndpointTest_NoAuthorizer_0_wdAmRm" --sandbox_directory="/mnt/mesos/sandbox"
--strict="true" --switch_user="true" --systemd_enable_support="true" --systemd_runtime_directory="/run/systemd/system"
--version="false" --work_dir="/tmp/Endpoint_SlaveEndpointTest_NoAuthorizer_0_hAZsWw"
I0629 11:05:49.184074 30649 credentials.hpp:86] Loading credential for authentication from
'/tmp/Endpoint_SlaveEndpointTest_NoAuthorizer_0_wdAmRm/credential'
I0629 11:05:49.184342 30649 slave.cpp:282] Agent using credential for: test-principal
I0629 11:05:49.184363 30649 credentials.hpp:37] Loading credentials for authentication from
'/tmp/Endpoint_SlaveEndpointTest_NoAuthorizer_0_wdAmRm/http_credentials'
I0629 11:05:49.184710 30649 http.cpp:974] Creating default 'basic' HTTP authenticator for
realm 'mesos-agent-readonly'
I0629 11:05:49.184929 30649 http.cpp:974] Creating default 'basic' HTTP authenticator for
realm 'mesos-agent-readwrite'
I0629 11:05:49.186977 30649 slave.cpp:553] Agent resources: [{"name":"cpus","scalar":{"value":2.0},"type":"SCALAR"},{"name":"mem","scalar":{"value":1024.0},"type":"SCALAR"},{"name":"disk","scalar":{"value":1024.0},"type":"SCALAR"},{"name":"ports","ranges":{"range":[{"begin":31000,"end":32000}]},"type":"RANGES"}]
I0629 11:05:49.187337 30649 slave.cpp:561] Agent attributes: [  ]
I0629 11:05:49.187353 30649 slave.cpp:566] Agent hostname: 3a58f1b6825b
I0629 11:05:49.187635 30645 status_update_manager.cpp:177] Pausing sending status updates
I0629 11:05:49.189527 30645 state.cpp:64] Recovering state from '/tmp/Endpoint_SlaveEndpointTest_NoAuthorizer_0_hAZsWw/meta'
I0629 11:05:49.190080 30647 status_update_manager.cpp:203] Recovering status update manager
I0629 11:05:49.190503 30647 containerizer.cpp:582] Recovering containerizer
I0629 11:05:49.193279 30647 provisioner.cpp:416] Provisioner recovery complete
I0629 11:05:49.194541 30646 slave.cpp:6168] Finished recovery
I0629 11:05:49.195349 30646 slave.cpp:6350] Querying resource estimator for oversubscribable
resources
I0629 11:05:49.195797 30645 slave.cpp:6364] Received oversubscribable resources {} from the
resource estimator
I0629 11:05:49.200103 30645 process.cpp:3779] Handling HTTP event for process 'slave(771)'
with path: '/slave(771)/monitor/statistics'
I0629 11:05:49.202226 30645 http.cpp:1114] HTTP GET for /slave(771)/monitor/statistics from
172.17.0.2:34214
I0629 11:05:49.202339 30645 http.cpp:935] Authorizing principal 'test-principal' to GET the
'/monitor/statistics' endpoint
I0629 11:05:49.207032 30643 slave.cpp:818] Agent terminating
[       OK ] Endpoint/SlaveEndpointTest.NoAuthorizer/0 (46 ms)
[ RUN      ] Endpoint/SlaveEndpointTest.NoAuthorizer/1
I0629 11:05:49.223127 30641 containerizer.cpp:230] Using isolation: posix/cpu,posix/mem,filesystem/posix,network/cni,environment_secret
W0629 11:05:49.223984 30641 backend.cpp:76] Failed to create 'overlay' backend: OverlayBackend
requires root privileges
W0629 11:05:49.224272 30641 backend.cpp:76] Failed to create 'bind' backend: BindBackend requires
root privileges
I0629 11:05:49.224369 30641 provisioner.cpp:255] Using default backend 'copy'
I0629 11:05:49.226832 30641 cluster.cpp:448] Creating default 'local' authorizer
I0629 11:05:49.230592 30647 slave.cpp:249] Mesos agent started on (772)@172.17.0.2:45281
I0629 11:05:49.230947 30647 slave.cpp:250] Flags at startup: --acls="" --appc_simple_discovery_uri_prefix="http://"
--appc_store_dir="/tmp/Endpoint_SlaveEndpointTest_NoAuthorizer_1_as8VWI/store/appc" --authenticate_http_readonly="true"
--authenticate_http_readwrite="true" --authenticatee="crammd5" --authentication_backoff_factor="1secs"
--authorizer="local" --cgroups_cpu_enable_pids_and_tids_count="false" --cgroups_enable_cfs="false"
--cgroups_hierarchy="/sys/fs/cgroup" --cgroups_limit_swap="false" --cgroups_root="mesos" --container_disk_watch_interval="15secs"
--containerizers="mesos" --credential="/tmp/Endpoint_SlaveEndpointTest_NoAuthorizer_1_as8VWI/credential"
--default_role="*" --disk_watch_interval="1mins" --docker="docker" --docker_kill_orphans="true"
--docker_registry="https://registry-1.docker.io" --docker_remove_delay="6hrs" --docker_socket="/var/run/docker.sock"
--docker_stop_timeout="0ns" --docker_store_dir="/tmp/Endpoint_SlaveEndpointTest_NoAuthorizer_1_as8VWI/store/docker"
--docker_volume_checkpoint_dir="/var/run/mesos/isolators/docker/volume" --enforce_container_disk_quota="false"
--executor_registration_timeout="1mins" --executor_reregistration_timeout="2secs" --executor_shutdown_grace_period="5secs"
--fetcher_cache_dir="/tmp/Endpoint_SlaveEndpointTest_NoAuthorizer_1_as8VWI/fetch" --fetcher_cache_size="2GB"
--frameworks_home="" --gc_delay="1weeks" --gc_disk_headroom="0.1" --hadoop_home="" --help="false"
--hostname_lookup="true" --http_command_executor="false" --http_credentials="/tmp/Endpoint_SlaveEndpointTest_NoAuthorizer_1_as8VWI/http_credentials"
--http_heartbeat_interval="30secs" --initialize_driver_logging="true" --isolation="posix/cpu,posix/mem"
--launcher="posix" --launcher_dir="/mesos/build/src" --logbufsecs="0" --logging_level="INFO"
--max_completed_executors_per_framework="150" --oversubscribed_resources_interval="15secs"
--perf_duration="10secs" --perf_interval="1mins" --port="5051" --qos_correction_interval_min="0ns"
--quiet="false" --recover="reconnect" --recovery_timeout="15mins" --registration_backoff_factor="10ms"
--resources="cpus:2;gpus:0;mem:1024;disk:1024;ports:[31000-32000]" --revocable_cpu_low_priority="true"
--runtime_dir="/tmp/Endpoint_SlaveEndpointTest_NoAuthorizer_1_as8VWI" --sandbox_directory="/mnt/mesos/sandbox"
--strict="true" --switch_user="true" --systemd_enable_support="true" --systemd_runtime_directory="/run/systemd/system"
--version="false" --work_dir="/tmp/Endpoint_SlaveEndpointTest_NoAuthorizer_1_HxitUS"
I0629 11:05:49.231925 30647 credentials.hpp:86] Loading credential for authentication from
'/tmp/Endpoint_SlaveEndpointTest_NoAuthorizer_1_as8VWI/credential'
I0629 11:05:49.232283 30647 slave.cpp:282] Agent using credential for: test-principal
I0629 11:05:49.232465 30647 credentials.hpp:37] Loading credentials for authentication from
'/tmp/Endpoint_SlaveEndpointTest_NoAuthorizer_1_as8VWI/http_credentials'
I0629 11:05:49.232908 30647 http.cpp:974] Creating default 'basic' HTTP authenticator for
realm 'mesos-agent-readonly'
I0629 11:05:49.233482 30647 http.cpp:974] Creating default 'basic' HTTP authenticator for
realm 'mesos-agent-readwrite'
I0629 11:05:49.235839 30647 slave.cpp:553] Agent resources: [{"name":"cpus","scalar":{"value":2.0},"type":"SCALAR"},{"name":"mem","scalar":{"value":1024.0},"type":"SCALAR"},{"name":"disk","scalar":{"value":1024.0},"type":"SCALAR"},{"name":"ports","ranges":{"range":[{"begin":31000,"end":32000}]},"type":"RANGES"}]
I0629 11:05:49.236213 30647 slave.cpp:561] Agent attributes: [  ]
I0629 11:05:49.236462 30647 slave.cpp:566] Agent hostname: 3a58f1b6825b
I0629 11:05:49.236830 30643 status_update_manager.cpp:177] Pausing sending status updates
I0629 11:05:49.239115 30642 state.cpp:64] Recovering state from '/tmp/Endpoint_SlaveEndpointTest_NoAuthorizer_1_HxitUS/meta'
I0629 11:05:49.239629 30642 status_update_manager.cpp:203] Recovering status update manager
I0629 11:05:49.239985 30644 containerizer.cpp:582] Recovering containerizer
I0629 11:05:49.242118 30646 provisioner.cpp:416] Provisioner recovery complete
I0629 11:05:49.242810 30642 slave.cpp:6168] Finished recovery
I0629 11:05:49.243376 30642 slave.cpp:6350] Querying resource estimator for oversubscribable
resources
I0629 11:05:49.244204 30642 slave.cpp:6364] Received oversubscribable resources {} from the
resource estimator
I0629 11:05:49.248266 30645 process.cpp:3779] Handling HTTP event for process 'slave(772)'
with path: '/slave(772)/monitor/statistics.json'
I0629 11:05:49.250494 30645 http.cpp:1114] HTTP GET for /slave(772)/monitor/statistics.json
from 172.17.0.2:34216
I0629 11:05:49.250604 30645 http.cpp:935] Authorizing principal 'test-principal' to GET the
'/monitor/statistics.json' endpoint
I0629 11:05:49.256439 30642 slave.cpp:818] Agent terminating
[       OK ] Endpoint/SlaveEndpointTest.NoAuthorizer/1 (47 ms)
[ RUN      ] Endpoint/SlaveEndpointTest.NoAuthorizer/2
I0629 11:05:49.271381 30641 containerizer.cpp:230] Using isolation: posix/cpu,posix/mem,filesystem/posix,network/cni,environment_secret
W0629 11:05:49.272174 30641 backend.cpp:76] Failed to create 'overlay' backend: OverlayBackend
requires root privileges
W0629 11:05:49.272351 30641 backend.cpp:76] Failed to create 'bind' backend: BindBackend requires
root privileges
I0629 11:05:49.272393 30641 provisioner.cpp:255] Using default backend 'copy'
I0629 11:05:49.274884 30641 cluster.cpp:448] Creating default 'local' authorizer
I0629 11:05:49.277842 30643 slave.cpp:249] Mesos agent started on (773)@172.17.0.2:45281
I0629 11:05:49.277907 30643 slave.cpp:250] Flags at startup: --acls="" --appc_simple_discovery_uri_prefix="http://"
--appc_store_dir="/tmp/Endpoint_SlaveEndpointTest_NoAuthorizer_2_oB0Kx5/store/appc" --authenticate_http_readonly="true"
--authenticate_http_readwrite="true" --authenticatee="crammd5" --authentication_backoff_factor="1secs"
--authorizer="local" --cgroups_cpu_enable_pids_and_tids_count="false" --cgroups_enable_cfs="false"
--cgroups_hierarchy="/sys/fs/cgroup" --cgroups_limit_swap="false" --cgroups_root="mesos" --container_disk_watch_interval="15secs"
--containerizers="mesos" --credential="/tmp/Endpoint_SlaveEndpointTest_NoAuthorizer_2_oB0Kx5/credential"
--default_role="*" --disk_watch_interval="1mins" --docker="docker" --docker_kill_orphans="true"
--docker_registry="https://registry-1.docker.io" --docker_remove_delay="6hrs" --docker_socket="/var/run/docker.sock"
--docker_stop_timeout="0ns" --docker_store_dir="/tmp/Endpoint_SlaveEndpointTest_NoAuthorizer_2_oB0Kx5/store/docker"
--docker_volume_checkpoint_dir="/var/run/mesos/isolators/docker/volume" --enforce_container_disk_quota="false"
--executor_registration_timeout="1mins" --executor_reregistration_timeout="2secs" --executor_shutdown_grace_period="5secs"
--fetcher_cache_dir="/tmp/Endpoint_SlaveEndpointTest_NoAuthorizer_2_oB0Kx5/fetch" --fetcher_cache_size="2GB"
--frameworks_home="" --gc_delay="1weeks" --gc_disk_headroom="0.1" --hadoop_home="" --help="false"
--hostname_lookup="true" --http_command_executor="false" --http_credentials="/tmp/Endpoint_SlaveEndpointTest_NoAuthorizer_2_oB0Kx5/http_credentials"
--http_heartbeat_interval="30secs" --initialize_driver_logging="true" --isolation="posix/cpu,posix/mem"
--launcher="posix" --launcher_dir="/mesos/build/src" --logbufsecs="0" --logging_level="INFO"
--max_completed_executors_per_framework="150" --oversubscribed_resources_interval="15secs"
--perf_duration="10secs" --perf_interval="1mins" --port="5051" --qos_correction_interval_min="0ns"
--quiet="false" --recover="reconnect" --recovery_timeout="15mins" --registration_backoff_factor="10ms"
--resources="cpus:2;gpus:0;mem:1024;disk:1024;ports:[31000-32000]" --revocable_cpu_low_priority="true"
--runtime_dir="/tmp/Endpoint_SlaveEndpointTest_NoAuthorizer_2_oB0Kx5" --sandbox_directory="/mnt/mesos/sandbox"
--strict="true" --switch_user="true" --systemd_enable_support="true" --systemd_runtime_directory="/run/systemd/system"
--version="false" --work_dir="/tmp/Endpoint_SlaveEndpointTest_NoAuthorizer_2_dWptnf"
I0629 11:05:49.278785 30643 credentials.hpp:86] Loading credential for authentication from
'/tmp/Endpoint_SlaveEndpointTest_NoAuthorizer_2_oB0Kx5/credential'
I0629 11:05:49.279208 30643 slave.cpp:282] Agent using credential for: test-principal
I0629 11:05:49.279274 30643 credentials.hpp:37] Loading credentials for authentication from
'/tmp/Endpoint_SlaveEndpointTest_NoAuthorizer_2_oB0Kx5/http_credentials'
I0629 11:05:49.279747 30643 http.cpp:974] Creating default 'basic' HTTP authenticator for
realm 'mesos-agent-readonly'
I0629 11:05:49.280098 30643 http.cpp:974] Creating default 'basic' HTTP authenticator for
realm 'mesos-agent-readwrite'
I0629 11:05:49.282528 30643 slave.cpp:553] Agent resources: [{"name":"cpus","scalar":{"value":2.0},"type":"SCALAR"},{"name":"mem","scalar":{"value":1024.0},"type":"SCALAR"},{"name":"disk","scalar":{"value":1024.0},"type":"SCALAR"},{"name":"ports","ranges":{"range":[{"begin":31000,"end":32000}]},"type":"RANGES"}]
I0629 11:05:49.282856 30643 slave.cpp:561] Agent attributes: [  ]
I0629 11:05:49.282948 30643 slave.cpp:566] Agent hostname: 3a58f1b6825b
I0629 11:05:49.283419 30648 status_update_manager.cpp:177] Pausing sending status updates
I0629 11:05:49.285650 30643 state.cpp:64] Recovering state from '/tmp/Endpoint_SlaveEndpointTest_NoAuthorizer_2_dWptnf/meta'
I0629 11:05:49.286267 30644 status_update_manager.cpp:203] Recovering status update manager
I0629 11:05:49.286636 30644 containerizer.cpp:582] Recovering containerizer
I0629 11:05:49.289188 30644 provisioner.cpp:416] Provisioner recovery complete
I0629 11:05:49.290279 30644 slave.cpp:6168] Finished recovery
I0629 11:05:49.291715 30644 slave.cpp:6350] Querying resource estimator for oversubscribable
resources
I0629 11:05:49.292403 30643 slave.cpp:6364] Received oversubscribable resources {} from the
resource estimator
I0629 11:05:49.296492 30644 process.cpp:3779] Handling HTTP event for process 'slave(773)'
with path: '/slave(773)/containers'
I0629 11:05:49.298912 30645 http.cpp:1114] HTTP GET for /slave(773)/containers from 172.17.0.2:34218
I0629 11:05:49.299032 30645 http.cpp:935] Authorizing principal 'test-principal' to GET the
'/containers' endpoint
I0629 11:05:49.303815 30647 slave.cpp:818] Agent terminating
[       OK ] Endpoint/SlaveEndpointTest.NoAuthorizer/2 (47 ms)
[----------] 9 tests from Endpoint/SlaveEndpointTest (444 ms total)

[----------] Global test environment tear-down
[==========] 1571 tests from 171 test cases ran. (403418 ms total)
[  PASSED  ] 1570 tests.
[  FAILED  ] 1 test, listed below:
[  FAILED  ] ContentType/SchedulerTest.MasterFailover/1, where GetParam() = application/json

 1 FAILED TEST
  YOU HAVE 20 DISABLED TESTS

I0629 11:05:49.444849 30650 process.cpp:968] Failed to accept socket: future discarded
make[3]: Leaving directory `/mesos/build'
make[3]: *** [CMakeFiles/check] Error 1
make[2]: Leaving directory `/mesos/build'
make[2]: *** [CMakeFiles/check.dir/all] Error 2
make[1]: Leaving directory `/mesos/build'
make[1]: *** [CMakeFiles/check.dir/rule] Error 2
make: *** [check] Error 2
+ docker rmi mesos-1498730495-24641
Untagged: mesos-1498730495-24641:latest
Deleted: sha256:0dbfa50e3e6a106ead5647c1d9e4e372a4da9ea6a129bcdd692fcad6d4d8aecc
Deleted: sha256:920b24165464d2f6da63fca9e53f6a8a78139cc5aa5b962ae9ba1e15e1949bd6
Deleted: sha256:4edd42a968c4c1818820fb684c59dbd969803f22487fbe2b56ab7e1ed0699b4d
Deleted: sha256:cde7e81e79c76cd7fd8ba63859ff832146aa71a0f46049306978bc0f02ee1e48
Deleted: sha256:6df0ac914e49c307ea7d172c13f4b96409842ce909cc383b79725206d239966c
Deleted: sha256:297955aa564b3b76abbc9350a5bfc603c883e3bbb16fa3685c7cbb486555e2a6
Deleted: sha256:47b761cb74ab44704773a8334ca56f8cf4db6541294701439eeb85c6a4f23c1f
Deleted: sha256:a2025a95784700e80aa91dfdc317777f78c781a445a618eea19a9b30f695a9bc
Deleted: sha256:b22f3681671607b31cb06176137cc72ea33dbf1483099a1be093635f4967a5f4
Deleted: sha256:86fe13df7c1918f1c805cafd8e5b4d85a8c1e812de7025fe6a5f1d5a5ec8088c
Deleted: sha256:102680507214bd491265c4c5f8fe5f5a5791d0805819af7cce6c842a88a755b1
Deleted: sha256:2bee921ffc57141b0d671b8889b602c65384398fb50c99283fc0dd268a68b547
Deleted: sha256:07dc31dd738c167ac6bd38292cb2e6507a8e8bfc8f8e8a3f391861fef2d208ca
Deleted: sha256:86e12dc9ff5e839f137b75d4acddf59f671de9d16a8462a5a6b6d30ae007874f
Deleted: sha256:7ff5e4befc6df50f04e63a84cc21f4728d5311942c379d3daf2d1005ad46fd53
Deleted: sha256:1cd58d5baf86f26b2a19e3347c8c52ae46265389c3f1b41adea43554a4e170ed
Deleted: sha256:8f26c56b49246b12e813349080d642872b18333d07ec4e8cdd23421912ecd3fa
Deleted: sha256:36d30dedd9d5e88e0b47387b3275993b3ce5891baa683dcf13ccc195d2451d76
Deleted: sha256:e3b9d5014938f09317bb1a12f64969621438a9a6edc33d14f0e7a5fe5300251c
Deleted: sha256:bbf36c199fb3ee7640381c1a1358b488cead823791aef42bc1234314ca16745d
Deleted: sha256:1290f0fb85d92708540cdaad1d668c18f73a0d7f040646c5fb996aadea369e7e
Deleted: sha256:9c8c2a62ad5c0432ad1f9fe3a208106c5e3695cb263341284886fd864168f0c8
Deleted: sha256:a8f82deea25506d7d90ff2ad4589e00c6c2fbbc9b1493ce89c0786029cdc2ce7
Deleted: sha256:2a5bb3ddb411e11d1f62c1bab7c3098cfe6a03d0a165994a4da03fd3247cf9c4
Build step 'Execute shell' marked build as failure

Mime
View raw message