mesos-builds mailing list archives

Site index · List index
Message view « Date » · « Thread »
Top « Date » · « Thread »
From Apache Jenkins Server <jenk...@builds.apache.org>
Subject Build failed in Jenkins: Mesos-Reviewbot #18337
Date Sun, 11 Jun 2017 00:27:27 GMT
See <https://builds.apache.org/job/Mesos-Reviewbot/18337/display/redirect>

------------------------------------------
[...truncated 28.22 MB...]
I0611 00:27:20.265588  4586 containerizer.cpp:230] Using isolation: posix/cpu,posix/mem,filesystem/posix,network/cni,environment_secret
W0611 00:27:20.266371  4586 backend.cpp:76] Failed to create 'overlay' backend: OverlayBackend
requires root privileges
W0611 00:27:20.266552  4586 backend.cpp:76] Failed to create 'bind' backend: BindBackend requires
root privileges
I0611 00:27:20.266598  4586 provisioner.cpp:255] Using default backend 'copy'
I0611 00:27:20.271412  4612 slave.cpp:248] Mesos agent started on (756)@172.17.0.2:36165
I0611 00:27:20.271455  4612 slave.cpp:249] Flags at startup: --acls="" --appc_simple_discovery_uri_prefix="http://"
--appc_store_dir="/tmp/Endpoint_SlaveEndpointTest_AuthorizedRequest_2_1KO7ws/store/appc" --authenticate_http_readonly="true"
--authenticate_http_readwrite="true" --authenticatee="crammd5" --authentication_backoff_factor="1secs"
--authorizer="local" --cgroups_cpu_enable_pids_and_tids_count="false" --cgroups_enable_cfs="false"
--cgroups_hierarchy="/sys/fs/cgroup" --cgroups_limit_swap="false" --cgroups_root="mesos" --container_disk_watch_interval="15secs"
--containerizers="mesos" --credential="/tmp/Endpoint_SlaveEndpointTest_AuthorizedRequest_2_1KO7ws/credential"
--default_role="*" --disk_watch_interval="1mins" --docker="docker" --docker_kill_orphans="true"
--docker_registry="https://registry-1.docker.io" --docker_remove_delay="6hrs" --docker_socket="/var/run/docker.sock"
--docker_stop_timeout="0ns" --docker_store_dir="/tmp/Endpoint_SlaveEndpointTest_AuthorizedRequest_2_1KO7ws/store/docker"
--docker_volume_checkpoint_dir="/var/run/mesos/isolators/docker/volume" --enforce_container_disk_quota="false"
--executor_registration_timeout="1mins" --executor_reregistration_timeout="2secs" --executor_shutdown_grace_period="5secs"
--fetcher_cache_dir="/tmp/Endpoint_SlaveEndpointTest_AuthorizedRequest_2_1KO7ws/fetch" --fetcher_cache_size="2GB"
--frameworks_home="" --gc_delay="1weeks" --gc_disk_headroom="0.1" --hadoop_home="" --help="false"
--hostname_lookup="true" --http_command_executor="false" --http_credentials="/tmp/Endpoint_SlaveEndpointTest_AuthorizedRequest_2_1KO7ws/http_credentials"
--http_heartbeat_interval="30secs" --initialize_driver_logging="true" --isolation="posix/cpu,posix/mem"
--launcher="posix" --launcher_dir="/mesos/mesos-1.4.0/_build/src" --logbufsecs="0" --logging_level="INFO"
--max_completed_executors_per_framework="150" --oversubscribed_resources_interval="15secs"
--perf_duration="10secs" --perf_interval="1mins" --port="5051" --qos_correction_interval_min="0ns"
--quiet="false" --recover="reconnect" --recovery_timeout="15mins" --registration_backoff_factor="10ms"
--resources="cpus:2;gpus:0;mem:1024;disk:1024;ports:[31000-32000]" --revocable_cpu_low_priority="true"
--runtime_dir="/tmp/Endpoint_SlaveEndpointTest_AuthorizedRequest_2_1KO7ws" --sandbox_directory="/mnt/mesos/sandbox"
--strict="true" --switch_user="true" --systemd_enable_support="true" --systemd_runtime_directory="/run/systemd/system"
--version="false" --work_dir="/tmp/Endpoint_SlaveEndpointTest_AuthorizedRequest_2_pKT1r1"
I0611 00:27:20.272331  4612 credentials.hpp:86] Loading credential for authentication from
'/tmp/Endpoint_SlaveEndpointTest_AuthorizedRequest_2_1KO7ws/credential'
I0611 00:27:20.272686  4612 slave.cpp:281] Agent using credential for: test-principal
I0611 00:27:20.272723  4612 credentials.hpp:37] Loading credentials for authentication from
'/tmp/Endpoint_SlaveEndpointTest_AuthorizedRequest_2_1KO7ws/http_credentials'
I0611 00:27:20.273363  4612 http.cpp:975] Creating default 'basic' HTTP authenticator for
realm 'mesos-agent-readonly'
I0611 00:27:20.273710  4612 http.cpp:975] Creating default 'basic' HTTP authenticator for
realm 'mesos-agent-readwrite'
I0611 00:27:20.275894  4612 slave.cpp:552] Agent resources: cpus(*):2; mem(*):1024; disk(*):1024;
ports(*):[31000-32000]
I0611 00:27:20.276165  4612 slave.cpp:560] Agent attributes: [  ]
I0611 00:27:20.276190  4612 slave.cpp:565] Agent hostname: 51342386fd69
I0611 00:27:20.276527  4610 status_update_manager.cpp:177] Pausing sending status updates
I0611 00:27:20.278594  4609 state.cpp:62] Recovering state from '/tmp/Endpoint_SlaveEndpointTest_AuthorizedRequest_2_pKT1r1/meta'
I0611 00:27:20.279229  4607 status_update_manager.cpp:203] Recovering status update manager
I0611 00:27:20.279530  4607 containerizer.cpp:582] Recovering containerizer
I0611 00:27:20.281689  4612 provisioner.cpp:416] Provisioner recovery complete
I0611 00:27:20.282452  4611 slave.cpp:6127] Finished recovery
I0611 00:27:20.283174  4611 slave.cpp:6309] Querying resource estimator for oversubscribable
resources
I0611 00:27:20.283619  4606 slave.cpp:6323] Received oversubscribable resources {} from the
resource estimator
I0611 00:27:20.287595  4611 process.cpp:3778] Handling HTTP event for process 'slave(756)'
with path: '/slave(756)/containers'
I0611 00:27:20.289649  4608 http.cpp:1115] HTTP GET for /slave(756)/containers from 172.17.0.2:55272
I0611 00:27:20.289841  4608 http.cpp:936] Authorizing principal 'test-principal' to GET the
'/containers' endpoint
I0611 00:27:20.295053  4612 slave.cpp:817] Agent terminating
[       OK ] Endpoint/SlaveEndpointTest.AuthorizedRequest/2 (44 ms)
[ RUN      ] Endpoint/SlaveEndpointTest.UnauthorizedRequest/0
I0611 00:27:20.310384  4586 containerizer.cpp:230] Using isolation: posix/cpu,posix/mem,filesystem/posix,network/cni,environment_secret
W0611 00:27:20.311175  4586 backend.cpp:76] Failed to create 'overlay' backend: OverlayBackend
requires root privileges
W0611 00:27:20.311352  4586 backend.cpp:76] Failed to create 'bind' backend: BindBackend requires
root privileges
I0611 00:27:20.311398  4586 provisioner.cpp:255] Using default backend 'copy'
I0611 00:27:20.317214  4612 slave.cpp:248] Mesos agent started on (757)@172.17.0.2:36165
I0611 00:27:20.317255  4612 slave.cpp:249] Flags at startup: --acls="" --appc_simple_discovery_uri_prefix="http://"
--appc_store_dir="/tmp/Endpoint_SlaveEndpointTest_UnauthorizedRequest_0_hnW6fd/store/appc"
--authenticate_http_readonly="true" --authenticate_http_readwrite="true" --authenticatee="crammd5"
--authentication_backoff_factor="1secs" --authorizer="local" --cgroups_cpu_enable_pids_and_tids_count="false"
--cgroups_enable_cfs="false" --cgroups_hierarchy="/sys/fs/cgroup" --cgroups_limit_swap="false"
--cgroups_root="mesos" --container_disk_watch_interval="15secs" --containerizers="mesos" --credential="/tmp/Endpoint_SlaveEndpointTest_UnauthorizedRequest_0_hnW6fd/credential"
--default_role="*" --disk_watch_interval="1mins" --docker="docker" --docker_kill_orphans="true"
--docker_registry="https://registry-1.docker.io" --docker_remove_delay="6hrs" --docker_socket="/var/run/docker.sock"
--docker_stop_timeout="0ns" --docker_store_dir="/tmp/Endpoint_SlaveEndpointTest_UnauthorizedRequest_0_hnW6fd/store/docker"
--docker_volume_checkpoint_dir="/var/run/mesos/isolators/docker/volume" --enforce_container_disk_quota="false"
--executor_registration_timeout="1mins" --executor_reregistration_timeout="2secs" --executor_shutdown_grace_period="5secs"
--fetcher_cache_dir="/tmp/Endpoint_SlaveEndpointTest_UnauthorizedRequest_0_hnW6fd/fetch" --fetcher_cache_size="2GB"
--frameworks_home="" --gc_delay="1weeks" --gc_disk_headroom="0.1" --hadoop_home="" --help="false"
--hostname_lookup="true" --http_command_executor="false" --http_credentials="/tmp/Endpoint_SlaveEndpointTest_UnauthorizedRequest_0_hnW6fd/http_credentials"
--http_heartbeat_interval="30secs" --initialize_driver_logging="true" --isolation="posix/cpu,posix/mem"
--launcher="posix" --launcher_dir="/mesos/mesos-1.4.0/_build/src" --logbufsecs="0" --logging_level="INFO"
--max_completed_executors_per_framework="150" --oversubscribed_resources_interval="15secs"
--perf_duration="10secs" --perf_interval="1mins" --port="5051" --qos_correction_interval_min="0ns"
--quiet="false" --recover="reconnect" --recovery_timeout="15mins" --registration_backoff_factor="10ms"
--resources="cpus:2;gpus:0;mem:1024;disk:1024;ports:[31000-32000]" --revocable_cpu_low_priority="true"
--runtime_dir="/tmp/Endpoint_SlaveEndpointTest_UnauthorizedRequest_0_hnW6fd" --sandbox_directory="/mnt/mesos/sandbox"
--strict="true" --switch_user="true" --systemd_enable_support="true" --systemd_runtime_directory="/run/systemd/system"
--version="false" --work_dir="/tmp/Endpoint_SlaveEndpointTest_UnauthorizedRequest_0_DziN3L"
I0611 00:27:20.318109  4612 credentials.hpp:86] Loading credential for authentication from
'/tmp/Endpoint_SlaveEndpointTest_UnauthorizedRequest_0_hnW6fd/credential'
I0611 00:27:20.318441  4612 slave.cpp:281] Agent using credential for: test-principal
I0611 00:27:20.318506  4612 credentials.hpp:37] Loading credentials for authentication from
'/tmp/Endpoint_SlaveEndpointTest_UnauthorizedRequest_0_hnW6fd/http_credentials'
I0611 00:27:20.319003  4612 http.cpp:975] Creating default 'basic' HTTP authenticator for
realm 'mesos-agent-readonly'
I0611 00:27:20.319344  4612 http.cpp:975] Creating default 'basic' HTTP authenticator for
realm 'mesos-agent-readwrite'
I0611 00:27:20.321498  4612 slave.cpp:552] Agent resources: cpus(*):2; mem(*):1024; disk(*):1024;
ports(*):[31000-32000]
I0611 00:27:20.321640  4612 slave.cpp:560] Agent attributes: [  ]
I0611 00:27:20.321722  4612 slave.cpp:565] Agent hostname: 51342386fd69
I0611 00:27:20.322171  4608 status_update_manager.cpp:177] Pausing sending status updates
I0611 00:27:20.324012  4611 state.cpp:62] Recovering state from '/tmp/Endpoint_SlaveEndpointTest_UnauthorizedRequest_0_DziN3L/meta'
I0611 00:27:20.324594  4612 status_update_manager.cpp:203] Recovering status update manager
I0611 00:27:20.324998  4609 containerizer.cpp:582] Recovering containerizer
I0611 00:27:20.327083  4611 provisioner.cpp:416] Provisioner recovery complete
I0611 00:27:20.327601  4608 slave.cpp:6127] Finished recovery
I0611 00:27:20.328431  4608 slave.cpp:6309] Querying resource estimator for oversubscribable
resources
I0611 00:27:20.328845  4608 slave.cpp:6323] Received oversubscribable resources {} from the
resource estimator
I0611 00:27:20.332852  4607 process.cpp:3778] Handling HTTP event for process 'slave(757)'
with path: '/slave(757)/monitor/statistics'
I0611 00:27:20.335196  4608 http.cpp:1115] HTTP GET for /slave(757)/monitor/statistics from
172.17.0.2:55274
I0611 00:27:20.335396  4608 http.cpp:936] Authorizing principal 'test-principal' to GET the
'/monitor/statistics' endpoint
I0611 00:27:20.339572  4606 slave.cpp:817] Agent terminating
[       OK ] Endpoint/SlaveEndpointTest.UnauthorizedRequest/0 (44 ms)
[ RUN      ] Endpoint/SlaveEndpointTest.UnauthorizedRequest/1
I0611 00:27:20.354840  4586 containerizer.cpp:230] Using isolation: posix/cpu,posix/mem,filesystem/posix,network/cni,environment_secret
W0611 00:27:20.355638  4586 backend.cpp:76] Failed to create 'overlay' backend: OverlayBackend
requires root privileges
W0611 00:27:20.355818  4586 backend.cpp:76] Failed to create 'bind' backend: BindBackend requires
root privileges
I0611 00:27:20.355861  4586 provisioner.cpp:255] Using default backend 'copy'
I0611 00:27:20.361032  4608 slave.cpp:248] Mesos agent started on (758)@172.17.0.2:36165
I0611 00:27:20.361074  4608 slave.cpp:249] Flags at startup: --acls="" --appc_simple_discovery_uri_prefix="http://"
--appc_store_dir="/tmp/Endpoint_SlaveEndpointTest_UnauthorizedRequest_1_x50YrY/store/appc"
--authenticate_http_readonly="true" --authenticate_http_readwrite="true" --authenticatee="crammd5"
--authentication_backoff_factor="1secs" --authorizer="local" --cgroups_cpu_enable_pids_and_tids_count="false"
--cgroups_enable_cfs="false" --cgroups_hierarchy="/sys/fs/cgroup" --cgroups_limit_swap="false"
--cgroups_root="mesos" --container_disk_watch_interval="15secs" --containerizers="mesos" --credential="/tmp/Endpoint_SlaveEndpointTest_UnauthorizedRequest_1_x50YrY/credential"
--default_role="*" --disk_watch_interval="1mins" --docker="docker" --docker_kill_orphans="true"
--docker_registry="https://registry-1.docker.io" --docker_remove_delay="6hrs" --docker_socket="/var/run/docker.sock"
--docker_stop_timeout="0ns" --docker_store_dir="/tmp/Endpoint_SlaveEndpointTest_UnauthorizedRequest_1_x50YrY/store/docker"
--docker_volume_checkpoint_dir="/var/run/mesos/isolators/docker/volume" --enforce_container_disk_quota="false"
--executor_registration_timeout="1mins" --executor_reregistration_timeout="2secs" --executor_shutdown_grace_period="5secs"
--fetcher_cache_dir="/tmp/Endpoint_SlaveEndpointTest_UnauthorizedRequest_1_x50YrY/fetch" --fetcher_cache_size="2GB"
--frameworks_home="" --gc_delay="1weeks" --gc_disk_headroom="0.1" --hadoop_home="" --help="false"
--hostname_lookup="true" --http_command_executor="false" --http_credentials="/tmp/Endpoint_SlaveEndpointTest_UnauthorizedRequest_1_x50YrY/http_credentials"
--http_heartbeat_interval="30secs" --initialize_driver_logging="true" --isolation="posix/cpu,posix/mem"
--launcher="posix" --launcher_dir="/mesos/mesos-1.4.0/_build/src" --logbufsecs="0" --logging_level="INFO"
--max_completed_executors_per_framework="150" --oversubscribed_resources_interval="15secs"
--perf_duration="10secs" --perf_interval="1mins" --port="5051" --qos_correction_interval_min="0ns"
--quiet="false" --recover="reconnect" --recovery_timeout="15mins" --registration_backoff_factor="10ms"
--resources="cpus:2;gpus:0;mem:1024;disk:1024;ports:[31000-32000]" --revocable_cpu_low_priority="true"
--runtime_dir="/tmp/Endpoint_SlaveEndpointTest_UnauthorizedRequest_1_x50YrY" --sandbox_directory="/mnt/mesos/sandbox"
--strict="true" --switch_user="true" --systemd_enable_support="true" --systemd_runtime_directory="/run/systemd/system"
--version="false" --work_dir="/tmp/Endpoint_SlaveEndpointTest_UnauthorizedRequest_1_F2Kt8w"
I0611 00:27:20.362040  4608 credentials.hpp:86] Loading credential for authentication from
'/tmp/Endpoint_SlaveEndpointTest_UnauthorizedRequest_1_x50YrY/credential'
I0611 00:27:20.362612  4608 slave.cpp:281] Agent using credential for: test-principal
I0611 00:27:20.362648  4608 credentials.hpp:37] Loading credentials for authentication from
'/tmp/Endpoint_SlaveEndpointTest_UnauthorizedRequest_1_x50YrY/http_credentials'
I0611 00:27:20.363240  4608 http.cpp:975] Creating default 'basic' HTTP authenticator for
realm 'mesos-agent-readonly'
I0611 00:27:20.363644  4608 http.cpp:975] Creating default 'basic' HTTP authenticator for
realm 'mesos-agent-readwrite'
I0611 00:27:20.366241  4608 slave.cpp:552] Agent resources: cpus(*):2; mem(*):1024; disk(*):1024;
ports(*):[31000-32000]
I0611 00:27:20.366386  4608 slave.cpp:560] Agent attributes: [  ]
I0611 00:27:20.366407  4608 slave.cpp:565] Agent hostname: 51342386fd69
I0611 00:27:20.366956  4605 status_update_manager.cpp:177] Pausing sending status updates
I0611 00:27:20.368902  4607 state.cpp:62] Recovering state from '/tmp/Endpoint_SlaveEndpointTest_UnauthorizedRequest_1_F2Kt8w/meta'
I0611 00:27:20.369376  4608 status_update_manager.cpp:203] Recovering status update manager
I0611 00:27:20.369747  4612 containerizer.cpp:582] Recovering containerizer
I0611 00:27:20.371959  4608 provisioner.cpp:416] Provisioner recovery complete
I0611 00:27:20.372557  4611 slave.cpp:6127] Finished recovery
I0611 00:27:20.373271  4611 slave.cpp:6309] Querying resource estimator for oversubscribable
resources
I0611 00:27:20.373965  4608 slave.cpp:6323] Received oversubscribable resources {} from the
resource estimator
I0611 00:27:20.377873  4612 process.cpp:3778] Handling HTTP event for process 'slave(758)'
with path: '/slave(758)/monitor/statistics.json'
I0611 00:27:20.379827  4607 http.cpp:1115] HTTP GET for /slave(758)/monitor/statistics.json
from 172.17.0.2:55276
I0611 00:27:20.379945  4607 http.cpp:936] Authorizing principal 'test-principal' to GET the
'/monitor/statistics.json' endpoint
I0611 00:27:20.384522  4608 slave.cpp:817] Agent terminating
[       OK ] Endpoint/SlaveEndpointTest.UnauthorizedRequest/1 (44 ms)
[ RUN      ] Endpoint/SlaveEndpointTest.UnauthorizedRequest/2
I0611 00:27:20.400105  4586 containerizer.cpp:230] Using isolation: posix/cpu,posix/mem,filesystem/posix,network/cni,environment_secret
W0611 00:27:20.400910  4586 backend.cpp:76] Failed to create 'overlay' backend: OverlayBackend
requires root privileges
W0611 00:27:20.401091  4586 backend.cpp:76] Failed to create 'bind' backend: BindBackend requires
root privileges
I0611 00:27:20.401139  4586 provisioner.cpp:255] Using default backend 'copy'
I0611 00:27:20.407289  4611 slave.cpp:248] Mesos agent started on (759)@172.17.0.2:36165
I0611 00:27:20.407332  4611 slave.cpp:249] Flags at startup: --acls="" --appc_simple_discovery_uri_prefix="http://"
--appc_store_dir="/tmp/Endpoint_SlaveEndpointTest_UnauthorizedRequest_2_3nY76J/store/appc"
--authenticate_http_readonly="true" --authenticate_http_readwrite="true" --authenticatee="crammd5"
--authentication_backoff_factor="1secs" --authorizer="local" --cgroups_cpu_enable_pids_and_tids_count="false"
--cgroups_enable_cfs="false" --cgroups_hierarchy="/sys/fs/cgroup" --cgroups_limit_swap="false"
--cgroups_root="mesos" --container_disk_watch_interval="15secs" --containerizers="mesos" --credential="/tmp/Endpoint_SlaveEndpointTest_UnauthorizedRequest_2_3nY76J/credential"
--default_role="*" --disk_watch_interval="1mins" --docker="docker" --docker_kill_orphans="true"
--docker_registry="https://registry-1.docker.io" --docker_remove_delay="6hrs" --docker_socket="/var/run/docker.sock"
--docker_stop_timeout="0ns" --docker_store_dir="/tmp/Endpoint_SlaveEndpointTest_UnauthorizedRequest_2_3nY76J/store/docker"
--docker_volume_checkpoint_dir="/var/run/mesos/isolators/docker/volume" --enforce_container_disk_quota="false"
--executor_registration_timeout="1mins" --executor_reregistration_timeout="2secs" --executor_shutdown_grace_period="5secs"
--fetcher_cache_dir="/tmp/Endpoint_SlaveEndpointTest_UnauthorizedRequest_2_3nY76J/fetch" --fetcher_cache_size="2GB"
--frameworks_home="" --gc_delay="1weeks" --gc_disk_headroom="0.1" --hadoop_home="" --help="false"
--hostname_lookup="true" --http_command_executor="false" --http_credentials="/tmp/Endpoint_SlaveEndpointTest_UnauthorizedRequest_2_3nY76J/http_credentials"
--http_heartbeat_interval="30secs" --initialize_driver_logging="true" --isolation="posix/cpu,posix/mem"
--launcher="posix" --launcher_dir="/mesos/mesos-1.4.0/_build/src" --logbufsecs="0" --logging_level="INFO"
--max_completed_executors_per_framework="150" --oversubscribed_resources_interval="15secs"
--perf_duration="10secs" --perf_interval="1mins" --port="5051" --qos_correction_interval_min="0ns"
--quiet="false" --recover="reconnect" --recovery_timeout="15mins" --registration_backoff_factor="10ms"
--resources="cpus:2;gpus:0;mem:1024;disk:1024;ports:[31000-32000]" --revocable_cpu_low_priority="true"
--runtime_dir="/tmp/Endpoint_SlaveEndpointTest_UnauthorizedRequest_2_3nY76J" --sandbox_directory="/mnt/mesos/sandbox"
--strict="true" --switch_user="true" --systemd_enable_support="true" --systemd_runtime_directory="/run/systemd/system"
--version="false" --work_dir="/tmp/Endpoint_SlaveEndpointTest_UnauthorizedRequest_2_RWqiGi"
I0611 00:27:20.408396  4611 credentials.hpp:86] Loading credential for authentication from
'/tmp/Endpoint_SlaveEndpointTest_UnauthorizedRequest_2_3nY76J/credential'
I0611 00:27:20.408782  4611 slave.cpp:281] Agent using credential for: test-principal
I0611 00:27:20.408812  4611 credentials.hpp:37] Loading credentials for authentication from
'/tmp/Endpoint_SlaveEndpointTest_UnauthorizedRequest_2_3nY76J/http_credentials'
I0611 00:27:20.409240  4611 http.cpp:975] Creating default 'basic' HTTP authenticator for
realm 'mesos-agent-readonly'
I0611 00:27:20.409538  4611 http.cpp:975] Creating default 'basic' HTTP authenticator for
realm 'mesos-agent-readwrite'
I0611 00:27:20.411617  4611 slave.cpp:552] Agent resources: cpus(*):2; mem(*):1024; disk(*):1024;
ports(*):[31000-32000]
I0611 00:27:20.411757  4611 slave.cpp:560] Agent attributes: [  ]
I0611 00:27:20.411778  4611 slave.cpp:565] Agent hostname: 51342386fd69
I0611 00:27:20.412124  4607 status_update_manager.cpp:177] Pausing sending status updates
I0611 00:27:20.414284  4609 state.cpp:62] Recovering state from '/tmp/Endpoint_SlaveEndpointTest_UnauthorizedRequest_2_RWqiGi/meta'
I0611 00:27:20.414896  4609 status_update_manager.cpp:203] Recovering status update manager
I0611 00:27:20.415290  4606 containerizer.cpp:582] Recovering containerizer
I0611 00:27:20.417346  4608 provisioner.cpp:416] Provisioner recovery complete
I0611 00:27:20.418085  4606 slave.cpp:6127] Finished recovery
I0611 00:27:20.418802  4606 slave.cpp:6309] Querying resource estimator for oversubscribable
resources
I0611 00:27:20.419247  4608 slave.cpp:6323] Received oversubscribable resources {} from the
resource estimator
I0611 00:27:20.423251  4606 process.cpp:3778] Handling HTTP event for process 'slave(759)'
with path: '/slave(759)/containers'
I0611 00:27:20.425719  4606 http.cpp:1115] HTTP GET for /slave(759)/containers from 172.17.0.2:55278
I0611 00:27:20.425844  4606 http.cpp:936] Authorizing principal 'test-principal' to GET the
'/containers' endpoint
I0611 00:27:20.429808  4612 slave.cpp:817] Agent terminating
[       OK ] Endpoint/SlaveEndpointTest.UnauthorizedRequest/2 (45 ms)
[ RUN      ] Endpoint/SlaveEndpointTest.NoAuthorizer/0
I0611 00:27:20.445813  4586 containerizer.cpp:230] Using isolation: posix/cpu,posix/mem,filesystem/posix,network/cni,environment_secret
W0611 00:27:20.446597  4586 backend.cpp:76] Failed to create 'overlay' backend: OverlayBackend
requires root privileges
W0611 00:27:20.446771  4586 backend.cpp:76] Failed to create 'bind' backend: BindBackend requires
root privileges
I0611 00:27:20.446815  4586 provisioner.cpp:255] Using default backend 'copy'
I0611 00:27:20.449154  4586 cluster.cpp:448] Creating default 'local' authorizer
I0611 00:27:20.451879  4609 slave.cpp:248] Mesos agent started on (760)@172.17.0.2:36165
I0611 00:27:20.451970  4609 slave.cpp:249] Flags at startup: --acls="" --appc_simple_discovery_uri_prefix="http://"
--appc_store_dir="/tmp/Endpoint_SlaveEndpointTest_NoAuthorizer_0_bQkAfw/store/appc" --authenticate_http_readonly="true"
--authenticate_http_readwrite="true" --authenticatee="crammd5" --authentication_backoff_factor="1secs"
--authorizer="local" --cgroups_cpu_enable_pids_and_tids_count="false" --cgroups_enable_cfs="false"
--cgroups_hierarchy="/sys/fs/cgroup" --cgroups_limit_swap="false" --cgroups_root="mesos" --container_disk_watch_interval="15secs"
--containerizers="mesos" --credential="/tmp/Endpoint_SlaveEndpointTest_NoAuthorizer_0_bQkAfw/credential"
--default_role="*" --disk_watch_interval="1mins" --docker="docker" --docker_kill_orphans="true"
--docker_registry="https://registry-1.docker.io" --docker_remove_delay="6hrs" --docker_socket="/var/run/docker.sock"
--docker_stop_timeout="0ns" --docker_store_dir="/tmp/Endpoint_SlaveEndpointTest_NoAuthorizer_0_bQkAfw/store/docker"
--docker_volume_checkpoint_dir="/var/run/mesos/isolators/docker/volume" --enforce_container_disk_quota="false"
--executor_registration_timeout="1mins" --executor_reregistration_timeout="2secs" --executor_shutdown_grace_period="5secs"
--fetcher_cache_dir="/tmp/Endpoint_SlaveEndpointTest_NoAuthorizer_0_bQkAfw/fetch" --fetcher_cache_size="2GB"
--frameworks_home="" --gc_delay="1weeks" --gc_disk_headroom="0.1" --hadoop_home="" --help="false"
--hostname_lookup="true" --http_command_executor="false" --http_credentials="/tmp/Endpoint_SlaveEndpointTest_NoAuthorizer_0_bQkAfw/http_credentials"
--http_heartbeat_interval="30secs" --initialize_driver_logging="true" --isolation="posix/cpu,posix/mem"
--launcher="posix" --launcher_dir="/mesos/mesos-1.4.0/_build/src" --logbufsecs="0" --logging_level="INFO"
--max_completed_executors_per_framework="150" --oversubscribed_resources_interval="15secs"
--perf_duration="10secs" --perf_interval="1mins" --port="5051" --qos_correction_interval_min="0ns"
--quiet="false" --recover="reconnect" --recovery_timeout="15mins" --registration_backoff_factor="10ms"
--resources="cpus:2;gpus:0;mem:1024;disk:1024;ports:[31000-32000]" --revocable_cpu_low_priority="true"
--runtime_dir="/tmp/Endpoint_SlaveEndpointTest_NoAuthorizer_0_bQkAfw" --sandbox_directory="/mnt/mesos/sandbox"
--strict="true" --switch_user="true" --systemd_enable_support="true" --systemd_runtime_directory="/run/systemd/system"
--version="false" --work_dir="/tmp/Endpoint_SlaveEndpointTest_NoAuthorizer_0_7KSrH4"
I0611 00:27:20.452793  4609 credentials.hpp:86] Loading credential for authentication from
'/tmp/Endpoint_SlaveEndpointTest_NoAuthorizer_0_bQkAfw/credential'
I0611 00:27:20.453133  4609 slave.cpp:281] Agent using credential for: test-principal
I0611 00:27:20.453202  4609 credentials.hpp:37] Loading credentials for authentication from
'/tmp/Endpoint_SlaveEndpointTest_NoAuthorizer_0_bQkAfw/http_credentials'
I0611 00:27:20.453675  4609 http.cpp:975] Creating default 'basic' HTTP authenticator for
realm 'mesos-agent-readonly'
I0611 00:27:20.454002  4609 http.cpp:975] Creating default 'basic' HTTP authenticator for
realm 'mesos-agent-readwrite'
I0611 00:27:20.456187  4609 slave.cpp:552] Agent resources: cpus(*):2; mem(*):1024; disk(*):1024;
ports(*):[31000-32000]
I0611 00:27:20.456372  4609 slave.cpp:560] Agent attributes: [  ]
I0611 00:27:20.456418  4609 slave.cpp:565] Agent hostname: 51342386fd69
I0611 00:27:20.456758  4610 status_update_manager.cpp:177] Pausing sending status updates
I0611 00:27:20.458817  4609 state.cpp:62] Recovering state from '/tmp/Endpoint_SlaveEndpointTest_NoAuthorizer_0_7KSrH4/meta'
I0611 00:27:20.459450  4607 status_update_manager.cpp:203] Recovering status update manager
I0611 00:27:20.459858  4605 containerizer.cpp:582] Recovering containerizer
I0611 00:27:20.461901  4612 provisioner.cpp:416] Provisioner recovery complete
I0611 00:27:20.462687  4610 slave.cpp:6127] Finished recovery
I0611 00:27:20.463416  4610 slave.cpp:6309] Querying resource estimator for oversubscribable
resources
I0611 00:27:20.463877  4611 slave.cpp:6323] Received oversubscribable resources {} from the
resource estimator
I0611 00:27:20.467897  4610 process.cpp:3778] Handling HTTP event for process 'slave(760)'
with path: '/slave(760)/monitor/statistics'
I0611 00:27:20.469964  4612 http.cpp:1115] HTTP GET for /slave(760)/monitor/statistics from
172.17.0.2:55280
I0611 00:27:20.470193  4612 http.cpp:936] Authorizing principal 'test-principal' to GET the
'/monitor/statistics' endpoint
I0611 00:27:20.475579  4607 slave.cpp:817] Agent terminating
[       OK ] Endpoint/SlaveEndpointTest.NoAuthorizer/0 (45 ms)
[ RUN      ] Endpoint/SlaveEndpointTest.NoAuthorizer/1
I0611 00:27:20.491525  4586 containerizer.cpp:230] Using isolation: posix/cpu,posix/mem,filesystem/posix,network/cni,environment_secret
W0611 00:27:20.492306  4586 backend.cpp:76] Failed to create 'overlay' backend: OverlayBackend
requires root privileges
W0611 00:27:20.492482  4586 backend.cpp:76] Failed to create 'bind' backend: BindBackend requires
root privileges
I0611 00:27:20.492527  4586 provisioner.cpp:255] Using default backend 'copy'
I0611 00:27:20.495048  4586 cluster.cpp:448] Creating default 'local' authorizer
I0611 00:27:20.498385  4609 slave.cpp:248] Mesos agent started on (761)@172.17.0.2:36165
I0611 00:27:20.499244  4609 slave.cpp:249] Flags at startup: --acls="" --appc_simple_discovery_uri_prefix="http://"
--appc_store_dir="/tmp/Endpoint_SlaveEndpointTest_NoAuthorizer_1_rqrzRi/store/appc" --authenticate_http_readonly="true"
--authenticate_http_readwrite="true" --authenticatee="crammd5" --authentication_backoff_factor="1secs"
--authorizer="local" --cgroups_cpu_enable_pids_and_tids_count="false" --cgroups_enable_cfs="false"
--cgroups_hierarchy="/sys/fs/cgroup" --cgroups_limit_swap="false" --cgroups_root="mesos" --container_disk_watch_interval="15secs"
--containerizers="mesos" --credential="/tmp/Endpoint_SlaveEndpointTest_NoAuthorizer_1_rqrzRi/credential"
--default_role="*" --disk_watch_interval="1mins" --docker="docker" --docker_kill_orphans="true"
--docker_registry="https://registry-1.docker.io" --docker_remove_delay="6hrs" --docker_socket="/var/run/docker.sock"
--docker_stop_timeout="0ns" --docker_store_dir="/tmp/Endpoint_SlaveEndpointTest_NoAuthorizer_1_rqrzRi/store/docker"
--docker_volume_checkpoint_dir="/var/run/mesos/isolators/docker/volume" --enforce_container_disk_quota="false"
--executor_registration_timeout="1mins" --executor_reregistration_timeout="2secs" --executor_shutdown_grace_period="5secs"
--fetcher_cache_dir="/tmp/Endpoint_SlaveEndpointTest_NoAuthorizer_1_rqrzRi/fetch" --fetcher_cache_size="2GB"
--frameworks_home="" --gc_delay="1weeks" --gc_disk_headroom="0.1" --hadoop_home="" --help="false"
--hostname_lookup="true" --http_command_executor="false" --http_credentials="/tmp/Endpoint_SlaveEndpointTest_NoAuthorizer_1_rqrzRi/http_credentials"
--http_heartbeat_interval="30secs" --initialize_driver_logging="true" --isolation="posix/cpu,posix/mem"
--launcher="posix" --launcher_dir="/mesos/mesos-1.4.0/_build/src" --logbufsecs="0" --logging_level="INFO"
--max_completed_executors_per_framework="150" --oversubscribed_resources_interval="15secs"
--perf_duration="10secs" --perf_interval="1mins" --port="5051" --qos_correction_interval_min="0ns"
--quiet="false" --recover="reconnect" --recovery_timeout="15mins" --registration_backoff_factor="10ms"
--resources="cpus:2;gpus:0;mem:1024;disk:1024;ports:[31000-32000]" --revocable_cpu_low_priority="true"
--runtime_dir="/tmp/Endpoint_SlaveEndpointTest_NoAuthorizer_1_rqrzRi" --sandbox_directory="/mnt/mesos/sandbox"
--strict="true" --switch_user="true" --systemd_enable_support="true" --systemd_runtime_directory="/run/systemd/system"
--version="false" --work_dir="/tmp/Endpoint_SlaveEndpointTest_NoAuthorizer_1_puxZbR"
I0611 00:27:20.500003  4609 credentials.hpp:86] Loading credential for authentication from
'/tmp/Endpoint_SlaveEndpointTest_NoAuthorizer_1_rqrzRi/credential'
I0611 00:27:20.500355  4609 slave.cpp:281] Agent using credential for: test-principal
I0611 00:27:20.500411  4609 credentials.hpp:37] Loading credentials for authentication from
'/tmp/Endpoint_SlaveEndpointTest_NoAuthorizer_1_rqrzRi/http_credentials'
I0611 00:27:20.500932  4609 http.cpp:975] Creating default 'basic' HTTP authenticator for
realm 'mesos-agent-readonly'
I0611 00:27:20.501269  4609 http.cpp:975] Creating default 'basic' HTTP authenticator for
realm 'mesos-agent-readwrite'
I0611 00:27:20.503471  4609 slave.cpp:552] Agent resources: cpus(*):2; mem(*):1024; disk(*):1024;
ports(*):[31000-32000]
I0611 00:27:20.503655  4609 slave.cpp:560] Agent attributes: [  ]
I0611 00:27:20.503736  4609 slave.cpp:565] Agent hostname: 51342386fd69
I0611 00:27:20.504060  4612 status_update_manager.cpp:177] Pausing sending status updates
I0611 00:27:20.506134  4607 state.cpp:62] Recovering state from '/tmp/Endpoint_SlaveEndpointTest_NoAuthorizer_1_puxZbR/meta'
I0611 00:27:20.506721  4612 status_update_manager.cpp:203] Recovering status update manager
I0611 00:27:20.507076  4607 containerizer.cpp:582] Recovering containerizer
I0611 00:27:20.509181  4612 provisioner.cpp:416] Provisioner recovery complete
I0611 00:27:20.509904  4605 slave.cpp:6127] Finished recovery
I0611 00:27:20.510653  4605 slave.cpp:6309] Querying resource estimator for oversubscribable
resources
I0611 00:27:20.511157  4611 slave.cpp:6323] Received oversubscribable resources {} from the
resource estimator
I0611 00:27:20.515080  4605 process.cpp:3778] Handling HTTP event for process 'slave(761)'
with path: '/slave(761)/monitor/statistics.json'
I0611 00:27:20.517582  4605 http.cpp:1115] HTTP GET for /slave(761)/monitor/statistics.json
from 172.17.0.2:55282
I0611 00:27:20.517793  4605 http.cpp:936] Authorizing principal 'test-principal' to GET the
'/monitor/statistics.json' endpoint
I0611 00:27:20.523983  4607 slave.cpp:817] Agent terminating
[       OK ] Endpoint/SlaveEndpointTest.NoAuthorizer/1 (48 ms)
[ RUN      ] Endpoint/SlaveEndpointTest.NoAuthorizer/2
I0611 00:27:20.539561  4586 containerizer.cpp:230] Using isolation: posix/cpu,posix/mem,filesystem/posix,network/cni,environment_secret
W0611 00:27:20.540338  4586 backend.cpp:76] Failed to create 'overlay' backend: OverlayBackend
requires root privileges
W0611 00:27:20.540513  4586 backend.cpp:76] Failed to create 'bind' backend: BindBackend requires
root privileges
I0611 00:27:20.540558  4586 provisioner.cpp:255] Using default backend 'copy'
I0611 00:27:20.543068  4586 cluster.cpp:448] Creating default 'local' authorizer
I0611 00:27:20.545693  4608 slave.cpp:248] Mesos agent started on (762)@172.17.0.2:36165
I0611 00:27:20.545737  4608 slave.cpp:249] Flags at startup: --acls="" --appc_simple_discovery_uri_prefix="http://"
--appc_store_dir="/tmp/Endpoint_SlaveEndpointTest_NoAuthorizer_2_PsICY5/store/appc" --authenticate_http_readonly="true"
--authenticate_http_readwrite="true" --authenticatee="crammd5" --authentication_backoff_factor="1secs"
--authorizer="local" --cgroups_cpu_enable_pids_and_tids_count="false" --cgroups_enable_cfs="false"
--cgroups_hierarchy="/sys/fs/cgroup" --cgroups_limit_swap="false" --cgroups_root="mesos" --container_disk_watch_interval="15secs"
--containerizers="mesos" --credential="/tmp/Endpoint_SlaveEndpointTest_NoAuthorizer_2_PsICY5/credential"
--default_role="*" --disk_watch_interval="1mins" --docker="docker" --docker_kill_orphans="true"
--docker_registry="https://registry-1.docker.io" --docker_remove_delay="6hrs" --docker_socket="/var/run/docker.sock"
--docker_stop_timeout="0ns" --docker_store_dir="/tmp/Endpoint_SlaveEndpointTest_NoAuthorizer_2_PsICY5/store/docker"
--docker_volume_checkpoint_dir="/var/run/mesos/isolators/docker/volume" --enforce_container_disk_quota="false"
--executor_registration_timeout="1mins" --executor_reregistration_timeout="2secs" --executor_shutdown_grace_period="5secs"
--fetcher_cache_dir="/tmp/Endpoint_SlaveEndpointTest_NoAuthorizer_2_PsICY5/fetch" --fetcher_cache_size="2GB"
--frameworks_home="" --gc_delay="1weeks" --gc_disk_headroom="0.1" --hadoop_home="" --help="false"
--hostname_lookup="true" --http_command_executor="false" --http_credentials="/tmp/Endpoint_SlaveEndpointTest_NoAuthorizer_2_PsICY5/http_credentials"
--http_heartbeat_interval="30secs" --initialize_driver_logging="true" --isolation="posix/cpu,posix/mem"
--launcher="posix" --launcher_dir="/mesos/mesos-1.4.0/_build/src" --logbufsecs="0" --logging_level="INFO"
--max_completed_executors_per_framework="150" --oversubscribed_resources_interval="15secs"
--perf_duration="10secs" --perf_interval="1mins" --port="5051" --qos_correction_interval_min="0ns"
--quiet="false" --recover="reconnect" --recovery_timeout="15mins" --registration_backoff_factor="10ms"
--resources="cpus:2;gpus:0;mem:1024;disk:1024;ports:[31000-32000]" --revocable_cpu_low_priority="true"
--runtime_dir="/tmp/Endpoint_SlaveEndpointTest_NoAuthorizer_2_PsICY5" --sandbox_directory="/mnt/mesos/sandbox"
--strict="true" --switch_user="true" --systemd_enable_support="true" --systemd_runtime_directory="/run/systemd/system"
--version="false" --work_dir="/tmp/Endpoint_SlaveEndpointTest_NoAuthorizer_2_DzgfbE"
I0611 00:27:20.546850  4608 credentials.hpp:86] Loading credential for authentication from
'/tmp/Endpoint_SlaveEndpointTest_NoAuthorizer_2_PsICY5/credential'
I0611 00:27:20.547431  4608 slave.cpp:281] Agent using credential for: test-principal
I0611 00:27:20.547468  4608 credentials.hpp:37] Loading credentials for authentication from
'/tmp/Endpoint_SlaveEndpointTest_NoAuthorizer_2_PsICY5/http_credentials'
I0611 00:27:20.548058  4608 http.cpp:975] Creating default 'basic' HTTP authenticator for
realm 'mesos-agent-readonly'
I0611 00:27:20.548434  4608 http.cpp:975] Creating default 'basic' HTTP authenticator for
realm 'mesos-agent-readwrite'
I0611 00:27:20.550643  4608 slave.cpp:552] Agent resources: cpus(*):2; mem(*):1024; disk(*):1024;
ports(*):[31000-32000]
I0611 00:27:20.550784  4608 slave.cpp:560] Agent attributes: [  ]
I0611 00:27:20.550804  4608 slave.cpp:565] Agent hostname: 51342386fd69
I0611 00:27:20.551360  4607 status_update_manager.cpp:177] Pausing sending status updates
I0611 00:27:20.553665  4605 state.cpp:62] Recovering state from '/tmp/Endpoint_SlaveEndpointTest_NoAuthorizer_2_DzgfbE/meta'
I0611 00:27:20.554281  4607 status_update_manager.cpp:203] Recovering status update manager
I0611 00:27:20.554780  4605 containerizer.cpp:582] Recovering containerizer
I0611 00:27:20.556814  4608 provisioner.cpp:416] Provisioner recovery complete
I0611 00:27:20.557530  4611 slave.cpp:6127] Finished recovery
I0611 00:27:20.558265  4611 slave.cpp:6309] Querying resource estimator for oversubscribable
resources
I0611 00:27:20.558815  4605 slave.cpp:6323] Received oversubscribable resources {} from the
resource estimator
I0611 00:27:20.564270  4606 process.cpp:3778] Handling HTTP event for process 'slave(762)'
with path: '/slave(762)/containers'
I0611 00:27:20.566735  4606 http.cpp:1115] HTTP GET for /slave(762)/containers from 172.17.0.2:55284
I0611 00:27:20.566854  4606 http.cpp:936] Authorizing principal 'test-principal' to GET the
'/containers' endpoint
I0611 00:27:20.573154  4608 slave.cpp:817] Agent terminating
[       OK ] Endpoint/SlaveEndpointTest.NoAuthorizer/2 (49 ms)
[----------] 9 tests from Endpoint/SlaveEndpointTest (416 ms total)

[----------] Global test environment tear-down
[==========] 1589 tests from 176 test cases ran. (724726 ms total)
[  PASSED  ] 1585 tests.
[  FAILED  ] 4 tests, listed below:
[  FAILED  ] DefaultExecutorCheckTest.CommandCheckDeliveredAndReconciled
[  FAILED  ] DefaultExecutorCheckTest.CommandCheckStatusChange
[  FAILED  ] DefaultExecutorCheckTest.CommandCheckSeesParentsEnv
[  FAILED  ] DefaultExecutorCheckTest.CommandCheckSharesWorkDirWithTask

 4 FAILED TESTS
  YOU HAVE 22 DISABLED TESTS

E0611 00:27:20.714681  4613 process.cpp:968] Failed to accept socket: future discarded
make[4]: *** [check-local] Error 1
make[4]: Leaving directory `/mesos/mesos-1.4.0/_build/src'
make[3]: *** [check-am] Error 2
make[3]: Leaving directory `/mesos/mesos-1.4.0/_build/src'
make[2]: *** [check] Error 2
make[2]: Leaving directory `/mesos/mesos-1.4.0/_build/src'
make[1]: *** [check-recursive] Error 1
make[1]: Leaving directory `/mesos/mesos-1.4.0/_build'
make: *** [distcheck] Error 1
+ docker rmi mesos-1497135261-23362
Untagged: mesos-1497135261-23362:latest
Deleted: sha256:742cee1763d0538fc60a2e193171f3f8a3b2238696ee7b25660628cff1938357
Deleted: sha256:f7ccdfedecc653c899f31c855967a0fb6b2f08e523a08fb69bb15c5840737b91
Deleted: sha256:bc0636a17c809e5baae343211019783d18bcda0433116311cf3c7c6db91bbe9d
Deleted: sha256:57fe573ef3bde89e439fc4288812cd9054092b1326641d02509b9c4f33513bf7
Deleted: sha256:eea24fb6b1d7125aecda1fbe0049b3582d54939f10a4e7b0eba38ae361103719
Deleted: sha256:9ddfbbf3ec3972c714d2ce151a448f535c6d8f0830012622aa52fcbf06dba35d
Deleted: sha256:764ec7b0c5142d5a4970459a3e975b93a02de2e0d018d7497c3bb1d9ea264779
Deleted: sha256:120ceec745ad0b5b3eaeaac3bedc26c1b9929c6404e9ec5fc21598c8c6452a3c
Deleted: sha256:f99c5de7da65719ea1446bb399b29607eca197814b45202e47cdee9650ca6d19
Deleted: sha256:ec5eff59e6ccccccb6549ec2fcc8dc41eb1059b4215b0a8e0e42eb51ca4276fe
Deleted: sha256:6e1d6dd3459cf9ca859d4815f5e9dc2948a910f62a7d4aefb4f63e3c8e666a2a
Deleted: sha256:af8fda4e1d45dbccf0d2d5c0054daeed2460df213fee4ba6035c52d4c574e9d4
Deleted: sha256:8cfcd1821173234ea97332a0a7c9b583413ba0348db795eb99021eb73c2659bd
Deleted: sha256:20de4bfcbe4214c8dfb170645c36f6fd96e988ba97098bea8abe5187364406ce
Deleted: sha256:bf492863812e48faada2f84c8db39caf046af29e9665f2d8d60960ceee9b1cff
Deleted: sha256:85c094e263698d59210c99990fb8716207f6b1f49c6f51718228362e0de6fe3a
Deleted: sha256:93bc70e73ec906c9cb6f1b18e28f14b9216c7e195bdd31081c650a0d075d3271
Deleted: sha256:5b6dc53888792e9a22f93b41d70ac337d10ea17bb85c30c65fb9b17de2c83537
Deleted: sha256:d94ac7594a15f92e0c336be63e6f6a9b5b8b1c433f81409749fa421b5a5da4fb
Deleted: sha256:0392cdbc52b407744c103e2db4f221409d58efdaee35a4030cffc6f351af64d6
Deleted: sha256:2d1f543f6222f25eb9087d6af5e256ddd49aaf2e1bcd76152d0ce174a9fffa28
Deleted: sha256:a0d96858242b219ba29271e3bfc7303933d834ca588d6264f25680e01cc7e251
Deleted: sha256:f435ce156871fdb1f0e28e4b8424d5cc289ffcdb8762dc21bd1b33a1c4c6df0d
Deleted: sha256:cd677461090c5c210795c6c102762c2a270807bd33cdd325bf01577e8723b25e
Build step 'Execute shell' marked build as failure

Mime
View raw message