mesos-builds mailing list archives

Site index · List index
Message view « Date » · « Thread »
Top « Date » · « Thread »
From Apache Jenkins Server <jenk...@builds.apache.org>
Subject Build failed in Jenkins: Mesos-Reviewbot #18320
Date Fri, 09 Jun 2017 12:30:56 GMT
See <https://builds.apache.org/job/Mesos-Reviewbot/18320/display/redirect>

------------------------------------------
[...truncated 28.16 MB...]
I0609 12:30:49.257692  4513 containerizer.cpp:230] Using isolation: posix/cpu,posix/mem,filesystem/posix,network/cni,environment_secret
W0609 12:30:49.258457  4513 backend.cpp:76] Failed to create 'overlay' backend: OverlayBackend
requires root privileges
W0609 12:30:49.258631  4513 backend.cpp:76] Failed to create 'bind' backend: BindBackend requires
root privileges
I0609 12:30:49.258677  4513 provisioner.cpp:255] Using default backend 'copy'
I0609 12:30:49.263443  4536 slave.cpp:248] Mesos agent started on (756)@172.17.0.2:36085
I0609 12:30:49.263484  4536 slave.cpp:249] Flags at startup: --acls="" --appc_simple_discovery_uri_prefix="http://"
--appc_store_dir="/tmp/Endpoint_SlaveEndpointTest_AuthorizedRequest_2_UiRwvP/store/appc" --authenticate_http_readonly="true"
--authenticate_http_readwrite="true" --authenticatee="crammd5" --authentication_backoff_factor="1secs"
--authorizer="local" --cgroups_cpu_enable_pids_and_tids_count="false" --cgroups_enable_cfs="false"
--cgroups_hierarchy="/sys/fs/cgroup" --cgroups_limit_swap="false" --cgroups_root="mesos" --container_disk_watch_interval="15secs"
--containerizers="mesos" --credential="/tmp/Endpoint_SlaveEndpointTest_AuthorizedRequest_2_UiRwvP/credential"
--default_role="*" --disk_watch_interval="1mins" --docker="docker" --docker_kill_orphans="true"
--docker_registry="https://registry-1.docker.io" --docker_remove_delay="6hrs" --docker_socket="/var/run/docker.sock"
--docker_stop_timeout="0ns" --docker_store_dir="/tmp/Endpoint_SlaveEndpointTest_AuthorizedRequest_2_UiRwvP/store/docker"
--docker_volume_checkpoint_dir="/var/run/mesos/isolators/docker/volume" --enforce_container_disk_quota="false"
--executor_registration_timeout="1mins" --executor_reregistration_timeout="2secs" --executor_shutdown_grace_period="5secs"
--fetcher_cache_dir="/tmp/Endpoint_SlaveEndpointTest_AuthorizedRequest_2_UiRwvP/fetch" --fetcher_cache_size="2GB"
--frameworks_home="" --gc_delay="1weeks" --gc_disk_headroom="0.1" --hadoop_home="" --help="false"
--hostname_lookup="true" --http_command_executor="false" --http_credentials="/tmp/Endpoint_SlaveEndpointTest_AuthorizedRequest_2_UiRwvP/http_credentials"
--http_heartbeat_interval="30secs" --initialize_driver_logging="true" --isolation="posix/cpu,posix/mem"
--launcher="posix" --launcher_dir="/mesos/mesos-1.4.0/_build/src" --logbufsecs="0" --logging_level="INFO"
--max_completed_executors_per_framework="150" --oversubscribed_resources_interval="15secs"
--perf_duration="10secs" --perf_interval="1mins" --port="5051" --qos_correction_interval_min="0ns"
--quiet="false" --recover="reconnect" --recovery_timeout="15mins" --registration_backoff_factor="10ms"
--resources="cpus:2;gpus:0;mem:1024;disk:1024;ports:[31000-32000]" --revocable_cpu_low_priority="true"
--runtime_dir="/tmp/Endpoint_SlaveEndpointTest_AuthorizedRequest_2_UiRwvP" --sandbox_directory="/mnt/mesos/sandbox"
--strict="true" --switch_user="true" --systemd_enable_support="true" --systemd_runtime_directory="/run/systemd/system"
--version="false" --work_dir="/tmp/Endpoint_SlaveEndpointTest_AuthorizedRequest_2_vsswEO"
I0609 12:30:49.264343  4536 credentials.hpp:86] Loading credential for authentication from
'/tmp/Endpoint_SlaveEndpointTest_AuthorizedRequest_2_UiRwvP/credential'
I0609 12:30:49.264766  4536 slave.cpp:281] Agent using credential for: test-principal
I0609 12:30:49.264806  4536 credentials.hpp:37] Loading credentials for authentication from
'/tmp/Endpoint_SlaveEndpointTest_AuthorizedRequest_2_UiRwvP/http_credentials'
I0609 12:30:49.265355  4536 http.cpp:975] Creating default 'basic' HTTP authenticator for
realm 'mesos-agent-readonly'
I0609 12:30:49.265744  4536 http.cpp:975] Creating default 'basic' HTTP authenticator for
realm 'mesos-agent-readwrite'
I0609 12:30:49.267897  4536 slave.cpp:552] Agent resources: cpus(*):2; mem(*):1024; disk(*):1024;
ports(*):[31000-32000]
I0609 12:30:49.268040  4536 slave.cpp:560] Agent attributes: [  ]
I0609 12:30:49.268061  4536 slave.cpp:565] Agent hostname: 35de0ee940af
I0609 12:30:49.268450  4534 status_update_manager.cpp:177] Pausing sending status updates
I0609 12:30:49.270642  4533 state.cpp:62] Recovering state from '/tmp/Endpoint_SlaveEndpointTest_AuthorizedRequest_2_vsswEO/meta'
I0609 12:30:49.271492  4535 status_update_manager.cpp:203] Recovering status update manager
I0609 12:30:49.271850  4535 containerizer.cpp:582] Recovering containerizer
I0609 12:30:49.273833  4534 provisioner.cpp:416] Provisioner recovery complete
I0609 12:30:49.274737  4536 slave.cpp:6127] Finished recovery
I0609 12:30:49.275557  4536 slave.cpp:6309] Querying resource estimator for oversubscribable
resources
I0609 12:30:49.275976  4536 slave.cpp:6323] Received oversubscribable resources {} from the
resource estimator
I0609 12:30:49.281430  4538 process.cpp:3778] Handling HTTP event for process 'slave(756)'
with path: '/slave(756)/containers'
I0609 12:30:49.283947  4538 http.cpp:1115] HTTP GET for /slave(756)/containers from 172.17.0.2:34480
I0609 12:30:49.284068  4538 http.cpp:936] Authorizing principal 'test-principal' to GET the
'/containers' endpoint
I0609 12:30:49.290354  4513 slave.cpp:817] Agent terminating
[       OK ] Endpoint/SlaveEndpointTest.AuthorizedRequest/2 (47 ms)
[ RUN      ] Endpoint/SlaveEndpointTest.UnauthorizedRequest/0
I0609 12:30:49.306005  4513 containerizer.cpp:230] Using isolation: posix/cpu,posix/mem,filesystem/posix,network/cni,environment_secret
W0609 12:30:49.306932  4513 backend.cpp:76] Failed to create 'overlay' backend: OverlayBackend
requires root privileges
W0609 12:30:49.307116  4513 backend.cpp:76] Failed to create 'bind' backend: BindBackend requires
root privileges
I0609 12:30:49.307163  4513 provisioner.cpp:255] Using default backend 'copy'
I0609 12:30:49.313894  4532 slave.cpp:248] Mesos agent started on (757)@172.17.0.2:36085
I0609 12:30:49.313935  4532 slave.cpp:249] Flags at startup: --acls="" --appc_simple_discovery_uri_prefix="http://"
--appc_store_dir="/tmp/Endpoint_SlaveEndpointTest_UnauthorizedRequest_0_Q6sQlT/store/appc"
--authenticate_http_readonly="true" --authenticate_http_readwrite="true" --authenticatee="crammd5"
--authentication_backoff_factor="1secs" --authorizer="local" --cgroups_cpu_enable_pids_and_tids_count="false"
--cgroups_enable_cfs="false" --cgroups_hierarchy="/sys/fs/cgroup" --cgroups_limit_swap="false"
--cgroups_root="mesos" --container_disk_watch_interval="15secs" --containerizers="mesos" --credential="/tmp/Endpoint_SlaveEndpointTest_UnauthorizedRequest_0_Q6sQlT/credential"
--default_role="*" --disk_watch_interval="1mins" --docker="docker" --docker_kill_orphans="true"
--docker_registry="https://registry-1.docker.io" --docker_remove_delay="6hrs" --docker_socket="/var/run/docker.sock"
--docker_stop_timeout="0ns" --docker_store_dir="/tmp/Endpoint_SlaveEndpointTest_UnauthorizedRequest_0_Q6sQlT/store/docker"
--docker_volume_checkpoint_dir="/var/run/mesos/isolators/docker/volume" --enforce_container_disk_quota="false"
--executor_registration_timeout="1mins" --executor_reregistration_timeout="2secs" --executor_shutdown_grace_period="5secs"
--fetcher_cache_dir="/tmp/Endpoint_SlaveEndpointTest_UnauthorizedRequest_0_Q6sQlT/fetch" --fetcher_cache_size="2GB"
--frameworks_home="" --gc_delay="1weeks" --gc_disk_headroom="0.1" --hadoop_home="" --help="false"
--hostname_lookup="true" --http_command_executor="false" --http_credentials="/tmp/Endpoint_SlaveEndpointTest_UnauthorizedRequest_0_Q6sQlT/http_credentials"
--http_heartbeat_interval="30secs" --initialize_driver_logging="true" --isolation="posix/cpu,posix/mem"
--launcher="posix" --launcher_dir="/mesos/mesos-1.4.0/_build/src" --logbufsecs="0" --logging_level="INFO"
--max_completed_executors_per_framework="150" --oversubscribed_resources_interval="15secs"
--perf_duration="10secs" --perf_interval="1mins" --port="5051" --qos_correction_interval_min="0ns"
--quiet="false" --recover="reconnect" --recovery_timeout="15mins" --registration_backoff_factor="10ms"
--resources="cpus:2;gpus:0;mem:1024;disk:1024;ports:[31000-32000]" --revocable_cpu_low_priority="true"
--runtime_dir="/tmp/Endpoint_SlaveEndpointTest_UnauthorizedRequest_0_Q6sQlT" --sandbox_directory="/mnt/mesos/sandbox"
--strict="true" --switch_user="true" --systemd_enable_support="true" --systemd_runtime_directory="/run/systemd/system"
--version="false" --work_dir="/tmp/Endpoint_SlaveEndpointTest_UnauthorizedRequest_0_lxw3mS"
I0609 12:30:49.314972  4532 credentials.hpp:86] Loading credential for authentication from
'/tmp/Endpoint_SlaveEndpointTest_UnauthorizedRequest_0_Q6sQlT/credential'
I0609 12:30:49.315402  4532 slave.cpp:281] Agent using credential for: test-principal
I0609 12:30:49.315438  4532 credentials.hpp:37] Loading credentials for authentication from
'/tmp/Endpoint_SlaveEndpointTest_UnauthorizedRequest_0_Q6sQlT/http_credentials'
I0609 12:30:49.315960  4532 http.cpp:975] Creating default 'basic' HTTP authenticator for
realm 'mesos-agent-readonly'
I0609 12:30:49.316362  4532 http.cpp:975] Creating default 'basic' HTTP authenticator for
realm 'mesos-agent-readwrite'
I0609 12:30:49.318625  4532 slave.cpp:552] Agent resources: cpus(*):2; mem(*):1024; disk(*):1024;
ports(*):[31000-32000]
I0609 12:30:49.318768  4532 slave.cpp:560] Agent attributes: [  ]
I0609 12:30:49.318789  4532 slave.cpp:565] Agent hostname: 35de0ee940af
I0609 12:30:49.319202  4537 status_update_manager.cpp:177] Pausing sending status updates
I0609 12:30:49.321336  4539 state.cpp:62] Recovering state from '/tmp/Endpoint_SlaveEndpointTest_UnauthorizedRequest_0_lxw3mS/meta'
I0609 12:30:49.322011  4537 status_update_manager.cpp:203] Recovering status update manager
I0609 12:30:49.322397  4536 containerizer.cpp:582] Recovering containerizer
I0609 12:30:49.324698  4538 provisioner.cpp:416] Provisioner recovery complete
I0609 12:30:49.325446  4536 slave.cpp:6127] Finished recovery
I0609 12:30:49.326257  4536 slave.cpp:6309] Querying resource estimator for oversubscribable
resources
I0609 12:30:49.326648  4536 slave.cpp:6323] Received oversubscribable resources {} from the
resource estimator
I0609 12:30:49.331048  4534 process.cpp:3778] Handling HTTP event for process 'slave(757)'
with path: '/slave(757)/monitor/statistics'
I0609 12:30:49.333119  4535 http.cpp:1115] HTTP GET for /slave(757)/monitor/statistics from
172.17.0.2:34482
I0609 12:30:49.333246  4535 http.cpp:936] Authorizing principal 'test-principal' to GET the
'/monitor/statistics' endpoint
I0609 12:30:49.337151  4533 slave.cpp:817] Agent terminating
[       OK ] Endpoint/SlaveEndpointTest.UnauthorizedRequest/0 (48 ms)
[ RUN      ] Endpoint/SlaveEndpointTest.UnauthorizedRequest/1
I0609 12:30:49.353880  4513 containerizer.cpp:230] Using isolation: posix/cpu,posix/mem,filesystem/posix,network/cni,environment_secret
W0609 12:30:49.354657  4513 backend.cpp:76] Failed to create 'overlay' backend: OverlayBackend
requires root privileges
W0609 12:30:49.354831  4513 backend.cpp:76] Failed to create 'bind' backend: BindBackend requires
root privileges
I0609 12:30:49.354877  4513 provisioner.cpp:255] Using default backend 'copy'
I0609 12:30:49.360167  4532 slave.cpp:248] Mesos agent started on (758)@172.17.0.2:36085
I0609 12:30:49.360213  4532 slave.cpp:249] Flags at startup: --acls="" --appc_simple_discovery_uri_prefix="http://"
--appc_store_dir="/tmp/Endpoint_SlaveEndpointTest_UnauthorizedRequest_1_KJrNHX/store/appc"
--authenticate_http_readonly="true" --authenticate_http_readwrite="true" --authenticatee="crammd5"
--authentication_backoff_factor="1secs" --authorizer="local" --cgroups_cpu_enable_pids_and_tids_count="false"
--cgroups_enable_cfs="false" --cgroups_hierarchy="/sys/fs/cgroup" --cgroups_limit_swap="false"
--cgroups_root="mesos" --container_disk_watch_interval="15secs" --containerizers="mesos" --credential="/tmp/Endpoint_SlaveEndpointTest_UnauthorizedRequest_1_KJrNHX/credential"
--default_role="*" --disk_watch_interval="1mins" --docker="docker" --docker_kill_orphans="true"
--docker_registry="https://registry-1.docker.io" --docker_remove_delay="6hrs" --docker_socket="/var/run/docker.sock"
--docker_stop_timeout="0ns" --docker_store_dir="/tmp/Endpoint_SlaveEndpointTest_UnauthorizedRequest_1_KJrNHX/store/docker"
--docker_volume_checkpoint_dir="/var/run/mesos/isolators/docker/volume" --enforce_container_disk_quota="false"
--executor_registration_timeout="1mins" --executor_reregistration_timeout="2secs" --executor_shutdown_grace_period="5secs"
--fetcher_cache_dir="/tmp/Endpoint_SlaveEndpointTest_UnauthorizedRequest_1_KJrNHX/fetch" --fetcher_cache_size="2GB"
--frameworks_home="" --gc_delay="1weeks" --gc_disk_headroom="0.1" --hadoop_home="" --help="false"
--hostname_lookup="true" --http_command_executor="false" --http_credentials="/tmp/Endpoint_SlaveEndpointTest_UnauthorizedRequest_1_KJrNHX/http_credentials"
--http_heartbeat_interval="30secs" --initialize_driver_logging="true" --isolation="posix/cpu,posix/mem"
--launcher="posix" --launcher_dir="/mesos/mesos-1.4.0/_build/src" --logbufsecs="0" --logging_level="INFO"
--max_completed_executors_per_framework="150" --oversubscribed_resources_interval="15secs"
--perf_duration="10secs" --perf_interval="1mins" --port="5051" --qos_correction_interval_min="0ns"
--quiet="false" --recover="reconnect" --recovery_timeout="15mins" --registration_backoff_factor="10ms"
--resources="cpus:2;gpus:0;mem:1024;disk:1024;ports:[31000-32000]" --revocable_cpu_low_priority="true"
--runtime_dir="/tmp/Endpoint_SlaveEndpointTest_UnauthorizedRequest_1_KJrNHX" --sandbox_directory="/mnt/mesos/sandbox"
--strict="true" --switch_user="true" --systemd_enable_support="true" --systemd_runtime_directory="/run/systemd/system"
--version="false" --work_dir="/tmp/Endpoint_SlaveEndpointTest_UnauthorizedRequest_1_V1RdBW"
I0609 12:30:49.361099  4532 credentials.hpp:86] Loading credential for authentication from
'/tmp/Endpoint_SlaveEndpointTest_UnauthorizedRequest_1_KJrNHX/credential'
I0609 12:30:49.361517  4532 slave.cpp:281] Agent using credential for: test-principal
I0609 12:30:49.361553  4532 credentials.hpp:37] Loading credentials for authentication from
'/tmp/Endpoint_SlaveEndpointTest_UnauthorizedRequest_1_KJrNHX/http_credentials'
I0609 12:30:49.362071  4532 http.cpp:975] Creating default 'basic' HTTP authenticator for
realm 'mesos-agent-readonly'
I0609 12:30:49.362483  4532 http.cpp:975] Creating default 'basic' HTTP authenticator for
realm 'mesos-agent-readwrite'
I0609 12:30:49.364763  4532 slave.cpp:552] Agent resources: cpus(*):2; mem(*):1024; disk(*):1024;
ports(*):[31000-32000]
I0609 12:30:49.364907  4532 slave.cpp:560] Agent attributes: [  ]
I0609 12:30:49.364925  4532 slave.cpp:565] Agent hostname: 35de0ee940af
I0609 12:30:49.365339  4534 status_update_manager.cpp:177] Pausing sending status updates
I0609 12:30:49.367444  4535 state.cpp:62] Recovering state from '/tmp/Endpoint_SlaveEndpointTest_UnauthorizedRequest_1_V1RdBW/meta'
I0609 12:30:49.368196  4532 status_update_manager.cpp:203] Recovering status update manager
I0609 12:30:49.368531  4532 containerizer.cpp:582] Recovering containerizer
I0609 12:30:49.370784  4534 provisioner.cpp:416] Provisioner recovery complete
I0609 12:30:49.371567  4537 slave.cpp:6127] Finished recovery
I0609 12:30:49.372278  4537 slave.cpp:6309] Querying resource estimator for oversubscribable
resources
I0609 12:30:49.372859  4535 slave.cpp:6323] Received oversubscribable resources {} from the
resource estimator
I0609 12:30:49.377110  4537 process.cpp:3778] Handling HTTP event for process 'slave(758)'
with path: '/slave(758)/monitor/statistics.json'
I0609 12:30:49.379220  4534 http.cpp:1115] HTTP GET for /slave(758)/monitor/statistics.json
from 172.17.0.2:34484
I0609 12:30:49.379428  4534 http.cpp:936] Authorizing principal 'test-principal' to GET the
'/monitor/statistics.json' endpoint
I0609 12:30:49.384449  4538 slave.cpp:817] Agent terminating
[       OK ] Endpoint/SlaveEndpointTest.UnauthorizedRequest/1 (46 ms)
[ RUN      ] Endpoint/SlaveEndpointTest.UnauthorizedRequest/2
I0609 12:30:49.400583  4513 containerizer.cpp:230] Using isolation: posix/cpu,posix/mem,filesystem/posix,network/cni,environment_secret
W0609 12:30:49.401358  4513 backend.cpp:76] Failed to create 'overlay' backend: OverlayBackend
requires root privileges
W0609 12:30:49.401526  4513 backend.cpp:76] Failed to create 'bind' backend: BindBackend requires
root privileges
I0609 12:30:49.401571  4513 provisioner.cpp:255] Using default backend 'copy'
I0609 12:30:49.406456  4532 slave.cpp:248] Mesos agent started on (759)@172.17.0.2:36085
I0609 12:30:49.406517  4532 slave.cpp:249] Flags at startup: --acls="" --appc_simple_discovery_uri_prefix="http://"
--appc_store_dir="/tmp/Endpoint_SlaveEndpointTest_UnauthorizedRequest_2_yF31x2/store/appc"
--authenticate_http_readonly="true" --authenticate_http_readwrite="true" --authenticatee="crammd5"
--authentication_backoff_factor="1secs" --authorizer="local" --cgroups_cpu_enable_pids_and_tids_count="false"
--cgroups_enable_cfs="false" --cgroups_hierarchy="/sys/fs/cgroup" --cgroups_limit_swap="false"
--cgroups_root="mesos" --container_disk_watch_interval="15secs" --containerizers="mesos" --credential="/tmp/Endpoint_SlaveEndpointTest_UnauthorizedRequest_2_yF31x2/credential"
--default_role="*" --disk_watch_interval="1mins" --docker="docker" --docker_kill_orphans="true"
--docker_registry="https://registry-1.docker.io" --docker_remove_delay="6hrs" --docker_socket="/var/run/docker.sock"
--docker_stop_timeout="0ns" --docker_store_dir="/tmp/Endpoint_SlaveEndpointTest_UnauthorizedRequest_2_yF31x2/store/docker"
--docker_volume_checkpoint_dir="/var/run/mesos/isolators/docker/volume" --enforce_container_disk_quota="false"
--executor_registration_timeout="1mins" --executor_reregistration_timeout="2secs" --executor_shutdown_grace_period="5secs"
--fetcher_cache_dir="/tmp/Endpoint_SlaveEndpointTest_UnauthorizedRequest_2_yF31x2/fetch" --fetcher_cache_size="2GB"
--frameworks_home="" --gc_delay="1weeks" --gc_disk_headroom="0.1" --hadoop_home="" --help="false"
--hostname_lookup="true" --http_command_executor="false" --http_credentials="/tmp/Endpoint_SlaveEndpointTest_UnauthorizedRequest_2_yF31x2/http_credentials"
--http_heartbeat_interval="30secs" --initialize_driver_logging="true" --isolation="posix/cpu,posix/mem"
--launcher="posix" --launcher_dir="/mesos/mesos-1.4.0/_build/src" --logbufsecs="0" --logging_level="INFO"
--max_completed_executors_per_framework="150" --oversubscribed_resources_interval="15secs"
--perf_duration="10secs" --perf_interval="1mins" --port="5051" --qos_correction_interval_min="0ns"
--quiet="false" --recover="reconnect" --recovery_timeout="15mins" --registration_backoff_factor="10ms"
--resources="cpus:2;gpus:0;mem:1024;disk:1024;ports:[31000-32000]" --revocable_cpu_low_priority="true"
--runtime_dir="/tmp/Endpoint_SlaveEndpointTest_UnauthorizedRequest_2_yF31x2" --sandbox_directory="/mnt/mesos/sandbox"
--strict="true" --switch_user="true" --systemd_enable_support="true" --systemd_runtime_directory="/run/systemd/system"
--version="false" --work_dir="/tmp/Endpoint_SlaveEndpointTest_UnauthorizedRequest_2_NFBQj1"
I0609 12:30:49.407431  4532 credentials.hpp:86] Loading credential for authentication from
'/tmp/Endpoint_SlaveEndpointTest_UnauthorizedRequest_2_yF31x2/credential'
I0609 12:30:49.407874  4532 slave.cpp:281] Agent using credential for: test-principal
I0609 12:30:49.407913  4532 credentials.hpp:37] Loading credentials for authentication from
'/tmp/Endpoint_SlaveEndpointTest_UnauthorizedRequest_2_yF31x2/http_credentials'
I0609 12:30:49.408455  4532 http.cpp:975] Creating default 'basic' HTTP authenticator for
realm 'mesos-agent-readonly'
I0609 12:30:49.408877  4532 http.cpp:975] Creating default 'basic' HTTP authenticator for
realm 'mesos-agent-readwrite'
I0609 12:30:49.411119  4532 slave.cpp:552] Agent resources: cpus(*):2; mem(*):1024; disk(*):1024;
ports(*):[31000-32000]
I0609 12:30:49.411262  4532 slave.cpp:560] Agent attributes: [  ]
I0609 12:30:49.411283  4532 slave.cpp:565] Agent hostname: 35de0ee940af
I0609 12:30:49.411697  4534 status_update_manager.cpp:177] Pausing sending status updates
I0609 12:30:49.413719  4538 state.cpp:62] Recovering state from '/tmp/Endpoint_SlaveEndpointTest_UnauthorizedRequest_2_NFBQj1/meta'
I0609 12:30:49.414520  4537 status_update_manager.cpp:203] Recovering status update manager
I0609 12:30:49.415063  4537 containerizer.cpp:582] Recovering containerizer
I0609 12:30:49.417161  4538 provisioner.cpp:416] Provisioner recovery complete
I0609 12:30:49.420405  4533 slave.cpp:6127] Finished recovery
I0609 12:30:49.421028  4533 slave.cpp:6309] Querying resource estimator for oversubscribable
resources
I0609 12:30:49.421540  4536 slave.cpp:6323] Received oversubscribable resources {} from the
resource estimator
I0609 12:30:49.426353  4537 process.cpp:3778] Handling HTTP event for process 'slave(759)'
with path: '/slave(759)/containers'
I0609 12:30:49.428587  4536 http.cpp:1115] HTTP GET for /slave(759)/containers from 172.17.0.2:34486
I0609 12:30:49.428711  4536 http.cpp:936] Authorizing principal 'test-principal' to GET the
'/containers' endpoint
I0609 12:30:49.432049  4533 slave.cpp:817] Agent terminating
[       OK ] Endpoint/SlaveEndpointTest.UnauthorizedRequest/2 (48 ms)
[ RUN      ] Endpoint/SlaveEndpointTest.NoAuthorizer/0
I0609 12:30:49.449594  4513 containerizer.cpp:230] Using isolation: posix/cpu,posix/mem,filesystem/posix,network/cni,environment_secret
W0609 12:30:49.450439  4513 backend.cpp:76] Failed to create 'overlay' backend: OverlayBackend
requires root privileges
W0609 12:30:49.450614  4513 backend.cpp:76] Failed to create 'bind' backend: BindBackend requires
root privileges
I0609 12:30:49.450659  4513 provisioner.cpp:255] Using default backend 'copy'
I0609 12:30:49.453233  4513 cluster.cpp:448] Creating default 'local' authorizer
I0609 12:30:49.455799  4539 slave.cpp:248] Mesos agent started on (760)@172.17.0.2:36085
I0609 12:30:49.455842  4539 slave.cpp:249] Flags at startup: --acls="" --appc_simple_discovery_uri_prefix="http://"
--appc_store_dir="/tmp/Endpoint_SlaveEndpointTest_NoAuthorizer_0_4leET7/store/appc" --authenticate_http_readonly="true"
--authenticate_http_readwrite="true" --authenticatee="crammd5" --authentication_backoff_factor="1secs"
--authorizer="local" --cgroups_cpu_enable_pids_and_tids_count="false" --cgroups_enable_cfs="false"
--cgroups_hierarchy="/sys/fs/cgroup" --cgroups_limit_swap="false" --cgroups_root="mesos" --container_disk_watch_interval="15secs"
--containerizers="mesos" --credential="/tmp/Endpoint_SlaveEndpointTest_NoAuthorizer_0_4leET7/credential"
--default_role="*" --disk_watch_interval="1mins" --docker="docker" --docker_kill_orphans="true"
--docker_registry="https://registry-1.docker.io" --docker_remove_delay="6hrs" --docker_socket="/var/run/docker.sock"
--docker_stop_timeout="0ns" --docker_store_dir="/tmp/Endpoint_SlaveEndpointTest_NoAuthorizer_0_4leET7/store/docker"
--docker_volume_checkpoint_dir="/var/run/mesos/isolators/docker/volume" --enforce_container_disk_quota="false"
--executor_registration_timeout="1mins" --executor_reregistration_timeout="2secs" --executor_shutdown_grace_period="5secs"
--fetcher_cache_dir="/tmp/Endpoint_SlaveEndpointTest_NoAuthorizer_0_4leET7/fetch" --fetcher_cache_size="2GB"
--frameworks_home="" --gc_delay="1weeks" --gc_disk_headroom="0.1" --hadoop_home="" --help="false"
--hostname_lookup="true" --http_command_executor="false" --http_credentials="/tmp/Endpoint_SlaveEndpointTest_NoAuthorizer_0_4leET7/http_credentials"
--http_heartbeat_interval="30secs" --initialize_driver_logging="true" --isolation="posix/cpu,posix/mem"
--launcher="posix" --launcher_dir="/mesos/mesos-1.4.0/_build/src" --logbufsecs="0" --logging_level="INFO"
--max_completed_executors_per_framework="150" --oversubscribed_resources_interval="15secs"
--perf_duration="10secs" --perf_interval="1mins" --port="5051" --qos_correction_interval_min="0ns"
--quiet="false" --recover="reconnect" --recovery_timeout="15mins" --registration_backoff_factor="10ms"
--resources="cpus:2;gpus:0;mem:1024;disk:1024;ports:[31000-32000]" --revocable_cpu_low_priority="true"
--runtime_dir="/tmp/Endpoint_SlaveEndpointTest_NoAuthorizer_0_4leET7" --sandbox_directory="/mnt/mesos/sandbox"
--strict="true" --switch_user="true" --systemd_enable_support="true" --systemd_runtime_directory="/run/systemd/system"
--version="false" --work_dir="/tmp/Endpoint_SlaveEndpointTest_NoAuthorizer_0_F5LDx6"
I0609 12:30:49.456753  4539 credentials.hpp:86] Loading credential for authentication from
'/tmp/Endpoint_SlaveEndpointTest_NoAuthorizer_0_4leET7/credential'
I0609 12:30:49.457242  4539 slave.cpp:281] Agent using credential for: test-principal
I0609 12:30:49.457276  4539 credentials.hpp:37] Loading credentials for authentication from
'/tmp/Endpoint_SlaveEndpointTest_NoAuthorizer_0_4leET7/http_credentials'
I0609 12:30:49.458133  4539 http.cpp:975] Creating default 'basic' HTTP authenticator for
realm 'mesos-agent-readonly'
I0609 12:30:49.458565  4539 http.cpp:975] Creating default 'basic' HTTP authenticator for
realm 'mesos-agent-readwrite'
I0609 12:30:49.460852  4539 slave.cpp:552] Agent resources: cpus(*):2; mem(*):1024; disk(*):1024;
ports(*):[31000-32000]
I0609 12:30:49.460995  4539 slave.cpp:560] Agent attributes: [  ]
I0609 12:30:49.461016  4539 slave.cpp:565] Agent hostname: 35de0ee940af
I0609 12:30:49.461448  4533 status_update_manager.cpp:177] Pausing sending status updates
I0609 12:30:49.463627  4539 state.cpp:62] Recovering state from '/tmp/Endpoint_SlaveEndpointTest_NoAuthorizer_0_F5LDx6/meta'
I0609 12:30:49.464398  4535 status_update_manager.cpp:203] Recovering status update manager
I0609 12:30:49.464640  4535 containerizer.cpp:582] Recovering containerizer
I0609 12:30:49.466791  4538 provisioner.cpp:416] Provisioner recovery complete
I0609 12:30:49.467566  4535 slave.cpp:6127] Finished recovery
I0609 12:30:49.468299  4535 slave.cpp:6309] Querying resource estimator for oversubscribable
resources
I0609 12:30:49.468757  4538 slave.cpp:6323] Received oversubscribable resources {} from the
resource estimator
I0609 12:30:49.473047  4534 process.cpp:3778] Handling HTTP event for process 'slave(760)'
with path: '/slave(760)/monitor/statistics'
I0609 12:30:49.475255  4537 http.cpp:1115] HTTP GET for /slave(760)/monitor/statistics from
172.17.0.2:34490
I0609 12:30:49.475414  4537 http.cpp:936] Authorizing principal 'test-principal' to GET the
'/monitor/statistics' endpoint
I0609 12:30:49.481933  4513 slave.cpp:817] Agent terminating
[       OK ] Endpoint/SlaveEndpointTest.NoAuthorizer/0 (55 ms)
[ RUN      ] Endpoint/SlaveEndpointTest.NoAuthorizer/1
I0609 12:30:49.505822  4513 containerizer.cpp:230] Using isolation: posix/cpu,posix/mem,filesystem/posix,network/cni,environment_secret
W0609 12:30:49.506810  4513 backend.cpp:76] Failed to create 'overlay' backend: OverlayBackend
requires root privileges
W0609 12:30:49.507150  4513 backend.cpp:76] Failed to create 'bind' backend: BindBackend requires
root privileges
I0609 12:30:49.507262  4513 provisioner.cpp:255] Using default backend 'copy'
I0609 12:30:49.510025  4513 cluster.cpp:448] Creating default 'local' authorizer
I0609 12:30:49.513455  4537 slave.cpp:248] Mesos agent started on (761)@172.17.0.2:36085
I0609 12:30:49.513530  4537 slave.cpp:249] Flags at startup: --acls="" --appc_simple_discovery_uri_prefix="http://"
--appc_store_dir="/tmp/Endpoint_SlaveEndpointTest_NoAuthorizer_1_sE04Nd/store/appc" --authenticate_http_readonly="true"
--authenticate_http_readwrite="true" --authenticatee="crammd5" --authentication_backoff_factor="1secs"
--authorizer="local" --cgroups_cpu_enable_pids_and_tids_count="false" --cgroups_enable_cfs="false"
--cgroups_hierarchy="/sys/fs/cgroup" --cgroups_limit_swap="false" --cgroups_root="mesos" --container_disk_watch_interval="15secs"
--containerizers="mesos" --credential="/tmp/Endpoint_SlaveEndpointTest_NoAuthorizer_1_sE04Nd/credential"
--default_role="*" --disk_watch_interval="1mins" --docker="docker" --docker_kill_orphans="true"
--docker_registry="https://registry-1.docker.io" --docker_remove_delay="6hrs" --docker_socket="/var/run/docker.sock"
--docker_stop_timeout="0ns" --docker_store_dir="/tmp/Endpoint_SlaveEndpointTest_NoAuthorizer_1_sE04Nd/store/docker"
--docker_volume_checkpoint_dir="/var/run/mesos/isolators/docker/volume" --enforce_container_disk_quota="false"
--executor_registration_timeout="1mins" --executor_reregistration_timeout="2secs" --executor_shutdown_grace_period="5secs"
--fetcher_cache_dir="/tmp/Endpoint_SlaveEndpointTest_NoAuthorizer_1_sE04Nd/fetch" --fetcher_cache_size="2GB"
--frameworks_home="" --gc_delay="1weeks" --gc_disk_headroom="0.1" --hadoop_home="" --help="false"
--hostname_lookup="true" --http_command_executor="false" --http_credentials="/tmp/Endpoint_SlaveEndpointTest_NoAuthorizer_1_sE04Nd/http_credentials"
--http_heartbeat_interval="30secs" --initialize_driver_logging="true" --isolation="posix/cpu,posix/mem"
--launcher="posix" --launcher_dir="/mesos/mesos-1.4.0/_build/src" --logbufsecs="0" --logging_level="INFO"
--max_completed_executors_per_framework="150" --oversubscribed_resources_interval="15secs"
--perf_duration="10secs" --perf_interval="1mins" --port="5051" --qos_correction_interval_min="0ns"
--quiet="false" --recover="reconnect" --recovery_timeout="15mins" --registration_backoff_factor="10ms"
--resources="cpus:2;gpus:0;mem:1024;disk:1024;ports:[31000-32000]" --revocable_cpu_low_priority="true"
--runtime_dir="/tmp/Endpoint_SlaveEndpointTest_NoAuthorizer_1_sE04Nd" --sandbox_directory="/mnt/mesos/sandbox"
--strict="true" --switch_user="true" --systemd_enable_support="true" --systemd_runtime_directory="/run/systemd/system"
--version="false" --work_dir="/tmp/Endpoint_SlaveEndpointTest_NoAuthorizer_1_Lsz0ic"
I0609 12:30:49.514331  4537 credentials.hpp:86] Loading credential for authentication from
'/tmp/Endpoint_SlaveEndpointTest_NoAuthorizer_1_sE04Nd/credential'
I0609 12:30:49.514724  4537 slave.cpp:281] Agent using credential for: test-principal
I0609 12:30:49.514794  4537 credentials.hpp:37] Loading credentials for authentication from
'/tmp/Endpoint_SlaveEndpointTest_NoAuthorizer_1_sE04Nd/http_credentials'
I0609 12:30:49.515275  4537 http.cpp:975] Creating default 'basic' HTTP authenticator for
realm 'mesos-agent-readonly'
I0609 12:30:49.515585  4537 http.cpp:975] Creating default 'basic' HTTP authenticator for
realm 'mesos-agent-readwrite'
I0609 12:30:49.517712  4537 slave.cpp:552] Agent resources: cpus(*):2; mem(*):1024; disk(*):1024;
ports(*):[31000-32000]
I0609 12:30:49.517899  4537 slave.cpp:560] Agent attributes: [  ]
I0609 12:30:49.517982  4537 slave.cpp:565] Agent hostname: 35de0ee940af
I0609 12:30:49.518309  4535 status_update_manager.cpp:177] Pausing sending status updates
I0609 12:30:49.520213  4539 state.cpp:62] Recovering state from '/tmp/Endpoint_SlaveEndpointTest_NoAuthorizer_1_Lsz0ic/meta'
I0609 12:30:49.520665  4537 status_update_manager.cpp:203] Recovering status update manager
I0609 12:30:49.521064  4538 containerizer.cpp:582] Recovering containerizer
I0609 12:30:49.523541  4537 provisioner.cpp:416] Provisioner recovery complete
I0609 12:30:49.524441  4535 slave.cpp:6127] Finished recovery
I0609 12:30:49.525055  4535 slave.cpp:6309] Querying resource estimator for oversubscribable
resources
I0609 12:30:49.525529  4537 slave.cpp:6323] Received oversubscribable resources {} from the
resource estimator
I0609 12:30:49.529916  4534 process.cpp:3778] Handling HTTP event for process 'slave(761)'
with path: '/slave(761)/monitor/statistics.json'
I0609 12:30:49.532001  4535 http.cpp:1115] HTTP GET for /slave(761)/monitor/statistics.json
from 172.17.0.2:34492
I0609 12:30:49.532126  4535 http.cpp:936] Authorizing principal 'test-principal' to GET the
'/monitor/statistics.json' endpoint
I0609 12:30:49.537716  4534 slave.cpp:817] Agent terminating
[       OK ] Endpoint/SlaveEndpointTest.NoAuthorizer/1 (48 ms)
[ RUN      ] Endpoint/SlaveEndpointTest.NoAuthorizer/2
I0609 12:30:49.554081  4513 containerizer.cpp:230] Using isolation: posix/cpu,posix/mem,filesystem/posix,network/cni,environment_secret
W0609 12:30:49.554970  4513 backend.cpp:76] Failed to create 'overlay' backend: OverlayBackend
requires root privileges
W0609 12:30:49.555270  4513 backend.cpp:76] Failed to create 'bind' backend: BindBackend requires
root privileges
I0609 12:30:49.555378  4513 provisioner.cpp:255] Using default backend 'copy'
I0609 12:30:49.558078  4513 cluster.cpp:448] Creating default 'local' authorizer
I0609 12:30:49.561825  4533 slave.cpp:248] Mesos agent started on (762)@172.17.0.2:36085
I0609 12:30:49.561868  4533 slave.cpp:249] Flags at startup: --acls="" --appc_simple_discovery_uri_prefix="http://"
--appc_store_dir="/tmp/Endpoint_SlaveEndpointTest_NoAuthorizer_2_ujWnfk/store/appc" --authenticate_http_readonly="true"
--authenticate_http_readwrite="true" --authenticatee="crammd5" --authentication_backoff_factor="1secs"
--authorizer="local" --cgroups_cpu_enable_pids_and_tids_count="false" --cgroups_enable_cfs="false"
--cgroups_hierarchy="/sys/fs/cgroup" --cgroups_limit_swap="false" --cgroups_root="mesos" --container_disk_watch_interval="15secs"
--containerizers="mesos" --credential="/tmp/Endpoint_SlaveEndpointTest_NoAuthorizer_2_ujWnfk/credential"
--default_role="*" --disk_watch_interval="1mins" --docker="docker" --docker_kill_orphans="true"
--docker_registry="https://registry-1.docker.io" --docker_remove_delay="6hrs" --docker_socket="/var/run/docker.sock"
--docker_stop_timeout="0ns" --docker_store_dir="/tmp/Endpoint_SlaveEndpointTest_NoAuthorizer_2_ujWnfk/store/docker"
--docker_volume_checkpoint_dir="/var/run/mesos/isolators/docker/volume" --enforce_container_disk_quota="false"
--executor_registration_timeout="1mins" --executor_reregistration_timeout="2secs" --executor_shutdown_grace_period="5secs"
--fetcher_cache_dir="/tmp/Endpoint_SlaveEndpointTest_NoAuthorizer_2_ujWnfk/fetch" --fetcher_cache_size="2GB"
--frameworks_home="" --gc_delay="1weeks" --gc_disk_headroom="0.1" --hadoop_home="" --help="false"
--hostname_lookup="true" --http_command_executor="false" --http_credentials="/tmp/Endpoint_SlaveEndpointTest_NoAuthorizer_2_ujWnfk/http_credentials"
--http_heartbeat_interval="30secs" --initialize_driver_logging="true" --isolation="posix/cpu,posix/mem"
--launcher="posix" --launcher_dir="/mesos/mesos-1.4.0/_build/src" --logbufsecs="0" --logging_level="INFO"
--max_completed_executors_per_framework="150" --oversubscribed_resources_interval="15secs"
--perf_duration="10secs" --perf_interval="1mins" --port="5051" --qos_correction_interval_min="0ns"
--quiet="false" --recover="reconnect" --recovery_timeout="15mins" --registration_backoff_factor="10ms"
--resources="cpus:2;gpus:0;mem:1024;disk:1024;ports:[31000-32000]" --revocable_cpu_low_priority="true"
--runtime_dir="/tmp/Endpoint_SlaveEndpointTest_NoAuthorizer_2_ujWnfk" --sandbox_directory="/mnt/mesos/sandbox"
--strict="true" --switch_user="true" --systemd_enable_support="true" --systemd_runtime_directory="/run/systemd/system"
--version="false" --work_dir="/tmp/Endpoint_SlaveEndpointTest_NoAuthorizer_2_zQrrCi"
I0609 12:30:49.564491  4533 credentials.hpp:86] Loading credential for authentication from
'/tmp/Endpoint_SlaveEndpointTest_NoAuthorizer_2_ujWnfk/credential'
I0609 12:30:49.564759  4533 slave.cpp:281] Agent using credential for: test-principal
I0609 12:30:49.564786  4533 credentials.hpp:37] Loading credentials for authentication from
'/tmp/Endpoint_SlaveEndpointTest_NoAuthorizer_2_ujWnfk/http_credentials'
I0609 12:30:49.565150  4533 http.cpp:975] Creating default 'basic' HTTP authenticator for
realm 'mesos-agent-readonly'
I0609 12:30:49.565384  4533 http.cpp:975] Creating default 'basic' HTTP authenticator for
realm 'mesos-agent-readwrite'
I0609 12:30:49.567358  4533 slave.cpp:552] Agent resources: cpus(*):2; mem(*):1024; disk(*):1024;
ports(*):[31000-32000]
I0609 12:30:49.567494  4533 slave.cpp:560] Agent attributes: [  ]
I0609 12:30:49.567513  4533 slave.cpp:565] Agent hostname: 35de0ee940af
I0609 12:30:49.567767  4537 status_update_manager.cpp:177] Pausing sending status updates
I0609 12:30:49.570236  4536 state.cpp:62] Recovering state from '/tmp/Endpoint_SlaveEndpointTest_NoAuthorizer_2_zQrrCi/meta'
I0609 12:30:49.571136  4536 status_update_manager.cpp:203] Recovering status update manager
I0609 12:30:49.571547  4536 containerizer.cpp:582] Recovering containerizer
I0609 12:30:49.574779  4536 provisioner.cpp:416] Provisioner recovery complete
I0609 12:30:49.575676  4534 slave.cpp:6127] Finished recovery
I0609 12:30:49.576602  4534 slave.cpp:6309] Querying resource estimator for oversubscribable
resources
I0609 12:30:49.577152  4532 slave.cpp:6323] Received oversubscribable resources {} from the
resource estimator
I0609 12:30:49.581553  4532 process.cpp:3778] Handling HTTP event for process 'slave(762)'
with path: '/slave(762)/containers'
I0609 12:30:49.583689  4538 http.cpp:1115] HTTP GET for /slave(762)/containers from 172.17.0.2:34498
I0609 12:30:49.583909  4538 http.cpp:936] Authorizing principal 'test-principal' to GET the
'/containers' endpoint
I0609 12:30:49.589078  4533 slave.cpp:817] Agent terminating
[       OK ] Endpoint/SlaveEndpointTest.NoAuthorizer/2 (50 ms)
[----------] 9 tests from Endpoint/SlaveEndpointTest (442 ms total)

[----------] Global test environment tear-down
[==========] 1589 tests from 176 test cases ran. (711386 ms total)
[  PASSED  ] 1585 tests.
[  FAILED  ] 4 tests, listed below:
[  FAILED  ] DefaultExecutorCheckTest.CommandCheckDeliveredAndReconciled
[  FAILED  ] DefaultExecutorCheckTest.CommandCheckStatusChange
[  FAILED  ] DefaultExecutorCheckTest.CommandCheckSeesParentsEnv
[  FAILED  ] DefaultExecutorCheckTest.CommandCheckSharesWorkDirWithTask

 4 FAILED TESTS
  YOU HAVE 22 DISABLED TESTS

E0609 12:30:49.734573  4540 process.cpp:968] Failed to accept socket: future discarded
make[4]: *** [check-local] Error 1
make[4]: Leaving directory `/mesos/mesos-1.4.0/_build/src'
make[3]: *** [check-am] Error 2
make[3]: Leaving directory `/mesos/mesos-1.4.0/_build/src'
make[2]: *** [check] Error 2
make[2]: Leaving directory `/mesos/mesos-1.4.0/_build/src'
make[1]: *** [check-recursive] Error 1
make[1]: Leaving directory `/mesos/mesos-1.4.0/_build'
make: *** [distcheck] Error 1
+ docker rmi mesos-1497005681-25230
Untagged: mesos-1497005681-25230:latest
Deleted: sha256:c008a61c3ec46957500b48e6b5211feac40552bc180d08610bbbf0ffc1936e19
Deleted: sha256:5d94333ce0ffd59b20f6cc9c5e93b1b95d526f45c48914bc0c7e79e4c5b691ca
Deleted: sha256:38aa33f6414ac39281dc96d7a959866213a63aa6b7c0aa5e2b475714c5b6dcc4
Deleted: sha256:1b564805cc7163af202d656c9e34c4a0293d934065f81f68aafdb7e705435490
Deleted: sha256:be157047b2beca6091441abd61e0ff364199e9719aa13fc602870e165e371668
Deleted: sha256:fc6e0714d9b4d8eb320058e782b1b9950a17c66691f74fd475b5935b9cdd0cdc
Deleted: sha256:cc54339f8ee03a9ecbee8adda88491c87be7d457577ce39c0863d67866aefb99
Deleted: sha256:5ef395afea8338e9bb694fd8171d34d8b661269a6b5b64d6cdf7fbcc2c52ecea
Deleted: sha256:80f83b66c2e22946de113688302b8c77ca8a24b9a6ec37f6817dea2952518455
Deleted: sha256:115cfa5c53ee73633710e73971ee9e57272b70bff8eb2d08993f3311ec576870
Deleted: sha256:1d8723630726ff4d1a31a1f24359514bf7aeef4b8289e600d7f0e44adad04869
Deleted: sha256:79e4d33dd3788d6af26d39bf2604ad6ce4f94b2362da2bb857c143ef4bedab8a
Deleted: sha256:d23229b39782f53ab37b71c203c113934e07cf087ecafeda37aba04e1537eb19
Deleted: sha256:3e4cadc557417b487647e5411593720974dab1f77c25c7472a8618e3b80e4d31
Deleted: sha256:980859d99944b3bee42c168f1d4c717f48a21a0c36a0b0f33388b0c065ca1563
Deleted: sha256:cf2857112b2a9114b1bd1f28f531ab589f27506cba2ee1f4157ce576eeafd3a5
Deleted: sha256:1b49f4cfd832dd7335f2f38ea27dfc2496110d7b4c654a4ee8dd692685c75727
Deleted: sha256:5df6ef7ee26271d00fea020e3116e81d8ec0542879d20b86599e91de3f4b77b0
Deleted: sha256:b30916ce54cb2fddec2a6e64dec4af9b7a463143d29612482873d1266dd4d987
Deleted: sha256:1b06ef5f6573ccd86b0313b5946f1a5c933f6c8227811593d087730dd1d082dd
Deleted: sha256:7c32cb768671e2e58d8b0b01a92ee93eeb954dfbaee7622f80d71727b1f93a39
Deleted: sha256:3b9a45a41f50a32ca019f307040e8190bff2d7d3fd8dcb7a6e1f750ff53de77f
Deleted: sha256:75367ae77bc8fde4a94194e73b21554fe3c67f5f3d49483a2fc1904239e130ae
Deleted: sha256:c90443e24766f6b4d6ac2d43b52dccf2fe15e68805ee7e59dcfa0148ce22fb3d
Build step 'Execute shell' marked build as failure

Mime
View raw message