mesos-builds mailing list archives

Site index · List index
Message view « Date » · « Thread »
Top « Date » · « Thread »
From Apache Jenkins Server <jenk...@builds.apache.org>
Subject Build failed in Jenkins: Mesos-Buildbot » cmake,gcc,--verbose,GLOG_v=1 MESOS_VERBOSE=1,centos:7,(ubuntu)&&(!ubuntu-us1)&&(!ubuntu-eu2) #3793
Date Wed, 14 Jun 2017 01:47:04 GMT
See <https://builds.apache.org/job/Mesos-Buildbot/BUILDTOOL=cmake,COMPILER=gcc,CONFIGURATION=--verbose,ENVIRONMENT=GLOG_v=1%20MESOS_VERBOSE=1,OS=centos%3A7,label_exp=(ubuntu)&&(!ubuntu-us1)&&(!ubuntu-eu2)/3793/display/redirect?page=changes>

Changes:

[mcypark] Introduced method `Resources::allocatableTo` to aggregate reservations.

[mcypark] Enabled allocator to handle hierarchical reservation.

[mcypark] Added a test for hierarchical reservation.

[mcypark] Updated a test subtly dependent on implementation-defined behavior.

[mpark] Added `HIERARCHICAL_ROLE` agent capability.

------------------------------------------
[...truncated 26.11 MB...]
I0614 01:46:57.959230 31483 slave.cpp:817] Agent terminating
[       OK ] Endpoint/SlaveEndpointTest.AuthorizedRequest/1 (30 ms)
[ RUN      ] Endpoint/SlaveEndpointTest.AuthorizedRequest/2
I0614 01:46:57.970962 31465 containerizer.cpp:230] Using isolation: posix/cpu,posix/mem,filesystem/posix,network/cni,environment_secret
W0614 01:46:57.971493 31465 backend.cpp:76] Failed to create 'aufs' backend: AufsBackend requires
root privileges
W0614 01:46:57.971609 31465 backend.cpp:76] Failed to create 'bind' backend: BindBackend requires
root privileges
I0614 01:46:57.971652 31465 provisioner.cpp:255] Using default backend 'copy'
I0614 01:46:57.975330 31470 slave.cpp:248] Mesos agent started on (755)@172.17.0.4:35700
I0614 01:46:57.975349 31470 slave.cpp:249] Flags at startup: --acls="" --appc_simple_discovery_uri_prefix="http://"
--appc_store_dir="/tmp/Endpoint_SlaveEndpointTest_AuthorizedRequest_2_qFbYZ6/store/appc" --authenticate_http_readonly="true"
--authenticate_http_readwrite="true" --authenticatee="crammd5" --authentication_backoff_factor="1secs"
--authorizer="local" --cgroups_cpu_enable_pids_and_tids_count="false" --cgroups_enable_cfs="false"
--cgroups_hierarchy="/sys/fs/cgroup" --cgroups_limit_swap="false" --cgroups_root="mesos" --container_disk_watch_interval="15secs"
--containerizers="mesos" --credential="/tmp/Endpoint_SlaveEndpointTest_AuthorizedRequest_2_qFbYZ6/credential"
--default_role="*" --disk_watch_interval="1mins" --docker="docker" --docker_kill_orphans="true"
--docker_registry="https://registry-1.docker.io" --docker_remove_delay="6hrs" --docker_socket="/var/run/docker.sock"
--docker_stop_timeout="0ns" --docker_store_dir="/tmp/Endpoint_SlaveEndpointTest_AuthorizedRequest_2_qFbYZ6/store/docker"
--docker_volume_checkpoint_dir="/var/run/mesos/isolators/docker/volume" --enforce_container_disk_quota="false"
--executor_registration_timeout="1mins" --executor_reregistration_timeout="2secs" --executor_shutdown_grace_period="5secs"
--fetcher_cache_dir="/tmp/Endpoint_SlaveEndpointTest_AuthorizedRequest_2_qFbYZ6/fetch" --fetcher_cache_size="2GB"
--frameworks_home="" --gc_delay="1weeks" --gc_disk_headroom="0.1" --hadoop_home="" --help="false"
--hostname_lookup="true" --http_command_executor="false" --http_credentials="/tmp/Endpoint_SlaveEndpointTest_AuthorizedRequest_2_qFbYZ6/http_credentials"
--http_heartbeat_interval="30secs" --initialize_driver_logging="true" --isolation="posix/cpu,posix/mem"
--launcher="posix" --launcher_dir="/mesos/build/src" --logbufsecs="0" --logging_level="INFO"
--max_completed_executors_per_framework="150" --oversubscribed_resources_interval="15secs"
--perf_duration="10secs" --perf_interval="1mins" --port="5051" --qos_correction_interval_min="0ns"
--quiet="false" --recover="reconnect" --recovery_timeout="15mins" --registration_backoff_factor="10ms"
--resources="cpus:2;gpus:0;mem:1024;disk:1024;ports:[31000-32000]" --revocable_cpu_low_priority="true"
--runtime_dir="/tmp/Endpoint_SlaveEndpointTest_AuthorizedRequest_2_qFbYZ6" --sandbox_directory="/mnt/mesos/sandbox"
--strict="true" --switch_user="true" --systemd_enable_support="true" --systemd_runtime_directory="/run/systemd/system"
--version="false" --work_dir="/tmp/Endpoint_SlaveEndpointTest_AuthorizedRequest_2_dZZDo1"
I0614 01:46:57.975747 31470 credentials.hpp:86] Loading credential for authentication from
'/tmp/Endpoint_SlaveEndpointTest_AuthorizedRequest_2_qFbYZ6/credential'
I0614 01:46:57.975899 31470 slave.cpp:281] Agent using credential for: test-principal
I0614 01:46:57.975919 31470 credentials.hpp:37] Loading credentials for authentication from
'/tmp/Endpoint_SlaveEndpointTest_AuthorizedRequest_2_qFbYZ6/http_credentials'
I0614 01:46:57.976133 31470 http.cpp:975] Creating default 'basic' HTTP authenticator for
realm 'mesos-agent-readonly'
I0614 01:46:57.976294 31470 http.cpp:975] Creating default 'basic' HTTP authenticator for
realm 'mesos-agent-readwrite'
I0614 01:46:57.977759 31470 slave.cpp:552] Agent resources: cpus(*):2; mem(*):1024; disk(*):1024;
ports(*):[31000-32000]
I0614 01:46:57.977835 31470 slave.cpp:560] Agent attributes: [  ]
I0614 01:46:57.977852 31470 slave.cpp:565] Agent hostname: 506c5f02475c
I0614 01:46:57.978010 31467 status_update_manager.cpp:177] Pausing sending status updates
I0614 01:46:57.979457 31471 state.cpp:62] Recovering state from '/tmp/Endpoint_SlaveEndpointTest_AuthorizedRequest_2_dZZDo1/meta'
I0614 01:46:57.979800 31469 status_update_manager.cpp:203] Recovering status update manager
I0614 01:46:57.980139 31489 containerizer.cpp:582] Recovering containerizer
I0614 01:46:57.981403 31487 provisioner.cpp:416] Provisioner recovery complete
I0614 01:46:57.981791 31468 slave.cpp:6127] Finished recovery
I0614 01:46:57.982305 31468 slave.cpp:6309] Querying resource estimator for oversubscribable
resources
I0614 01:46:57.982576 31466 slave.cpp:6323] Received oversubscribable resources {} from the
resource estimator
I0614 01:46:57.985043 31489 process.cpp:3778] Handling HTTP event for process 'slave(755)'
with path: '/slave(755)/containers'
I0614 01:46:57.986294 31468 http.cpp:1115] HTTP GET for /slave(755)/containers from 172.17.0.4:41052
I0614 01:46:57.986379 31468 http.cpp:936] Authorizing principal 'test-principal' to GET the
'/containers' endpoint
I0614 01:46:57.990317 31467 slave.cpp:817] Agent terminating
[       OK ] Endpoint/SlaveEndpointTest.AuthorizedRequest/2 (30 ms)
[ RUN      ] Endpoint/SlaveEndpointTest.UnauthorizedRequest/0
I0614 01:46:58.001013 31465 containerizer.cpp:230] Using isolation: posix/cpu,posix/mem,filesystem/posix,network/cni,environment_secret
W0614 01:46:58.001514 31465 backend.cpp:76] Failed to create 'aufs' backend: AufsBackend requires
root privileges
W0614 01:46:58.001605 31465 backend.cpp:76] Failed to create 'bind' backend: BindBackend requires
root privileges
I0614 01:46:58.001631 31465 provisioner.cpp:255] Using default backend 'copy'
I0614 01:46:58.004942 31479 slave.cpp:248] Mesos agent started on (756)@172.17.0.4:35700
I0614 01:46:58.004966 31479 slave.cpp:249] Flags at startup: --acls="" --appc_simple_discovery_uri_prefix="http://"
--appc_store_dir="/tmp/Endpoint_SlaveEndpointTest_UnauthorizedRequest_0_sbtxEt/store/appc"
--authenticate_http_readonly="true" --authenticate_http_readwrite="true" --authenticatee="crammd5"
--authentication_backoff_factor="1secs" --authorizer="local" --cgroups_cpu_enable_pids_and_tids_count="false"
--cgroups_enable_cfs="false" --cgroups_hierarchy="/sys/fs/cgroup" --cgroups_limit_swap="false"
--cgroups_root="mesos" --container_disk_watch_interval="15secs" --containerizers="mesos" --credential="/tmp/Endpoint_SlaveEndpointTest_UnauthorizedRequest_0_sbtxEt/credential"
--default_role="*" --disk_watch_interval="1mins" --docker="docker" --docker_kill_orphans="true"
--docker_registry="https://registry-1.docker.io" --docker_remove_delay="6hrs" --docker_socket="/var/run/docker.sock"
--docker_stop_timeout="0ns" --docker_store_dir="/tmp/Endpoint_SlaveEndpointTest_UnauthorizedRequest_0_sbtxEt/store/docker"
--docker_volume_checkpoint_dir="/var/run/mesos/isolators/docker/volume" --enforce_container_disk_quota="false"
--executor_registration_timeout="1mins" --executor_reregistration_timeout="2secs" --executor_shutdown_grace_period="5secs"
--fetcher_cache_dir="/tmp/Endpoint_SlaveEndpointTest_UnauthorizedRequest_0_sbtxEt/fetch" --fetcher_cache_size="2GB"
--frameworks_home="" --gc_delay="1weeks" --gc_disk_headroom="0.1" --hadoop_home="" --help="false"
--hostname_lookup="true" --http_command_executor="false" --http_credentials="/tmp/Endpoint_SlaveEndpointTest_UnauthorizedRequest_0_sbtxEt/http_credentials"
--http_heartbeat_interval="30secs" --initialize_driver_logging="true" --isolation="posix/cpu,posix/mem"
--launcher="posix" --launcher_dir="/mesos/build/src" --logbufsecs="0" --logging_level="INFO"
--max_completed_executors_per_framework="150" --oversubscribed_resources_interval="15secs"
--perf_duration="10secs" --perf_interval="1mins" --port="5051" --qos_correction_interval_min="0ns"
--quiet="false" --recover="reconnect" --recovery_timeout="15mins" --registration_backoff_factor="10ms"
--resources="cpus:2;gpus:0;mem:1024;disk:1024;ports:[31000-32000]" --revocable_cpu_low_priority="true"
--runtime_dir="/tmp/Endpoint_SlaveEndpointTest_UnauthorizedRequest_0_sbtxEt" --sandbox_directory="/mnt/mesos/sandbox"
--strict="true" --switch_user="true" --systemd_enable_support="true" --systemd_runtime_directory="/run/systemd/system"
--version="false" --work_dir="/tmp/Endpoint_SlaveEndpointTest_UnauthorizedRequest_0_ng6HYn"
I0614 01:46:58.005388 31479 credentials.hpp:86] Loading credential for authentication from
'/tmp/Endpoint_SlaveEndpointTest_UnauthorizedRequest_0_sbtxEt/credential'
I0614 01:46:58.005579 31479 slave.cpp:281] Agent using credential for: test-principal
I0614 01:46:58.005596 31479 credentials.hpp:37] Loading credentials for authentication from
'/tmp/Endpoint_SlaveEndpointTest_UnauthorizedRequest_0_sbtxEt/http_credentials'
I0614 01:46:58.005810 31479 http.cpp:975] Creating default 'basic' HTTP authenticator for
realm 'mesos-agent-readonly'
I0614 01:46:58.005959 31479 http.cpp:975] Creating default 'basic' HTTP authenticator for
realm 'mesos-agent-readwrite'
I0614 01:46:58.007351 31479 slave.cpp:552] Agent resources: cpus(*):2; mem(*):1024; disk(*):1024;
ports(*):[31000-32000]
I0614 01:46:58.007422 31479 slave.cpp:560] Agent attributes: [  ]
I0614 01:46:58.007433 31479 slave.cpp:565] Agent hostname: 506c5f02475c
I0614 01:46:58.007606 31485 status_update_manager.cpp:177] Pausing sending status updates
I0614 01:46:58.009091 31468 state.cpp:62] Recovering state from '/tmp/Endpoint_SlaveEndpointTest_UnauthorizedRequest_0_ng6HYn/meta'
I0614 01:46:58.009464 31468 status_update_manager.cpp:203] Recovering status update manager
I0614 01:46:58.009662 31487 containerizer.cpp:582] Recovering containerizer
I0614 01:46:58.011096 31475 provisioner.cpp:416] Provisioner recovery complete
I0614 01:46:58.011549 31477 slave.cpp:6127] Finished recovery
I0614 01:46:58.012017 31477 slave.cpp:6309] Querying resource estimator for oversubscribable
resources
I0614 01:46:58.012328 31484 slave.cpp:6323] Received oversubscribable resources {} from the
resource estimator
I0614 01:46:58.014847 31486 process.cpp:3778] Handling HTTP event for process 'slave(756)'
with path: '/slave(756)/monitor/statistics'
I0614 01:46:58.016041 31485 http.cpp:1115] HTTP GET for /slave(756)/monitor/statistics from
172.17.0.4:41054
I0614 01:46:58.016122 31485 http.cpp:936] Authorizing principal 'test-principal' to GET the
'/monitor/statistics' endpoint
I0614 01:46:58.018342 31471 slave.cpp:817] Agent terminating
[       OK ] Endpoint/SlaveEndpointTest.UnauthorizedRequest/0 (27 ms)
[ RUN      ] Endpoint/SlaveEndpointTest.UnauthorizedRequest/1
I0614 01:46:58.028394 31465 containerizer.cpp:230] Using isolation: posix/cpu,posix/mem,filesystem/posix,network/cni,environment_secret
W0614 01:46:58.028880 31465 backend.cpp:76] Failed to create 'aufs' backend: AufsBackend requires
root privileges
W0614 01:46:58.028967 31465 backend.cpp:76] Failed to create 'bind' backend: BindBackend requires
root privileges
I0614 01:46:58.029002 31465 provisioner.cpp:255] Using default backend 'copy'
I0614 01:46:58.032838 31473 slave.cpp:248] Mesos agent started on (757)@172.17.0.4:35700
I0614 01:46:58.032862 31473 slave.cpp:249] Flags at startup: --acls="" --appc_simple_discovery_uri_prefix="http://"
--appc_store_dir="/tmp/Endpoint_SlaveEndpointTest_UnauthorizedRequest_1_oqvMzQ/store/appc"
--authenticate_http_readonly="true" --authenticate_http_readwrite="true" --authenticatee="crammd5"
--authentication_backoff_factor="1secs" --authorizer="local" --cgroups_cpu_enable_pids_and_tids_count="false"
--cgroups_enable_cfs="false" --cgroups_hierarchy="/sys/fs/cgroup" --cgroups_limit_swap="false"
--cgroups_root="mesos" --container_disk_watch_interval="15secs" --containerizers="mesos" --credential="/tmp/Endpoint_SlaveEndpointTest_UnauthorizedRequest_1_oqvMzQ/credential"
--default_role="*" --disk_watch_interval="1mins" --docker="docker" --docker_kill_orphans="true"
--docker_registry="https://registry-1.docker.io" --docker_remove_delay="6hrs" --docker_socket="/var/run/docker.sock"
--docker_stop_timeout="0ns" --docker_store_dir="/tmp/Endpoint_SlaveEndpointTest_UnauthorizedRequest_1_oqvMzQ/store/docker"
--docker_volume_checkpoint_dir="/var/run/mesos/isolators/docker/volume" --enforce_container_disk_quota="false"
--executor_registration_timeout="1mins" --executor_reregistration_timeout="2secs" --executor_shutdown_grace_period="5secs"
--fetcher_cache_dir="/tmp/Endpoint_SlaveEndpointTest_UnauthorizedRequest_1_oqvMzQ/fetch" --fetcher_cache_size="2GB"
--frameworks_home="" --gc_delay="1weeks" --gc_disk_headroom="0.1" --hadoop_home="" --help="false"
--hostname_lookup="true" --http_command_executor="false" --http_credentials="/tmp/Endpoint_SlaveEndpointTest_UnauthorizedRequest_1_oqvMzQ/http_credentials"
--http_heartbeat_interval="30secs" --initialize_driver_logging="true" --isolation="posix/cpu,posix/mem"
--launcher="posix" --launcher_dir="/mesos/build/src" --logbufsecs="0" --logging_level="INFO"
--max_completed_executors_per_framework="150" --oversubscribed_resources_interval="15secs"
--perf_duration="10secs" --perf_interval="1mins" --port="5051" --qos_correction_interval_min="0ns"
--quiet="false" --recover="reconnect" --recovery_timeout="15mins" --registration_backoff_factor="10ms"
--resources="cpus:2;gpus:0;mem:1024;disk:1024;ports:[31000-32000]" --revocable_cpu_low_priority="true"
--runtime_dir="/tmp/Endpoint_SlaveEndpointTest_UnauthorizedRequest_1_oqvMzQ" --sandbox_directory="/mnt/mesos/sandbox"
--strict="true" --switch_user="true" --systemd_enable_support="true" --systemd_runtime_directory="/run/systemd/system"
--version="false" --work_dir="/tmp/Endpoint_SlaveEndpointTest_UnauthorizedRequest_1_pGnSPK"
I0614 01:46:58.033265 31473 credentials.hpp:86] Loading credential for authentication from
'/tmp/Endpoint_SlaveEndpointTest_UnauthorizedRequest_1_oqvMzQ/credential'
I0614 01:46:58.033444 31473 slave.cpp:281] Agent using credential for: test-principal
I0614 01:46:58.033464 31473 credentials.hpp:37] Loading credentials for authentication from
'/tmp/Endpoint_SlaveEndpointTest_UnauthorizedRequest_1_oqvMzQ/http_credentials'
I0614 01:46:58.033684 31473 http.cpp:975] Creating default 'basic' HTTP authenticator for
realm 'mesos-agent-readonly'
I0614 01:46:58.033841 31473 http.cpp:975] Creating default 'basic' HTTP authenticator for
realm 'mesos-agent-readwrite'
I0614 01:46:58.035168 31473 slave.cpp:552] Agent resources: cpus(*):2; mem(*):1024; disk(*):1024;
ports(*):[31000-32000]
I0614 01:46:58.035241 31473 slave.cpp:560] Agent attributes: [  ]
I0614 01:46:58.035253 31473 slave.cpp:565] Agent hostname: 506c5f02475c
I0614 01:46:58.035369 31471 status_update_manager.cpp:177] Pausing sending status updates
I0614 01:46:58.036703 31475 state.cpp:62] Recovering state from '/tmp/Endpoint_SlaveEndpointTest_UnauthorizedRequest_1_pGnSPK/meta'
I0614 01:46:58.037012 31485 status_update_manager.cpp:203] Recovering status update manager
I0614 01:46:58.037302 31475 containerizer.cpp:582] Recovering containerizer
I0614 01:46:58.038991 31468 provisioner.cpp:416] Provisioner recovery complete
I0614 01:46:58.039450 31476 slave.cpp:6127] Finished recovery
I0614 01:46:58.039999 31476 slave.cpp:6309] Querying resource estimator for oversubscribable
resources
I0614 01:46:58.040354 31474 slave.cpp:6323] Received oversubscribable resources {} from the
resource estimator
I0614 01:46:58.042759 31482 process.cpp:3778] Handling HTTP event for process 'slave(757)'
with path: '/slave(757)/monitor/statistics.json'
I0614 01:46:58.043948 31487 http.cpp:1115] HTTP GET for /slave(757)/monitor/statistics.json
from 172.17.0.4:41058
I0614 01:46:58.044031 31487 http.cpp:936] Authorizing principal 'test-principal' to GET the
'/monitor/statistics.json' endpoint
I0614 01:46:58.046581 31482 slave.cpp:817] Agent terminating
[       OK ] Endpoint/SlaveEndpointTest.UnauthorizedRequest/1 (28 ms)
[ RUN      ] Endpoint/SlaveEndpointTest.UnauthorizedRequest/2
I0614 01:46:58.056919 31465 containerizer.cpp:230] Using isolation: posix/cpu,posix/mem,filesystem/posix,network/cni,environment_secret
W0614 01:46:58.057413 31465 backend.cpp:76] Failed to create 'aufs' backend: AufsBackend requires
root privileges
W0614 01:46:58.057502 31465 backend.cpp:76] Failed to create 'bind' backend: BindBackend requires
root privileges
I0614 01:46:58.057538 31465 provisioner.cpp:255] Using default backend 'copy'
I0614 01:46:58.060700 31482 slave.cpp:248] Mesos agent started on (758)@172.17.0.4:35700
I0614 01:46:58.060719 31482 slave.cpp:249] Flags at startup: --acls="" --appc_simple_discovery_uri_prefix="http://"
--appc_store_dir="/tmp/Endpoint_SlaveEndpointTest_UnauthorizedRequest_2_u1iVLd/store/appc"
--authenticate_http_readonly="true" --authenticate_http_readwrite="true" --authenticatee="crammd5"
--authentication_backoff_factor="1secs" --authorizer="local" --cgroups_cpu_enable_pids_and_tids_count="false"
--cgroups_enable_cfs="false" --cgroups_hierarchy="/sys/fs/cgroup" --cgroups_limit_swap="false"
--cgroups_root="mesos" --container_disk_watch_interval="15secs" --containerizers="mesos" --credential="/tmp/Endpoint_SlaveEndpointTest_UnauthorizedRequest_2_u1iVLd/credential"
--default_role="*" --disk_watch_interval="1mins" --docker="docker" --docker_kill_orphans="true"
--docker_registry="https://registry-1.docker.io" --docker_remove_delay="6hrs" --docker_socket="/var/run/docker.sock"
--docker_stop_timeout="0ns" --docker_store_dir="/tmp/Endpoint_SlaveEndpointTest_UnauthorizedRequest_2_u1iVLd/store/docker"
--docker_volume_checkpoint_dir="/var/run/mesos/isolators/docker/volume" --enforce_container_disk_quota="false"
--executor_registration_timeout="1mins" --executor_reregistration_timeout="2secs" --executor_shutdown_grace_period="5secs"
--fetcher_cache_dir="/tmp/Endpoint_SlaveEndpointTest_UnauthorizedRequest_2_u1iVLd/fetch" --fetcher_cache_size="2GB"
--frameworks_home="" --gc_delay="1weeks" --gc_disk_headroom="0.1" --hadoop_home="" --help="false"
--hostname_lookup="true" --http_command_executor="false" --http_credentials="/tmp/Endpoint_SlaveEndpointTest_UnauthorizedRequest_2_u1iVLd/http_credentials"
--http_heartbeat_interval="30secs" --initialize_driver_logging="true" --isolation="posix/cpu,posix/mem"
--launcher="posix" --launcher_dir="/mesos/build/src" --logbufsecs="0" --logging_level="INFO"
--max_completed_executors_per_framework="150" --oversubscribed_resources_interval="15secs"
--perf_duration="10secs" --perf_interval="1mins" --port="5051" --qos_correction_interval_min="0ns"
--quiet="false" --recover="reconnect" --recovery_timeout="15mins" --registration_backoff_factor="10ms"
--resources="cpus:2;gpus:0;mem:1024;disk:1024;ports:[31000-32000]" --revocable_cpu_low_priority="true"
--runtime_dir="/tmp/Endpoint_SlaveEndpointTest_UnauthorizedRequest_2_u1iVLd" --sandbox_directory="/mnt/mesos/sandbox"
--strict="true" --switch_user="true" --systemd_enable_support="true" --systemd_runtime_directory="/run/systemd/system"
--version="false" --work_dir="/tmp/Endpoint_SlaveEndpointTest_UnauthorizedRequest_2_FgILX7"
I0614 01:46:58.061100 31482 credentials.hpp:86] Loading credential for authentication from
'/tmp/Endpoint_SlaveEndpointTest_UnauthorizedRequest_2_u1iVLd/credential'
I0614 01:46:58.061242 31482 slave.cpp:281] Agent using credential for: test-principal
I0614 01:46:58.061259 31482 credentials.hpp:37] Loading credentials for authentication from
'/tmp/Endpoint_SlaveEndpointTest_UnauthorizedRequest_2_u1iVLd/http_credentials'
I0614 01:46:58.061462 31482 http.cpp:975] Creating default 'basic' HTTP authenticator for
realm 'mesos-agent-readonly'
I0614 01:46:58.061601 31482 http.cpp:975] Creating default 'basic' HTTP authenticator for
realm 'mesos-agent-readwrite'
I0614 01:46:58.062867 31482 slave.cpp:552] Agent resources: cpus(*):2; mem(*):1024; disk(*):1024;
ports(*):[31000-32000]
I0614 01:46:58.062937 31482 slave.cpp:560] Agent attributes: [  ]
I0614 01:46:58.062944 31482 slave.cpp:565] Agent hostname: 506c5f02475c
I0614 01:46:58.063110 31479 status_update_manager.cpp:177] Pausing sending status updates
I0614 01:46:58.064299 31489 state.cpp:62] Recovering state from '/tmp/Endpoint_SlaveEndpointTest_UnauthorizedRequest_2_FgILX7/meta'
I0614 01:46:58.064630 31475 status_update_manager.cpp:203] Recovering status update manager
I0614 01:46:58.065016 31475 containerizer.cpp:582] Recovering containerizer
I0614 01:46:58.066884 31484 provisioner.cpp:416] Provisioner recovery complete
I0614 01:46:58.067375 31471 slave.cpp:6127] Finished recovery
I0614 01:46:58.067843 31471 slave.cpp:6309] Querying resource estimator for oversubscribable
resources
I0614 01:46:58.068187 31476 slave.cpp:6323] Received oversubscribable resources {} from the
resource estimator
I0614 01:46:58.070788 31477 process.cpp:3778] Handling HTTP event for process 'slave(758)'
with path: '/slave(758)/containers'
I0614 01:46:58.072181 31466 http.cpp:1115] HTTP GET for /slave(758)/containers from 172.17.0.4:41060
I0614 01:46:58.072263 31466 http.cpp:936] Authorizing principal 'test-principal' to GET the
'/containers' endpoint
I0614 01:46:58.074412 31482 slave.cpp:817] Agent terminating
[       OK ] Endpoint/SlaveEndpointTest.UnauthorizedRequest/2 (28 ms)
[ RUN      ] Endpoint/SlaveEndpointTest.NoAuthorizer/0
I0614 01:46:58.086060 31465 containerizer.cpp:230] Using isolation: posix/cpu,posix/mem,filesystem/posix,network/cni,environment_secret
W0614 01:46:58.086683 31465 backend.cpp:76] Failed to create 'aufs' backend: AufsBackend requires
root privileges
W0614 01:46:58.086797 31465 backend.cpp:76] Failed to create 'bind' backend: BindBackend requires
root privileges
I0614 01:46:58.086843 31465 provisioner.cpp:255] Using default backend 'copy'
I0614 01:46:58.089496 31465 cluster.cpp:448] Creating default 'local' authorizer
I0614 01:46:58.091231 31479 slave.cpp:248] Mesos agent started on (759)@172.17.0.4:35700
I0614 01:46:58.091254 31479 slave.cpp:249] Flags at startup: --acls="" --appc_simple_discovery_uri_prefix="http://"
--appc_store_dir="/tmp/Endpoint_SlaveEndpointTest_NoAuthorizer_0_8k61eB/store/appc" --authenticate_http_readonly="true"
--authenticate_http_readwrite="true" --authenticatee="crammd5" --authentication_backoff_factor="1secs"
--authorizer="local" --cgroups_cpu_enable_pids_and_tids_count="false" --cgroups_enable_cfs="false"
--cgroups_hierarchy="/sys/fs/cgroup" --cgroups_limit_swap="false" --cgroups_root="mesos" --container_disk_watch_interval="15secs"
--containerizers="mesos" --credential="/tmp/Endpoint_SlaveEndpointTest_NoAuthorizer_0_8k61eB/credential"
--default_role="*" --disk_watch_interval="1mins" --docker="docker" --docker_kill_orphans="true"
--docker_registry="https://registry-1.docker.io" --docker_remove_delay="6hrs" --docker_socket="/var/run/docker.sock"
--docker_stop_timeout="0ns" --docker_store_dir="/tmp/Endpoint_SlaveEndpointTest_NoAuthorizer_0_8k61eB/store/docker"
--docker_volume_checkpoint_dir="/var/run/mesos/isolators/docker/volume" --enforce_container_disk_quota="false"
--executor_registration_timeout="1mins" --executor_reregistration_timeout="2secs" --executor_shutdown_grace_period="5secs"
--fetcher_cache_dir="/tmp/Endpoint_SlaveEndpointTest_NoAuthorizer_0_8k61eB/fetch" --fetcher_cache_size="2GB"
--frameworks_home="" --gc_delay="1weeks" --gc_disk_headroom="0.1" --hadoop_home="" --help="false"
--hostname_lookup="true" --http_command_executor="false" --http_credentials="/tmp/Endpoint_SlaveEndpointTest_NoAuthorizer_0_8k61eB/http_credentials"
--http_heartbeat_interval="30secs" --initialize_driver_logging="true" --isolation="posix/cpu,posix/mem"
--launcher="posix" --launcher_dir="/mesos/build/src" --logbufsecs="0" --logging_level="INFO"
--max_completed_executors_per_framework="150" --oversubscribed_resources_interval="15secs"
--perf_duration="10secs" --perf_interval="1mins" --port="5051" --qos_correction_interval_min="0ns"
--quiet="false" --recover="reconnect" --recovery_timeout="15mins" --registration_backoff_factor="10ms"
--resources="cpus:2;gpus:0;mem:1024;disk:1024;ports:[31000-32000]" --revocable_cpu_low_priority="true"
--runtime_dir="/tmp/Endpoint_SlaveEndpointTest_NoAuthorizer_0_8k61eB" --sandbox_directory="/mnt/mesos/sandbox"
--strict="true" --switch_user="true" --systemd_enable_support="true" --systemd_runtime_directory="/run/systemd/system"
--version="false" --work_dir="/tmp/Endpoint_SlaveEndpointTest_NoAuthorizer_0_vlPAmv"
I0614 01:46:58.091666 31479 credentials.hpp:86] Loading credential for authentication from
'/tmp/Endpoint_SlaveEndpointTest_NoAuthorizer_0_8k61eB/credential'
I0614 01:46:58.091814 31479 slave.cpp:281] Agent using credential for: test-principal
I0614 01:46:58.091837 31479 credentials.hpp:37] Loading credentials for authentication from
'/tmp/Endpoint_SlaveEndpointTest_NoAuthorizer_0_8k61eB/http_credentials'
I0614 01:46:58.092054 31479 http.cpp:975] Creating default 'basic' HTTP authenticator for
realm 'mesos-agent-readonly'
I0614 01:46:58.092212 31479 http.cpp:975] Creating default 'basic' HTTP authenticator for
realm 'mesos-agent-readwrite'
I0614 01:46:58.093634 31479 slave.cpp:552] Agent resources: cpus(*):2; mem(*):1024; disk(*):1024;
ports(*):[31000-32000]
I0614 01:46:58.093708 31479 slave.cpp:560] Agent attributes: [  ]
I0614 01:46:58.093724 31479 slave.cpp:565] Agent hostname: 506c5f02475c
I0614 01:46:58.093858 31483 status_update_manager.cpp:177] Pausing sending status updates
I0614 01:46:58.095396 31481 state.cpp:62] Recovering state from '/tmp/Endpoint_SlaveEndpointTest_NoAuthorizer_0_vlPAmv/meta'
I0614 01:46:58.095744 31477 status_update_manager.cpp:203] Recovering status update manager
I0614 01:46:58.096036 31487 containerizer.cpp:582] Recovering containerizer
I0614 01:46:58.097568 31487 provisioner.cpp:416] Provisioner recovery complete
I0614 01:46:58.098086 31467 slave.cpp:6127] Finished recovery
I0614 01:46:58.098605 31467 slave.cpp:6309] Querying resource estimator for oversubscribable
resources
I0614 01:46:58.098943 31472 slave.cpp:6323] Received oversubscribable resources {} from the
resource estimator
I0614 01:46:58.101258 31468 process.cpp:3778] Handling HTTP event for process 'slave(759)'
with path: '/slave(759)/monitor/statistics'
I0614 01:46:58.102546 31476 http.cpp:1115] HTTP GET for /slave(759)/monitor/statistics from
172.17.0.4:41062
I0614 01:46:58.102630 31476 http.cpp:936] Authorizing principal 'test-principal' to GET the
'/monitor/statistics' endpoint
I0614 01:46:58.106112 31487 slave.cpp:817] Agent terminating
[       OK ] Endpoint/SlaveEndpointTest.NoAuthorizer/0 (31 ms)
[ RUN      ] Endpoint/SlaveEndpointTest.NoAuthorizer/1
I0614 01:46:58.118831 31465 containerizer.cpp:230] Using isolation: posix/cpu,posix/mem,filesystem/posix,network/cni,environment_secret
W0614 01:46:58.119619 31465 backend.cpp:76] Failed to create 'aufs' backend: AufsBackend requires
root privileges
W0614 01:46:58.119751 31465 backend.cpp:76] Failed to create 'bind' backend: BindBackend requires
root privileges
I0614 01:46:58.119781 31465 provisioner.cpp:255] Using default backend 'copy'
I0614 01:46:58.122457 31465 cluster.cpp:448] Creating default 'local' authorizer
I0614 01:46:58.123988 31484 slave.cpp:248] Mesos agent started on (760)@172.17.0.4:35700
I0614 01:46:58.124008 31484 slave.cpp:249] Flags at startup: --acls="" --appc_simple_discovery_uri_prefix="http://"
--appc_store_dir="/tmp/Endpoint_SlaveEndpointTest_NoAuthorizer_1_2API0Y/store/appc" --authenticate_http_readonly="true"
--authenticate_http_readwrite="true" --authenticatee="crammd5" --authentication_backoff_factor="1secs"
--authorizer="local" --cgroups_cpu_enable_pids_and_tids_count="false" --cgroups_enable_cfs="false"
--cgroups_hierarchy="/sys/fs/cgroup" --cgroups_limit_swap="false" --cgroups_root="mesos" --container_disk_watch_interval="15secs"
--containerizers="mesos" --credential="/tmp/Endpoint_SlaveEndpointTest_NoAuthorizer_1_2API0Y/credential"
--default_role="*" --disk_watch_interval="1mins" --docker="docker" --docker_kill_orphans="true"
--docker_registry="https://registry-1.docker.io" --docker_remove_delay="6hrs" --docker_socket="/var/run/docker.sock"
--docker_stop_timeout="0ns" --docker_store_dir="/tmp/Endpoint_SlaveEndpointTest_NoAuthorizer_1_2API0Y/store/docker"
--docker_volume_checkpoint_dir="/var/run/mesos/isolators/docker/volume" --enforce_container_disk_quota="false"
--executor_registration_timeout="1mins" --executor_reregistration_timeout="2secs" --executor_shutdown_grace_period="5secs"
--fetcher_cache_dir="/tmp/Endpoint_SlaveEndpointTest_NoAuthorizer_1_2API0Y/fetch" --fetcher_cache_size="2GB"
--frameworks_home="" --gc_delay="1weeks" --gc_disk_headroom="0.1" --hadoop_home="" --help="false"
--hostname_lookup="true" --http_command_executor="false" --http_credentials="/tmp/Endpoint_SlaveEndpointTest_NoAuthorizer_1_2API0Y/http_credentials"
--http_heartbeat_interval="30secs" --initialize_driver_logging="true" --isolation="posix/cpu,posix/mem"
--launcher="posix" --launcher_dir="/mesos/build/src" --logbufsecs="0" --logging_level="INFO"
--max_completed_executors_per_framework="150" --oversubscribed_resources_interval="15secs"
--perf_duration="10secs" --perf_interval="1mins" --port="5051" --qos_correction_interval_min="0ns"
--quiet="false" --recover="reconnect" --recovery_timeout="15mins" --registration_backoff_factor="10ms"
--resources="cpus:2;gpus:0;mem:1024;disk:1024;ports:[31000-32000]" --revocable_cpu_low_priority="true"
--runtime_dir="/tmp/Endpoint_SlaveEndpointTest_NoAuthorizer_1_2API0Y" --sandbox_directory="/mnt/mesos/sandbox"
--strict="true" --switch_user="true" --systemd_enable_support="true" --systemd_runtime_directory="/run/systemd/system"
--version="false" --work_dir="/tmp/Endpoint_SlaveEndpointTest_NoAuthorizer_1_dWMC3S"
I0614 01:46:58.124369 31484 credentials.hpp:86] Loading credential for authentication from
'/tmp/Endpoint_SlaveEndpointTest_NoAuthorizer_1_2API0Y/credential'
I0614 01:46:58.124536 31484 slave.cpp:281] Agent using credential for: test-principal
I0614 01:46:58.124553 31484 credentials.hpp:37] Loading credentials for authentication from
'/tmp/Endpoint_SlaveEndpointTest_NoAuthorizer_1_2API0Y/http_credentials'
I0614 01:46:58.124752 31484 http.cpp:975] Creating default 'basic' HTTP authenticator for
realm 'mesos-agent-readonly'
I0614 01:46:58.124881 31484 http.cpp:975] Creating default 'basic' HTTP authenticator for
realm 'mesos-agent-readwrite'
I0614 01:46:58.126307 31484 slave.cpp:552] Agent resources: cpus(*):2; mem(*):1024; disk(*):1024;
ports(*):[31000-32000]
I0614 01:46:58.126374 31484 slave.cpp:560] Agent attributes: [  ]
I0614 01:46:58.126384 31484 slave.cpp:565] Agent hostname: 506c5f02475c
I0614 01:46:58.126536 31489 status_update_manager.cpp:177] Pausing sending status updates
I0614 01:46:58.127794 31466 state.cpp:62] Recovering state from '/tmp/Endpoint_SlaveEndpointTest_NoAuthorizer_1_dWMC3S/meta'
I0614 01:46:58.128250 31468 status_update_manager.cpp:203] Recovering status update manager
I0614 01:46:58.128424 31467 containerizer.cpp:582] Recovering containerizer
I0614 01:46:58.129930 31483 provisioner.cpp:416] Provisioner recovery complete
I0614 01:46:58.130340 31473 slave.cpp:6127] Finished recovery
I0614 01:46:58.130944 31473 slave.cpp:6309] Querying resource estimator for oversubscribable
resources
I0614 01:46:58.131232 31469 slave.cpp:6323] Received oversubscribable resources {} from the
resource estimator
I0614 01:46:58.133551 31476 process.cpp:3778] Handling HTTP event for process 'slave(760)'
with path: '/slave(760)/monitor/statistics.json'
I0614 01:46:58.134779 31486 http.cpp:1115] HTTP GET for /slave(760)/monitor/statistics.json
from 172.17.0.4:41064
I0614 01:46:58.134845 31486 http.cpp:936] Authorizing principal 'test-principal' to GET the
'/monitor/statistics.json' endpoint
I0614 01:46:58.138099 31478 slave.cpp:817] Agent terminating
[       OK ] Endpoint/SlaveEndpointTest.NoAuthorizer/1 (33 ms)
[ RUN      ] Endpoint/SlaveEndpointTest.NoAuthorizer/2
I0614 01:46:58.151078 31465 containerizer.cpp:230] Using isolation: posix/cpu,posix/mem,filesystem/posix,network/cni,environment_secret
W0614 01:46:58.151630 31465 backend.cpp:76] Failed to create 'aufs' backend: AufsBackend requires
root privileges
W0614 01:46:58.151732 31465 backend.cpp:76] Failed to create 'bind' backend: BindBackend requires
root privileges
I0614 01:46:58.151772 31465 provisioner.cpp:255] Using default backend 'copy'
I0614 01:46:58.154093 31465 cluster.cpp:448] Creating default 'local' authorizer
I0614 01:46:58.155930 31479 slave.cpp:248] Mesos agent started on (761)@172.17.0.4:35700
I0614 01:46:58.155954 31479 slave.cpp:249] Flags at startup: --acls="" --appc_simple_discovery_uri_prefix="http://"
--appc_store_dir="/tmp/Endpoint_SlaveEndpointTest_NoAuthorizer_2_qBLb6m/store/appc" --authenticate_http_readonly="true"
--authenticate_http_readwrite="true" --authenticatee="crammd5" --authentication_backoff_factor="1secs"
--authorizer="local" --cgroups_cpu_enable_pids_and_tids_count="false" --cgroups_enable_cfs="false"
--cgroups_hierarchy="/sys/fs/cgroup" --cgroups_limit_swap="false" --cgroups_root="mesos" --container_disk_watch_interval="15secs"
--containerizers="mesos" --credential="/tmp/Endpoint_SlaveEndpointTest_NoAuthorizer_2_qBLb6m/credential"
--default_role="*" --disk_watch_interval="1mins" --docker="docker" --docker_kill_orphans="true"
--docker_registry="https://registry-1.docker.io" --docker_remove_delay="6hrs" --docker_socket="/var/run/docker.sock"
--docker_stop_timeout="0ns" --docker_store_dir="/tmp/Endpoint_SlaveEndpointTest_NoAuthorizer_2_qBLb6m/store/docker"
--docker_volume_checkpoint_dir="/var/run/mesos/isolators/docker/volume" --enforce_container_disk_quota="false"
--executor_registration_timeout="1mins" --executor_reregistration_timeout="2secs" --executor_shutdown_grace_period="5secs"
--fetcher_cache_dir="/tmp/Endpoint_SlaveEndpointTest_NoAuthorizer_2_qBLb6m/fetch" --fetcher_cache_size="2GB"
--frameworks_home="" --gc_delay="1weeks" --gc_disk_headroom="0.1" --hadoop_home="" --help="false"
--hostname_lookup="true" --http_command_executor="false" --http_credentials="/tmp/Endpoint_SlaveEndpointTest_NoAuthorizer_2_qBLb6m/http_credentials"
--http_heartbeat_interval="30secs" --initialize_driver_logging="true" --isolation="posix/cpu,posix/mem"
--launcher="posix" --launcher_dir="/mesos/build/src" --logbufsecs="0" --logging_level="INFO"
--max_completed_executors_per_framework="150" --oversubscribed_resources_interval="15secs"
--perf_duration="10secs" --perf_interval="1mins" --port="5051" --qos_correction_interval_min="0ns"
--quiet="false" --recover="reconnect" --recovery_timeout="15mins" --registration_backoff_factor="10ms"
--resources="cpus:2;gpus:0;mem:1024;disk:1024;ports:[31000-32000]" --revocable_cpu_low_priority="true"
--runtime_dir="/tmp/Endpoint_SlaveEndpointTest_NoAuthorizer_2_qBLb6m" --sandbox_directory="/mnt/mesos/sandbox"
--strict="true" --switch_user="true" --systemd_enable_support="true" --systemd_runtime_directory="/run/systemd/system"
--version="false" --work_dir="/tmp/Endpoint_SlaveEndpointTest_NoAuthorizer_2_BFt53g"
I0614 01:46:58.156390 31479 credentials.hpp:86] Loading credential for authentication from
'/tmp/Endpoint_SlaveEndpointTest_NoAuthorizer_2_qBLb6m/credential'
I0614 01:46:58.156605 31479 slave.cpp:281] Agent using credential for: test-principal
I0614 01:46:58.156622 31479 credentials.hpp:37] Loading credentials for authentication from
'/tmp/Endpoint_SlaveEndpointTest_NoAuthorizer_2_qBLb6m/http_credentials'
I0614 01:46:58.156858 31479 http.cpp:975] Creating default 'basic' HTTP authenticator for
realm 'mesos-agent-readonly'
I0614 01:46:58.157037 31479 http.cpp:975] Creating default 'basic' HTTP authenticator for
realm 'mesos-agent-readwrite'
I0614 01:46:58.158435 31479 slave.cpp:552] Agent resources: cpus(*):2; mem(*):1024; disk(*):1024;
ports(*):[31000-32000]
I0614 01:46:58.158514 31479 slave.cpp:560] Agent attributes: [  ]
I0614 01:46:58.158522 31479 slave.cpp:565] Agent hostname: 506c5f02475c
I0614 01:46:58.158663 31486 status_update_manager.cpp:177] Pausing sending status updates
I0614 01:46:58.160089 31482 state.cpp:62] Recovering state from '/tmp/Endpoint_SlaveEndpointTest_NoAuthorizer_2_BFt53g/meta'
I0614 01:46:58.160423 31486 status_update_manager.cpp:203] Recovering status update manager
I0614 01:46:58.160768 31466 containerizer.cpp:582] Recovering containerizer
I0614 01:46:58.162389 31483 provisioner.cpp:416] Provisioner recovery complete
I0614 01:46:58.162961 31483 slave.cpp:6127] Finished recovery
I0614 01:46:58.163514 31483 slave.cpp:6309] Querying resource estimator for oversubscribable
resources
I0614 01:46:58.164039 31480 slave.cpp:6323] Received oversubscribable resources {} from the
resource estimator
I0614 01:46:58.166385 31477 process.cpp:3778] Handling HTTP event for process 'slave(761)'
with path: '/slave(761)/containers'
I0614 01:46:58.167717 31483 http.cpp:1115] HTTP GET for /slave(761)/containers from 172.17.0.4:41066
I0614 01:46:58.167801 31483 http.cpp:936] Authorizing principal 'test-principal' to GET the
'/containers' endpoint
I0614 01:46:58.171674 31488 slave.cpp:817] Agent terminating
[       OK ] Endpoint/SlaveEndpointTest.NoAuthorizer/2 (32 ms)
[----------] 9 tests from Endpoint/SlaveEndpointTest (273 ms total)

[----------] Global test environment tear-down
[==========] 1544 tests from 169 test cases ran. (279552 ms total)
[  PASSED  ] 1543 tests.
[  FAILED  ] 1 test, listed below:
[  FAILED  ] PersistentVolumeEndpointsTest.ReserveAndSlaveRemoval

 1 FAILED TEST
  YOU HAVE 19 DISABLED TESTS

E0614 01:46:58.237975 31490 process.cpp:968] Failed to accept socket: future discarded
make[3]: *** [CMakeFiles/check] Error 1
make[3]: Leaving directory `/mesos/build'
make[2]: *** [CMakeFiles/check.dir/all] Error 2
make[2]: Leaving directory `/mesos/build'
make[1]: *** [CMakeFiles/check.dir/rule] Error 2
make[1]: Leaving directory `/mesos/build'
make: *** [check] Error 2
+ docker rmi mesos-1497402524-24377
Untagged: mesos-1497402524-24377:latest
Deleted: sha256:7ac497b7331e25a16bae6c458df634fee0074a8b029e5bf4897fa5fe0ec83519
Deleted: sha256:12a0f42994a18ca5e45dc281c2ac59788c79d859702c57c699c23916a84633af
Deleted: sha256:4073cb198df0496caa43955d86d052273e8257254c28b1f17667c91dd77a6909
Deleted: sha256:8d5ce090e1fe12108adc4d67a60935407782bbbd44f4af275145d94dece3c396
Deleted: sha256:c4c9a935879100dd77af5616fa3121c95312280d5745df0f56794c25c045a1cc
Deleted: sha256:728811122b8cf38c94ae86e8f2c9861373c29e2a4f39564cb299f8bdcc454837
Deleted: sha256:aeab798b48e5f784b9d28ff03dc248e02bc35c4fe658fd7eb06e485992f99ae1
Deleted: sha256:81598fd7e61763c35e4523bc70cbe4dccae3b8419c53f4127769e2a420f4fbe5
Deleted: sha256:ba57d92c674f7e726fb04bc3dd878188086f23b385c6996a1911034fe5a91c4e
Deleted: sha256:1d0e2c65431224ad39fe778bf5d980a967c604069a4a8d5d7081aaf20b043a24
Deleted: sha256:6befad8504505c8c7fbf6139274b2b273cfc20ed2e1fe2da0476fce66fd199a7
Deleted: sha256:f001c14b7e311dfd0917180d200c1010c7e5d19af07a5e612f6caff49566d83c
Deleted: sha256:77b6b433038576ffbd8df17b080bd07786b762bec9c4af21f45b06610eccb6fc
Deleted: sha256:183f7fe30b9beb7486e089e8f21434171ca8f37fb4281a74d5c73959c625082a
Deleted: sha256:606f77154c63ae7eec1afbf64f4255fc74a6f7224e40a2e39d4b0159b6c8a97b
Deleted: sha256:5e59a6afe5be694f0df320d5f1df657a121f0499586a8f2da19ec7ccb5e2ce42
Deleted: sha256:6bd6bd06219c155b3225b9429d903667854b2891e73a455dc4cb9a8fcea04a5b
Deleted: sha256:9baa7699a96166c78f043051cf20d90886972feeab69171aaf8260b55ef3b28e
Deleted: sha256:311ad2f7a41b18bc0731c3e96c29d00b1dd027ac9a7c50413f2113bccaa0b4a1
Deleted: sha256:2cf91562fe71339360f7fcc73d82cb8e3490e8f603700ab537297498f8964a69
Deleted: sha256:185289a7c485c3787b345c727587f353cd157ff34f1b9b8ee06d297594035c3d
Deleted: sha256:a5035bc459379b3c3d37591120a3ff8d3301a29831d6df71496459e1af571618
Deleted: sha256:e9b97968bd9212b9b00d9875399c7682d71a4132a51fe75a52ca9ec4e3d26c81
Deleted: sha256:5cea6b246e3560508d1909152cf095ab45be8f7387c16bdf235aebf064d5b2a6
Deleted: sha256:b95a221ba5bf57c35697ab19d99249d25d5b0d7177d6a1acf17bb3959f4c1ef8
Build step 'Execute shell' marked build as failure
Not sending mail to unregistered user mcypark@gmail.com

Mime
View raw message