mesos-builds mailing list archives

Site index · List index
Message view « Date » · « Thread »
Top « Date » · « Thread »
From Apache Jenkins Server <jenk...@builds.apache.org>
Subject Build failed in Jenkins: Mesos-Buildbot » autotools,gcc,--verbose,GLOG_v=1 MESOS_VERBOSE=1,centos:7,(ubuntu)&&(!ubuntu-us1)&&(!ubuntu-eu2) #3774
Date Wed, 07 Jun 2017 17:18:27 GMT
See <https://builds.apache.org/job/Mesos-Buildbot/BUILDTOOL=autotools,COMPILER=gcc,CONFIGURATION=--verbose,ENVIRONMENT=GLOG_v=1%20MESOS_VERBOSE=1,OS=centos%3A7,label_exp=(ubuntu)&&(!ubuntu-us1)&&(!ubuntu-eu2)/3774/display/redirect?page=changes>

Changes:

[alexr] Used glog for logging in executors.

[alexr] Added logging of flag warnings in the default executor.

[alexr] Reordered flags help and error checks for consistency in executors.

[alexr] Added a TODO about glog initialization in master and slave main().

------------------------------------------
[...truncated 28.01 MB...]
W0607 17:18:16.345376  5350 backend.cpp:76] Failed to create 'bind' backend: BindBackend requires
root privileges
I0607 17:18:16.345422  5350 provisioner.cpp:255] Using default backend 'copy'
I0607 17:18:16.350749  5373 slave.cpp:248] Mesos agent started on (753)@172.17.0.2:42507
I0607 17:18:16.350792  5373 slave.cpp:249] Flags at startup: --acls="" --appc_simple_discovery_uri_prefix="http://"
--appc_store_dir="/tmp/Endpoint_SlaveEndpointTest_AuthorizedRequest_2_0ntOn5/store/appc" --authenticate_http_readonly="true"
--authenticate_http_readwrite="true" --authenticatee="crammd5" --authentication_backoff_factor="1secs"
--authorizer="local" --cgroups_cpu_enable_pids_and_tids_count="false" --cgroups_enable_cfs="false"
--cgroups_hierarchy="/sys/fs/cgroup" --cgroups_limit_swap="false" --cgroups_root="mesos" --container_disk_watch_interval="15secs"
--containerizers="mesos" --credential="/tmp/Endpoint_SlaveEndpointTest_AuthorizedRequest_2_0ntOn5/credential"
--default_role="*" --disk_watch_interval="1mins" --docker="docker" --docker_kill_orphans="true"
--docker_registry="https://registry-1.docker.io" --docker_remove_delay="6hrs" --docker_socket="/var/run/docker.sock"
--docker_stop_timeout="0ns" --docker_store_dir="/tmp/Endpoint_SlaveEndpointTest_AuthorizedRequest_2_0ntOn5/store/docker"
--docker_volume_checkpoint_dir="/var/run/mesos/isolators/docker/volume" --enforce_container_disk_quota="false"
--executor_registration_timeout="1mins" --executor_reregistration_timeout="2secs" --executor_shutdown_grace_period="5secs"
--fetcher_cache_dir="/tmp/Endpoint_SlaveEndpointTest_AuthorizedRequest_2_0ntOn5/fetch" --fetcher_cache_size="2GB"
--frameworks_home="" --gc_delay="1weeks" --gc_disk_headroom="0.1" --hadoop_home="" --help="false"
--hostname_lookup="true" --http_command_executor="false" --http_credentials="/tmp/Endpoint_SlaveEndpointTest_AuthorizedRequest_2_0ntOn5/http_credentials"
--http_heartbeat_interval="30secs" --initialize_driver_logging="true" --isolation="posix/cpu,posix/mem"
--launcher="posix" --launcher_dir="/mesos/mesos-1.4.0/_build/src" --logbufsecs="0" --logging_level="INFO"
--max_completed_executors_per_framework="150" --oversubscribed_resources_interval="15secs"
--perf_duration="10secs" --perf_interval="1mins" --port="5051" --qos_correction_interval_min="0ns"
--quiet="false" --recover="reconnect" --recovery_timeout="15mins" --registration_backoff_factor="10ms"
--resources="cpus:2;gpus:0;mem:1024;disk:1024;ports:[31000-32000]" --revocable_cpu_low_priority="true"
--runtime_dir="/tmp/Endpoint_SlaveEndpointTest_AuthorizedRequest_2_0ntOn5" --sandbox_directory="/mnt/mesos/sandbox"
--strict="true" --switch_user="true" --systemd_enable_support="true" --systemd_runtime_directory="/run/systemd/system"
--version="false" --work_dir="/tmp/Endpoint_SlaveEndpointTest_AuthorizedRequest_2_q6vqt8"
I0607 17:18:16.351522  5373 credentials.hpp:86] Loading credential for authentication from
'/tmp/Endpoint_SlaveEndpointTest_AuthorizedRequest_2_0ntOn5/credential'
I0607 17:18:16.351783  5373 slave.cpp:281] Agent using credential for: test-principal
I0607 17:18:16.351807  5373 credentials.hpp:37] Loading credentials for authentication from
'/tmp/Endpoint_SlaveEndpointTest_AuthorizedRequest_2_0ntOn5/http_credentials'
I0607 17:18:16.352176  5373 http.cpp:975] Creating default 'basic' HTTP authenticator for
realm 'mesos-agent-readonly'
I0607 17:18:16.352382  5373 http.cpp:975] Creating default 'basic' HTTP authenticator for
realm 'mesos-agent-readwrite'
I0607 17:18:16.354442  5373 slave.cpp:552] Agent resources: cpus(*):2; mem(*):1024; disk(*):1024;
ports(*):[31000-32000]
I0607 17:18:16.354586  5373 slave.cpp:560] Agent attributes: [  ]
I0607 17:18:16.354606  5373 slave.cpp:565] Agent hostname: 094af2680380
I0607 17:18:16.354934  5372 status_update_manager.cpp:177] Pausing sending status updates
I0607 17:18:16.356904  5372 state.cpp:62] Recovering state from '/tmp/Endpoint_SlaveEndpointTest_AuthorizedRequest_2_q6vqt8/meta'
I0607 17:18:16.357506  5371 status_update_manager.cpp:203] Recovering status update manager
I0607 17:18:16.357888  5371 containerizer.cpp:582] Recovering containerizer
I0607 17:18:16.360074  5370 provisioner.cpp:416] Provisioner recovery complete
I0607 17:18:16.360781  5375 slave.cpp:6127] Finished recovery
I0607 17:18:16.361387  5375 slave.cpp:6309] Querying resource estimator for oversubscribable
resources
I0607 17:18:16.361793  5374 slave.cpp:6323] Received oversubscribable resources {} from the
resource estimator
I0607 17:18:16.366184  5370 process.cpp:3778] Handling HTTP event for process 'slave(753)'
with path: '/slave(753)/containers'
I0607 17:18:16.368198  5370 http.cpp:1115] HTTP GET for /slave(753)/containers from 172.17.0.2:55192
I0607 17:18:16.368324  5370 http.cpp:936] Authorizing principal 'test-principal' to GET the
'/containers' endpoint
I0607 17:18:16.374454  5350 slave.cpp:817] Agent terminating
[       OK ] Endpoint/SlaveEndpointTest.AuthorizedRequest/2 (47 ms)
[ RUN      ] Endpoint/SlaveEndpointTest.UnauthorizedRequest/0
I0607 17:18:16.392035  5350 containerizer.cpp:230] Using isolation: posix/cpu,posix/mem,filesystem/posix,network/cni,environment_secret
W0607 17:18:16.392832  5350 backend.cpp:76] Failed to create 'overlay' backend: OverlayBackend
requires root privileges
W0607 17:18:16.393007  5350 backend.cpp:76] Failed to create 'bind' backend: BindBackend requires
root privileges
I0607 17:18:16.393050  5350 provisioner.cpp:255] Using default backend 'copy'
I0607 17:18:16.399775  5370 slave.cpp:248] Mesos agent started on (754)@172.17.0.2:42507
I0607 17:18:16.399822  5370 slave.cpp:249] Flags at startup: --acls="" --appc_simple_discovery_uri_prefix="http://"
--appc_store_dir="/tmp/Endpoint_SlaveEndpointTest_UnauthorizedRequest_0_arkkrT/store/appc"
--authenticate_http_readonly="true" --authenticate_http_readwrite="true" --authenticatee="crammd5"
--authentication_backoff_factor="1secs" --authorizer="local" --cgroups_cpu_enable_pids_and_tids_count="false"
--cgroups_enable_cfs="false" --cgroups_hierarchy="/sys/fs/cgroup" --cgroups_limit_swap="false"
--cgroups_root="mesos" --container_disk_watch_interval="15secs" --containerizers="mesos" --credential="/tmp/Endpoint_SlaveEndpointTest_UnauthorizedRequest_0_arkkrT/credential"
--default_role="*" --disk_watch_interval="1mins" --docker="docker" --docker_kill_orphans="true"
--docker_registry="https://registry-1.docker.io" --docker_remove_delay="6hrs" --docker_socket="/var/run/docker.sock"
--docker_stop_timeout="0ns" --docker_store_dir="/tmp/Endpoint_SlaveEndpointTest_UnauthorizedRequest_0_arkkrT/store/docker"
--docker_volume_checkpoint_dir="/var/run/mesos/isolators/docker/volume" --enforce_container_disk_quota="false"
--executor_registration_timeout="1mins" --executor_reregistration_timeout="2secs" --executor_shutdown_grace_period="5secs"
--fetcher_cache_dir="/tmp/Endpoint_SlaveEndpointTest_UnauthorizedRequest_0_arkkrT/fetch" --fetcher_cache_size="2GB"
--frameworks_home="" --gc_delay="1weeks" --gc_disk_headroom="0.1" --hadoop_home="" --help="false"
--hostname_lookup="true" --http_command_executor="false" --http_credentials="/tmp/Endpoint_SlaveEndpointTest_UnauthorizedRequest_0_arkkrT/http_credentials"
--http_heartbeat_interval="30secs" --initialize_driver_logging="true" --isolation="posix/cpu,posix/mem"
--launcher="posix" --launcher_dir="/mesos/mesos-1.4.0/_build/src" --logbufsecs="0" --logging_level="INFO"
--max_completed_executors_per_framework="150" --oversubscribed_resources_interval="15secs"
--perf_duration="10secs" --perf_interval="1mins" --port="5051" --qos_correction_interval_min="0ns"
--quiet="false" --recover="reconnect" --recovery_timeout="15mins" --registration_backoff_factor="10ms"
--resources="cpus:2;gpus:0;mem:1024;disk:1024;ports:[31000-32000]" --revocable_cpu_low_priority="true"
--runtime_dir="/tmp/Endpoint_SlaveEndpointTest_UnauthorizedRequest_0_arkkrT" --sandbox_directory="/mnt/mesos/sandbox"
--strict="true" --switch_user="true" --systemd_enable_support="true" --systemd_runtime_directory="/run/systemd/system"
--version="false" --work_dir="/tmp/Endpoint_SlaveEndpointTest_UnauthorizedRequest_0_2vHfpW"
I0607 17:18:16.400528  5370 credentials.hpp:86] Loading credential for authentication from
'/tmp/Endpoint_SlaveEndpointTest_UnauthorizedRequest_0_arkkrT/credential'
I0607 17:18:16.400787  5370 slave.cpp:281] Agent using credential for: test-principal
I0607 17:18:16.400810  5370 credentials.hpp:37] Loading credentials for authentication from
'/tmp/Endpoint_SlaveEndpointTest_UnauthorizedRequest_0_arkkrT/http_credentials'
I0607 17:18:16.401175  5370 http.cpp:975] Creating default 'basic' HTTP authenticator for
realm 'mesos-agent-readonly'
I0607 17:18:16.401397  5370 http.cpp:975] Creating default 'basic' HTTP authenticator for
realm 'mesos-agent-readwrite'
I0607 17:18:16.403360  5370 slave.cpp:552] Agent resources: cpus(*):2; mem(*):1024; disk(*):1024;
ports(*):[31000-32000]
I0607 17:18:16.403499  5370 slave.cpp:560] Agent attributes: [  ]
I0607 17:18:16.403518  5370 slave.cpp:565] Agent hostname: 094af2680380
I0607 17:18:16.406124  5370 status_update_manager.cpp:177] Pausing sending status updates
I0607 17:18:16.407114  5370 state.cpp:62] Recovering state from '/tmp/Endpoint_SlaveEndpointTest_UnauthorizedRequest_0_2vHfpW/meta'
I0607 17:18:16.407763  5370 status_update_manager.cpp:203] Recovering status update manager
I0607 17:18:16.407987  5370 containerizer.cpp:582] Recovering containerizer
I0607 17:18:16.410835  5370 provisioner.cpp:416] Provisioner recovery complete
I0607 17:18:16.411597  5370 slave.cpp:6127] Finished recovery
I0607 17:18:16.412184  5370 slave.cpp:6309] Querying resource estimator for oversubscribable
resources
I0607 17:18:16.413130  5370 slave.cpp:6323] Received oversubscribable resources {} from the
resource estimator
I0607 17:18:16.417759  5373 process.cpp:3778] Handling HTTP event for process 'slave(754)'
with path: '/slave(754)/monitor/statistics'
I0607 17:18:16.420163  5373 http.cpp:1115] HTTP GET for /slave(754)/monitor/statistics from
172.17.0.2:55194
I0607 17:18:16.420285  5373 http.cpp:936] Authorizing principal 'test-principal' to GET the
'/monitor/statistics' endpoint
I0607 17:18:16.423995  5350 slave.cpp:817] Agent terminating
[       OK ] Endpoint/SlaveEndpointTest.UnauthorizedRequest/0 (49 ms)
[ RUN      ] Endpoint/SlaveEndpointTest.UnauthorizedRequest/1
I0607 17:18:16.440562  5350 containerizer.cpp:230] Using isolation: posix/cpu,posix/mem,filesystem/posix,network/cni,environment_secret
W0607 17:18:16.441351  5350 backend.cpp:76] Failed to create 'overlay' backend: OverlayBackend
requires root privileges
W0607 17:18:16.441520  5350 backend.cpp:76] Failed to create 'bind' backend: BindBackend requires
root privileges
I0607 17:18:16.441562  5350 provisioner.cpp:255] Using default backend 'copy'
I0607 17:18:16.446876  5374 slave.cpp:248] Mesos agent started on (755)@172.17.0.2:42507
I0607 17:18:16.446919  5374 slave.cpp:249] Flags at startup: --acls="" --appc_simple_discovery_uri_prefix="http://"
--appc_store_dir="/tmp/Endpoint_SlaveEndpointTest_UnauthorizedRequest_1_I2sM0H/store/appc"
--authenticate_http_readonly="true" --authenticate_http_readwrite="true" --authenticatee="crammd5"
--authentication_backoff_factor="1secs" --authorizer="local" --cgroups_cpu_enable_pids_and_tids_count="false"
--cgroups_enable_cfs="false" --cgroups_hierarchy="/sys/fs/cgroup" --cgroups_limit_swap="false"
--cgroups_root="mesos" --container_disk_watch_interval="15secs" --containerizers="mesos" --credential="/tmp/Endpoint_SlaveEndpointTest_UnauthorizedRequest_1_I2sM0H/credential"
--default_role="*" --disk_watch_interval="1mins" --docker="docker" --docker_kill_orphans="true"
--docker_registry="https://registry-1.docker.io" --docker_remove_delay="6hrs" --docker_socket="/var/run/docker.sock"
--docker_stop_timeout="0ns" --docker_store_dir="/tmp/Endpoint_SlaveEndpointTest_UnauthorizedRequest_1_I2sM0H/store/docker"
--docker_volume_checkpoint_dir="/var/run/mesos/isolators/docker/volume" --enforce_container_disk_quota="false"
--executor_registration_timeout="1mins" --executor_reregistration_timeout="2secs" --executor_shutdown_grace_period="5secs"
--fetcher_cache_dir="/tmp/Endpoint_SlaveEndpointTest_UnauthorizedRequest_1_I2sM0H/fetch" --fetcher_cache_size="2GB"
--frameworks_home="" --gc_delay="1weeks" --gc_disk_headroom="0.1" --hadoop_home="" --help="false"
--hostname_lookup="true" --http_command_executor="false" --http_credentials="/tmp/Endpoint_SlaveEndpointTest_UnauthorizedRequest_1_I2sM0H/http_credentials"
--http_heartbeat_interval="30secs" --initialize_driver_logging="true" --isolation="posix/cpu,posix/mem"
--launcher="posix" --launcher_dir="/mesos/mesos-1.4.0/_build/src" --logbufsecs="0" --logging_level="INFO"
--max_completed_executors_per_framework="150" --oversubscribed_resources_interval="15secs"
--perf_duration="10secs" --perf_interval="1mins" --port="5051" --qos_correction_interval_min="0ns"
--quiet="false" --recover="reconnect" --recovery_timeout="15mins" --registration_backoff_factor="10ms"
--resources="cpus:2;gpus:0;mem:1024;disk:1024;ports:[31000-32000]" --revocable_cpu_low_priority="true"
--runtime_dir="/tmp/Endpoint_SlaveEndpointTest_UnauthorizedRequest_1_I2sM0H" --sandbox_directory="/mnt/mesos/sandbox"
--strict="true" --switch_user="true" --systemd_enable_support="true" --systemd_runtime_directory="/run/systemd/system"
--version="false" --work_dir="/tmp/Endpoint_SlaveEndpointTest_UnauthorizedRequest_1_E9TNQK"
I0607 17:18:16.447772  5374 credentials.hpp:86] Loading credential for authentication from
'/tmp/Endpoint_SlaveEndpointTest_UnauthorizedRequest_1_I2sM0H/credential'
I0607 17:18:16.448170  5374 slave.cpp:281] Agent using credential for: test-principal
I0607 17:18:16.448207  5374 credentials.hpp:37] Loading credentials for authentication from
'/tmp/Endpoint_SlaveEndpointTest_UnauthorizedRequest_1_I2sM0H/http_credentials'
I0607 17:18:16.448724  5374 http.cpp:975] Creating default 'basic' HTTP authenticator for
realm 'mesos-agent-readonly'
I0607 17:18:16.449079  5374 http.cpp:975] Creating default 'basic' HTTP authenticator for
realm 'mesos-agent-readwrite'
I0607 17:18:16.451393  5374 slave.cpp:552] Agent resources: cpus(*):2; mem(*):1024; disk(*):1024;
ports(*):[31000-32000]
I0607 17:18:16.451539  5374 slave.cpp:560] Agent attributes: [  ]
I0607 17:18:16.451558  5374 slave.cpp:565] Agent hostname: 094af2680380
I0607 17:18:16.451756  5375 status_update_manager.cpp:177] Pausing sending status updates
I0607 17:18:16.454071  5371 state.cpp:62] Recovering state from '/tmp/Endpoint_SlaveEndpointTest_UnauthorizedRequest_1_E9TNQK/meta'
I0607 17:18:16.454708  5376 status_update_manager.cpp:203] Recovering status update manager
I0607 17:18:16.454989  5374 containerizer.cpp:582] Recovering containerizer
I0607 17:18:16.457484  5369 provisioner.cpp:416] Provisioner recovery complete
I0607 17:18:16.458266  5372 slave.cpp:6127] Finished recovery
I0607 17:18:16.459110  5372 slave.cpp:6309] Querying resource estimator for oversubscribable
resources
I0607 17:18:16.459584  5372 slave.cpp:6323] Received oversubscribable resources {} from the
resource estimator
I0607 17:18:16.463765  5375 process.cpp:3778] Handling HTTP event for process 'slave(755)'
with path: '/slave(755)/monitor/statistics.json'
I0607 17:18:16.465764  5372 http.cpp:1115] HTTP GET for /slave(755)/monitor/statistics.json
from 172.17.0.2:55196
I0607 17:18:16.465951  5372 http.cpp:936] Authorizing principal 'test-principal' to GET the
'/monitor/statistics.json' endpoint
I0607 17:18:16.469816  5376 slave.cpp:817] Agent terminating
[       OK ] Endpoint/SlaveEndpointTest.UnauthorizedRequest/1 (45 ms)
[ RUN      ] Endpoint/SlaveEndpointTest.UnauthorizedRequest/2
I0607 17:18:16.485962  5350 containerizer.cpp:230] Using isolation: posix/cpu,posix/mem,filesystem/posix,network/cni,environment_secret
W0607 17:18:16.486752  5350 backend.cpp:76] Failed to create 'overlay' backend: OverlayBackend
requires root privileges
W0607 17:18:16.486994  5350 backend.cpp:76] Failed to create 'bind' backend: BindBackend requires
root privileges
I0607 17:18:16.487037  5350 provisioner.cpp:255] Using default backend 'copy'
I0607 17:18:16.492352  5369 slave.cpp:248] Mesos agent started on (756)@172.17.0.2:42507
I0607 17:18:16.492399  5369 slave.cpp:249] Flags at startup: --acls="" --appc_simple_discovery_uri_prefix="http://"
--appc_store_dir="/tmp/Endpoint_SlaveEndpointTest_UnauthorizedRequest_2_wCUP3w/store/appc"
--authenticate_http_readonly="true" --authenticate_http_readwrite="true" --authenticatee="crammd5"
--authentication_backoff_factor="1secs" --authorizer="local" --cgroups_cpu_enable_pids_and_tids_count="false"
--cgroups_enable_cfs="false" --cgroups_hierarchy="/sys/fs/cgroup" --cgroups_limit_swap="false"
--cgroups_root="mesos" --container_disk_watch_interval="15secs" --containerizers="mesos" --credential="/tmp/Endpoint_SlaveEndpointTest_UnauthorizedRequest_2_wCUP3w/credential"
--default_role="*" --disk_watch_interval="1mins" --docker="docker" --docker_kill_orphans="true"
--docker_registry="https://registry-1.docker.io" --docker_remove_delay="6hrs" --docker_socket="/var/run/docker.sock"
--docker_stop_timeout="0ns" --docker_store_dir="/tmp/Endpoint_SlaveEndpointTest_UnauthorizedRequest_2_wCUP3w/store/docker"
--docker_volume_checkpoint_dir="/var/run/mesos/isolators/docker/volume" --enforce_container_disk_quota="false"
--executor_registration_timeout="1mins" --executor_reregistration_timeout="2secs" --executor_shutdown_grace_period="5secs"
--fetcher_cache_dir="/tmp/Endpoint_SlaveEndpointTest_UnauthorizedRequest_2_wCUP3w/fetch" --fetcher_cache_size="2GB"
--frameworks_home="" --gc_delay="1weeks" --gc_disk_headroom="0.1" --hadoop_home="" --help="false"
--hostname_lookup="true" --http_command_executor="false" --http_credentials="/tmp/Endpoint_SlaveEndpointTest_UnauthorizedRequest_2_wCUP3w/http_credentials"
--http_heartbeat_interval="30secs" --initialize_driver_logging="true" --isolation="posix/cpu,posix/mem"
--launcher="posix" --launcher_dir="/mesos/mesos-1.4.0/_build/src" --logbufsecs="0" --logging_level="INFO"
--max_completed_executors_per_framework="150" --oversubscribed_resources_interval="15secs"
--perf_duration="10secs" --perf_interval="1mins" --port="5051" --qos_correction_interval_min="0ns"
--quiet="false" --recover="reconnect" --recovery_timeout="15mins" --registration_backoff_factor="10ms"
--resources="cpus:2;gpus:0;mem:1024;disk:1024;ports:[31000-32000]" --revocable_cpu_low_priority="true"
--runtime_dir="/tmp/Endpoint_SlaveEndpointTest_UnauthorizedRequest_2_wCUP3w" --sandbox_directory="/mnt/mesos/sandbox"
--strict="true" --switch_user="true" --systemd_enable_support="true" --systemd_runtime_directory="/run/systemd/system"
--version="false" --work_dir="/tmp/Endpoint_SlaveEndpointTest_UnauthorizedRequest_2_OqGwMz"
I0607 17:18:16.493257  5369 credentials.hpp:86] Loading credential for authentication from
'/tmp/Endpoint_SlaveEndpointTest_UnauthorizedRequest_2_wCUP3w/credential'
I0607 17:18:16.493624  5369 slave.cpp:281] Agent using credential for: test-principal
I0607 17:18:16.493660  5369 credentials.hpp:37] Loading credentials for authentication from
'/tmp/Endpoint_SlaveEndpointTest_UnauthorizedRequest_2_wCUP3w/http_credentials'
I0607 17:18:16.494185  5369 http.cpp:975] Creating default 'basic' HTTP authenticator for
realm 'mesos-agent-readonly'
I0607 17:18:16.494571  5369 http.cpp:975] Creating default 'basic' HTTP authenticator for
realm 'mesos-agent-readwrite'
I0607 17:18:16.497263  5369 slave.cpp:552] Agent resources: cpus(*):2; mem(*):1024; disk(*):1024;
ports(*):[31000-32000]
I0607 17:18:16.497426  5369 slave.cpp:560] Agent attributes: [  ]
I0607 17:18:16.497447  5369 slave.cpp:565] Agent hostname: 094af2680380
I0607 17:18:16.497764  5375 status_update_manager.cpp:177] Pausing sending status updates
I0607 17:18:16.500223  5373 state.cpp:62] Recovering state from '/tmp/Endpoint_SlaveEndpointTest_UnauthorizedRequest_2_OqGwMz/meta'
I0607 17:18:16.500815  5371 status_update_manager.cpp:203] Recovering status update manager
I0607 17:18:16.501242  5372 containerizer.cpp:582] Recovering containerizer
I0607 17:18:16.505518  5373 provisioner.cpp:416] Provisioner recovery complete
I0607 17:18:16.506428  5374 slave.cpp:6127] Finished recovery
I0607 17:18:16.507378  5374 slave.cpp:6309] Querying resource estimator for oversubscribable
resources
I0607 17:18:16.507866  5374 slave.cpp:6323] Received oversubscribable resources {} from the
resource estimator
I0607 17:18:16.512153  5369 process.cpp:3778] Handling HTTP event for process 'slave(756)'
with path: '/slave(756)/containers'
I0607 17:18:16.514668  5370 http.cpp:1115] HTTP GET for /slave(756)/containers from 172.17.0.2:55198
I0607 17:18:16.514804  5370 http.cpp:936] Authorizing principal 'test-principal' to GET the
'/containers' endpoint
I0607 17:18:16.519398  5376 slave.cpp:817] Agent terminating
[       OK ] Endpoint/SlaveEndpointTest.UnauthorizedRequest/2 (48 ms)
[ RUN      ] Endpoint/SlaveEndpointTest.NoAuthorizer/0
I0607 17:18:16.535435  5350 containerizer.cpp:230] Using isolation: posix/cpu,posix/mem,filesystem/posix,network/cni,environment_secret
W0607 17:18:16.536224  5350 backend.cpp:76] Failed to create 'overlay' backend: OverlayBackend
requires root privileges
W0607 17:18:16.536393  5350 backend.cpp:76] Failed to create 'bind' backend: BindBackend requires
root privileges
I0607 17:18:16.536453  5350 provisioner.cpp:255] Using default backend 'copy'
I0607 17:18:16.538866  5350 cluster.cpp:448] Creating default 'local' authorizer
I0607 17:18:16.541544  5373 slave.cpp:248] Mesos agent started on (757)@172.17.0.2:42507
I0607 17:18:16.541585  5373 slave.cpp:249] Flags at startup: --acls="" --appc_simple_discovery_uri_prefix="http://"
--appc_store_dir="/tmp/Endpoint_SlaveEndpointTest_NoAuthorizer_0_u5nxCm/store/appc" --authenticate_http_readonly="true"
--authenticate_http_readwrite="true" --authenticatee="crammd5" --authentication_backoff_factor="1secs"
--authorizer="local" --cgroups_cpu_enable_pids_and_tids_count="false" --cgroups_enable_cfs="false"
--cgroups_hierarchy="/sys/fs/cgroup" --cgroups_limit_swap="false" --cgroups_root="mesos" --container_disk_watch_interval="15secs"
--containerizers="mesos" --credential="/tmp/Endpoint_SlaveEndpointTest_NoAuthorizer_0_u5nxCm/credential"
--default_role="*" --disk_watch_interval="1mins" --docker="docker" --docker_kill_orphans="true"
--docker_registry="https://registry-1.docker.io" --docker_remove_delay="6hrs" --docker_socket="/var/run/docker.sock"
--docker_stop_timeout="0ns" --docker_store_dir="/tmp/Endpoint_SlaveEndpointTest_NoAuthorizer_0_u5nxCm/store/docker"
--docker_volume_checkpoint_dir="/var/run/mesos/isolators/docker/volume" --enforce_container_disk_quota="false"
--executor_registration_timeout="1mins" --executor_reregistration_timeout="2secs" --executor_shutdown_grace_period="5secs"
--fetcher_cache_dir="/tmp/Endpoint_SlaveEndpointTest_NoAuthorizer_0_u5nxCm/fetch" --fetcher_cache_size="2GB"
--frameworks_home="" --gc_delay="1weeks" --gc_disk_headroom="0.1" --hadoop_home="" --help="false"
--hostname_lookup="true" --http_command_executor="false" --http_credentials="/tmp/Endpoint_SlaveEndpointTest_NoAuthorizer_0_u5nxCm/http_credentials"
--http_heartbeat_interval="30secs" --initialize_driver_logging="true" --isolation="posix/cpu,posix/mem"
--launcher="posix" --launcher_dir="/mesos/mesos-1.4.0/_build/src" --logbufsecs="0" --logging_level="INFO"
--max_completed_executors_per_framework="150" --oversubscribed_resources_interval="15secs"
--perf_duration="10secs" --perf_interval="1mins" --port="5051" --qos_correction_interval_min="0ns"
--quiet="false" --recover="reconnect" --recovery_timeout="15mins" --registration_backoff_factor="10ms"
--resources="cpus:2;gpus:0;mem:1024;disk:1024;ports:[31000-32000]" --revocable_cpu_low_priority="true"
--runtime_dir="/tmp/Endpoint_SlaveEndpointTest_NoAuthorizer_0_u5nxCm" --sandbox_directory="/mnt/mesos/sandbox"
--strict="true" --switch_user="true" --systemd_enable_support="true" --systemd_runtime_directory="/run/systemd/system"
--version="false" --work_dir="/tmp/Endpoint_SlaveEndpointTest_NoAuthorizer_0_odghdp"
I0607 17:18:16.542318  5373 credentials.hpp:86] Loading credential for authentication from
'/tmp/Endpoint_SlaveEndpointTest_NoAuthorizer_0_u5nxCm/credential'
I0607 17:18:16.542584  5373 slave.cpp:281] Agent using credential for: test-principal
I0607 17:18:16.542609  5373 credentials.hpp:37] Loading credentials for authentication from
'/tmp/Endpoint_SlaveEndpointTest_NoAuthorizer_0_u5nxCm/http_credentials'
I0607 17:18:16.542963  5373 http.cpp:975] Creating default 'basic' HTTP authenticator for
realm 'mesos-agent-readonly'
I0607 17:18:16.543162  5373 http.cpp:975] Creating default 'basic' HTTP authenticator for
realm 'mesos-agent-readwrite'
I0607 17:18:16.545230  5373 slave.cpp:552] Agent resources: cpus(*):2; mem(*):1024; disk(*):1024;
ports(*):[31000-32000]
I0607 17:18:16.545377  5373 slave.cpp:560] Agent attributes: [  ]
I0607 17:18:16.545397  5373 slave.cpp:565] Agent hostname: 094af2680380
I0607 17:18:16.545763  5369 status_update_manager.cpp:177] Pausing sending status updates
I0607 17:18:16.547534  5375 state.cpp:62] Recovering state from '/tmp/Endpoint_SlaveEndpointTest_NoAuthorizer_0_odghdp/meta'
I0607 17:18:16.548282  5373 status_update_manager.cpp:203] Recovering status update manager
I0607 17:18:16.548609  5372 containerizer.cpp:582] Recovering containerizer
I0607 17:18:16.550909  5375 provisioner.cpp:416] Provisioner recovery complete
I0607 17:18:16.551617  5371 slave.cpp:6127] Finished recovery
I0607 17:18:16.552466  5371 slave.cpp:6309] Querying resource estimator for oversubscribable
resources
I0607 17:18:16.553131  5371 slave.cpp:6323] Received oversubscribable resources {} from the
resource estimator
I0607 17:18:16.557610  5370 process.cpp:3778] Handling HTTP event for process 'slave(757)'
with path: '/slave(757)/monitor/statistics'
I0607 17:18:16.559942  5370 http.cpp:1115] HTTP GET for /slave(757)/monitor/statistics from
172.17.0.2:55200
I0607 17:18:16.560062  5370 http.cpp:936] Authorizing principal 'test-principal' to GET the
'/monitor/statistics' endpoint
I0607 17:18:16.565281  5369 slave.cpp:817] Agent terminating
[       OK ] Endpoint/SlaveEndpointTest.NoAuthorizer/0 (45 ms)
[ RUN      ] Endpoint/SlaveEndpointTest.NoAuthorizer/1
I0607 17:18:16.580955  5350 containerizer.cpp:230] Using isolation: posix/cpu,posix/mem,filesystem/posix,network/cni,environment_secret
W0607 17:18:16.581737  5350 backend.cpp:76] Failed to create 'overlay' backend: OverlayBackend
requires root privileges
W0607 17:18:16.581903  5350 backend.cpp:76] Failed to create 'bind' backend: BindBackend requires
root privileges
I0607 17:18:16.581945  5350 provisioner.cpp:255] Using default backend 'copy'
I0607 17:18:16.584372  5350 cluster.cpp:448] Creating default 'local' authorizer
I0607 17:18:16.587046  5376 slave.cpp:248] Mesos agent started on (758)@172.17.0.2:42507
I0607 17:18:16.587088  5376 slave.cpp:249] Flags at startup: --acls="" --appc_simple_discovery_uri_prefix="http://"
--appc_store_dir="/tmp/Endpoint_SlaveEndpointTest_NoAuthorizer_1_wE7OEc/store/appc" --authenticate_http_readonly="true"
--authenticate_http_readwrite="true" --authenticatee="crammd5" --authentication_backoff_factor="1secs"
--authorizer="local" --cgroups_cpu_enable_pids_and_tids_count="false" --cgroups_enable_cfs="false"
--cgroups_hierarchy="/sys/fs/cgroup" --cgroups_limit_swap="false" --cgroups_root="mesos" --container_disk_watch_interval="15secs"
--containerizers="mesos" --credential="/tmp/Endpoint_SlaveEndpointTest_NoAuthorizer_1_wE7OEc/credential"
--default_role="*" --disk_watch_interval="1mins" --docker="docker" --docker_kill_orphans="true"
--docker_registry="https://registry-1.docker.io" --docker_remove_delay="6hrs" --docker_socket="/var/run/docker.sock"
--docker_stop_timeout="0ns" --docker_store_dir="/tmp/Endpoint_SlaveEndpointTest_NoAuthorizer_1_wE7OEc/store/docker"
--docker_volume_checkpoint_dir="/var/run/mesos/isolators/docker/volume" --enforce_container_disk_quota="false"
--executor_registration_timeout="1mins" --executor_reregistration_timeout="2secs" --executor_shutdown_grace_period="5secs"
--fetcher_cache_dir="/tmp/Endpoint_SlaveEndpointTest_NoAuthorizer_1_wE7OEc/fetch" --fetcher_cache_size="2GB"
--frameworks_home="" --gc_delay="1weeks" --gc_disk_headroom="0.1" --hadoop_home="" --help="false"
--hostname_lookup="true" --http_command_executor="false" --http_credentials="/tmp/Endpoint_SlaveEndpointTest_NoAuthorizer_1_wE7OEc/http_credentials"
--http_heartbeat_interval="30secs" --initialize_driver_logging="true" --isolation="posix/cpu,posix/mem"
--launcher="posix" --launcher_dir="/mesos/mesos-1.4.0/_build/src" --logbufsecs="0" --logging_level="INFO"
--max_completed_executors_per_framework="150" --oversubscribed_resources_interval="15secs"
--perf_duration="10secs" --perf_interval="1mins" --port="5051" --qos_correction_interval_min="0ns"
--quiet="false" --recover="reconnect" --recovery_timeout="15mins" --registration_backoff_factor="10ms"
--resources="cpus:2;gpus:0;mem:1024;disk:1024;ports:[31000-32000]" --revocable_cpu_low_priority="true"
--runtime_dir="/tmp/Endpoint_SlaveEndpointTest_NoAuthorizer_1_wE7OEc" --sandbox_directory="/mnt/mesos/sandbox"
--strict="true" --switch_user="true" --systemd_enable_support="true" --systemd_runtime_directory="/run/systemd/system"
--version="false" --work_dir="/tmp/Endpoint_SlaveEndpointTest_NoAuthorizer_1_sPi97e"
I0607 17:18:16.587831  5376 credentials.hpp:86] Loading credential for authentication from
'/tmp/Endpoint_SlaveEndpointTest_NoAuthorizer_1_wE7OEc/credential'
I0607 17:18:16.588100  5376 slave.cpp:281] Agent using credential for: test-principal
I0607 17:18:16.588135  5376 credentials.hpp:37] Loading credentials for authentication from
'/tmp/Endpoint_SlaveEndpointTest_NoAuthorizer_1_wE7OEc/http_credentials'
I0607 17:18:16.588528  5376 http.cpp:975] Creating default 'basic' HTTP authenticator for
realm 'mesos-agent-readonly'
I0607 17:18:16.588776  5376 http.cpp:975] Creating default 'basic' HTTP authenticator for
realm 'mesos-agent-readwrite'
I0607 17:18:16.590868  5376 slave.cpp:552] Agent resources: cpus(*):2; mem(*):1024; disk(*):1024;
ports(*):[31000-32000]
I0607 17:18:16.591013  5376 slave.cpp:560] Agent attributes: [  ]
I0607 17:18:16.591033  5376 slave.cpp:565] Agent hostname: 094af2680380
I0607 17:18:16.591325  5374 status_update_manager.cpp:177] Pausing sending status updates
I0607 17:18:16.593237  5369 state.cpp:62] Recovering state from '/tmp/Endpoint_SlaveEndpointTest_NoAuthorizer_1_sPi97e/meta'
I0607 17:18:16.593797  5373 status_update_manager.cpp:203] Recovering status update manager
I0607 17:18:16.594064  5373 containerizer.cpp:582] Recovering containerizer
I0607 17:18:16.596130  5372 provisioner.cpp:416] Provisioner recovery complete
I0607 17:18:16.596737  5373 slave.cpp:6127] Finished recovery
I0607 17:18:16.597355  5373 slave.cpp:6309] Querying resource estimator for oversubscribable
resources
I0607 17:18:16.597821  5372 slave.cpp:6323] Received oversubscribable resources {} from the
resource estimator
I0607 17:18:16.602388  5372 process.cpp:3778] Handling HTTP event for process 'slave(758)'
with path: '/slave(758)/monitor/statistics.json'
I0607 17:18:16.604707  5375 http.cpp:1115] HTTP GET for /slave(758)/monitor/statistics.json
from 172.17.0.2:55202
I0607 17:18:16.604836  5375 http.cpp:936] Authorizing principal 'test-principal' to GET the
'/monitor/statistics.json' endpoint
I0607 17:18:16.610800  5350 slave.cpp:817] Agent terminating
[       OK ] Endpoint/SlaveEndpointTest.NoAuthorizer/1 (44 ms)
[ RUN      ] Endpoint/SlaveEndpointTest.NoAuthorizer/2
I0607 17:18:16.626452  5350 containerizer.cpp:230] Using isolation: posix/cpu,posix/mem,filesystem/posix,network/cni,environment_secret
W0607 17:18:16.627331  5350 backend.cpp:76] Failed to create 'overlay' backend: OverlayBackend
requires root privileges
W0607 17:18:16.627509  5350 backend.cpp:76] Failed to create 'bind' backend: BindBackend requires
root privileges
I0607 17:18:16.627555  5350 provisioner.cpp:255] Using default backend 'copy'
I0607 17:18:16.630195  5350 cluster.cpp:448] Creating default 'local' authorizer
I0607 17:18:16.632846  5374 slave.cpp:248] Mesos agent started on (759)@172.17.0.2:42507
I0607 17:18:16.632894  5374 slave.cpp:249] Flags at startup: --acls="" --appc_simple_discovery_uri_prefix="http://"
--appc_store_dir="/tmp/Endpoint_SlaveEndpointTest_NoAuthorizer_2_qTeta3/store/appc" --authenticate_http_readonly="true"
--authenticate_http_readwrite="true" --authenticatee="crammd5" --authentication_backoff_factor="1secs"
--authorizer="local" --cgroups_cpu_enable_pids_and_tids_count="false" --cgroups_enable_cfs="false"
--cgroups_hierarchy="/sys/fs/cgroup" --cgroups_limit_swap="false" --cgroups_root="mesos" --container_disk_watch_interval="15secs"
--containerizers="mesos" --credential="/tmp/Endpoint_SlaveEndpointTest_NoAuthorizer_2_qTeta3/credential"
--default_role="*" --disk_watch_interval="1mins" --docker="docker" --docker_kill_orphans="true"
--docker_registry="https://registry-1.docker.io" --docker_remove_delay="6hrs" --docker_socket="/var/run/docker.sock"
--docker_stop_timeout="0ns" --docker_store_dir="/tmp/Endpoint_SlaveEndpointTest_NoAuthorizer_2_qTeta3/store/docker"
--docker_volume_checkpoint_dir="/var/run/mesos/isolators/docker/volume" --enforce_container_disk_quota="false"
--executor_registration_timeout="1mins" --executor_reregistration_timeout="2secs" --executor_shutdown_grace_period="5secs"
--fetcher_cache_dir="/tmp/Endpoint_SlaveEndpointTest_NoAuthorizer_2_qTeta3/fetch" --fetcher_cache_size="2GB"
--frameworks_home="" --gc_delay="1weeks" --gc_disk_headroom="0.1" --hadoop_home="" --help="false"
--hostname_lookup="true" --http_command_executor="false" --http_credentials="/tmp/Endpoint_SlaveEndpointTest_NoAuthorizer_2_qTeta3/http_credentials"
--http_heartbeat_interval="30secs" --initialize_driver_logging="true" --isolation="posix/cpu,posix/mem"
--launcher="posix" --launcher_dir="/mesos/mesos-1.4.0/_build/src" --logbufsecs="0" --logging_level="INFO"
--max_completed_executors_per_framework="150" --oversubscribed_resources_interval="15secs"
--perf_duration="10secs" --perf_interval="1mins" --port="5051" --qos_correction_interval_min="0ns"
--quiet="false" --recover="reconnect" --recovery_timeout="15mins" --registration_backoff_factor="10ms"
--resources="cpus:2;gpus:0;mem:1024;disk:1024;ports:[31000-32000]" --revocable_cpu_low_priority="true"
--runtime_dir="/tmp/Endpoint_SlaveEndpointTest_NoAuthorizer_2_qTeta3" --sandbox_directory="/mnt/mesos/sandbox"
--strict="true" --switch_user="true" --systemd_enable_support="true" --systemd_runtime_directory="/run/systemd/system"
--version="false" --work_dir="/tmp/Endpoint_SlaveEndpointTest_NoAuthorizer_2_QVhrw5"
I0607 17:18:16.633771  5374 credentials.hpp:86] Loading credential for authentication from
'/tmp/Endpoint_SlaveEndpointTest_NoAuthorizer_2_qTeta3/credential'
I0607 17:18:16.634069  5374 slave.cpp:281] Agent using credential for: test-principal
I0607 17:18:16.634253  5374 credentials.hpp:37] Loading credentials for authentication from
'/tmp/Endpoint_SlaveEndpointTest_NoAuthorizer_2_qTeta3/http_credentials'
I0607 17:18:16.634766  5374 http.cpp:975] Creating default 'basic' HTTP authenticator for
realm 'mesos-agent-readonly'
I0607 17:18:16.635140  5374 http.cpp:975] Creating default 'basic' HTTP authenticator for
realm 'mesos-agent-readwrite'
I0607 17:18:16.637389  5374 slave.cpp:552] Agent resources: cpus(*):2; mem(*):1024; disk(*):1024;
ports(*):[31000-32000]
I0607 17:18:16.637532  5374 slave.cpp:560] Agent attributes: [  ]
I0607 17:18:16.637552  5374 slave.cpp:565] Agent hostname: 094af2680380
I0607 17:18:16.637795  5373 status_update_manager.cpp:177] Pausing sending status updates
I0607 17:18:16.640153  5376 state.cpp:62] Recovering state from '/tmp/Endpoint_SlaveEndpointTest_NoAuthorizer_2_QVhrw5/meta'
I0607 17:18:16.640760  5374 status_update_manager.cpp:203] Recovering status update manager
I0607 17:18:16.641185  5373 containerizer.cpp:582] Recovering containerizer
I0607 17:18:16.643352  5369 provisioner.cpp:416] Provisioner recovery complete
I0607 17:18:16.644079  5371 slave.cpp:6127] Finished recovery
I0607 17:18:16.644899  5371 slave.cpp:6309] Querying resource estimator for oversubscribable
resources
I0607 17:18:16.645493  5370 slave.cpp:6323] Received oversubscribable resources {} from the
resource estimator
I0607 17:18:16.649864  5370 process.cpp:3778] Handling HTTP event for process 'slave(759)'
with path: '/slave(759)/containers'
I0607 17:18:16.652215  5370 http.cpp:1115] HTTP GET for /slave(759)/containers from 172.17.0.2:55204
I0607 17:18:16.652338  5370 http.cpp:936] Authorizing principal 'test-principal' to GET the
'/containers' endpoint
I0607 17:18:16.659453  5372 slave.cpp:817] Agent terminating
[       OK ] Endpoint/SlaveEndpointTest.NoAuthorizer/2 (50 ms)
[----------] 9 tests from Endpoint/SlaveEndpointTest (430 ms total)

[----------] Global test environment tear-down
[==========] 1585 tests from 176 test cases ran. (741871 ms total)
[  PASSED  ] 1580 tests.
[  FAILED  ] 5 tests, listed below:
[  FAILED  ] CommandExecutorCheckTest.CommandCheckDeliveredAndReconciled
[  FAILED  ] DefaultExecutorCheckTest.CommandCheckDeliveredAndReconciled
[  FAILED  ] DefaultExecutorCheckTest.CommandCheckStatusChange
[  FAILED  ] DefaultExecutorCheckTest.CommandCheckSeesParentsEnv
[  FAILED  ] DefaultExecutorCheckTest.CommandCheckSharesWorkDirWithTask

 5 FAILED TESTS
  YOU HAVE 22 DISABLED TESTS

E0607 17:18:16.809932  5377 process.cpp:968] Failed to accept socket: future discarded
make[4]: *** [check-local] Error 1
make[4]: Leaving directory `/mesos/mesos-1.4.0/_build/src'
make[3]: *** [check-am] Error 2
make[3]: Leaving directory `/mesos/mesos-1.4.0/_build/src'
make[2]: *** [check] Error 2
make[2]: Leaving directory `/mesos/mesos-1.4.0/_build/src'
make[1]: *** [check-recursive] Error 1
make[1]: Leaving directory `/mesos/mesos-1.4.0/_build'
make: *** [distcheck] Error 1
+ docker rmi mesos-1496850958-12816
Untagged: mesos-1496850958-12816:latest
Deleted: sha256:c3511cb731ba5801e03ef1e3db5124b64f104705f4eb25001a75ffbd716fce24
Deleted: sha256:28838d269b23306ef1e9e87f9dca9f4e49099bdbc09f6370d4fba10849a5c693
Deleted: sha256:05d07d8053add37eee6451d6c4c8ce1aba7f06246258a0fd23e23099af127292
Deleted: sha256:ec6ff476a593ceb40ce97aaa54126930f536fd9174655b76d7b003107629b338
Deleted: sha256:f4ff226f55be4295721ab984deb42e4cd4d8f8272a981eba443d1dbaa05d0209
Deleted: sha256:840748f496055d3b679fb7c9a3412005671904e74a7b6a93082dc7224467efd4
Deleted: sha256:bc48a9ecddbc6130bfa5d011e25a7499be51c739312090da15f78b6813ae106a
Deleted: sha256:f120229f1d65aee09c101d2353a850f70b7f914ace9249cd48462e00abed2c90
Deleted: sha256:0820dbf2310f0ba8678a4efc3b51cc7307668cf6153a862cc4575f267f7be9f6
Deleted: sha256:fa450c6c686a6c9184772d6e28f06b0a8d28b2c3e689d324d13c0ef2c3d7d919
Deleted: sha256:0b17f118c9995a4a741044bfeecefc417bb40757ea731d4ccbc1aef5258a8cd0
Deleted: sha256:99141cde3ab97a21b74615354ac278ff75d846bdd2273de74e3504b3ac75e7af
Deleted: sha256:e62b4e10bdf3159363d1898ae81cdea2579a182ec1b5f00183925952a2718d8f
Deleted: sha256:390463155d66ebea3f46e3efc62f92d58dd825309805c7d3b3cda9ee86abd909
Deleted: sha256:10782c6d86810fb25f15696a31102cd1f4862be518f6497784e8e4996d063ebf
Deleted: sha256:0f9fabc9cc77df9ec320ac262ca9828f537c8a3f783e0ef2deba2cf6db5b3271
Deleted: sha256:2f43e110f7a5c6ec15e38c885a0ce97a5f57cef933157c5fd6550dc90e6880a8
Deleted: sha256:712d45c882a037b720d76afec9c232e53e2115048da3362f9f341ce777345ff2
Deleted: sha256:557d0b221b33a6349d60691a55038413a9426818d0a08b237d82cb0bec20fc4e
Deleted: sha256:2860dc080a05341091c5fab58226a1e52272580a7743f93f044c23ac66f39caa
Deleted: sha256:0ee7886f75e3c6c269f387c13e90630585e2eaaf75bb1bd2f2baf403b60a3656
Deleted: sha256:4c79c7056fa7ec40e7c5a4a3f2b41a9a33bf23bbe8b3120039eccbabc02f228c
Deleted: sha256:2beb8bc6f919cb1bc21ec2f559e8d25f9a570653022c4e985106969d8e3e7e9d
Deleted: sha256:e7f389a5dc46f41747589c07e7505bd884fbce3993341d9adab3e725628bf02e
Deleted: sha256:1d636111e4ee1218bbc1c5da700ba47e8e18ee8b6937d86ca756910887d31354
Build step 'Execute shell' marked build as failure

Mime
View raw message