mesos-builds mailing list archives

Site index · List index
Message view « Date » · « Thread »
Top « Date » · « Thread »
From Apache Jenkins Server <jenk...@builds.apache.org>
Subject Build failed in Jenkins: Mesos-Buildbot » autotools,gcc,--verbose,GLOG_v=1 MESOS_VERBOSE=1,ubuntu:14.04,(ubuntu)&&(!ubuntu-us1)&&(!ubuntu-eu2) #3770
Date Tue, 06 Jun 2017 20:39:52 GMT
See <https://builds.apache.org/job/Mesos-Buildbot/BUILDTOOL=autotools,COMPILER=gcc,CONFIGURATION=--verbose,ENVIRONMENT=GLOG_v=1%20MESOS_VERBOSE=1,OS=ubuntu%3A14.04,label_exp=(ubuntu)&&(!ubuntu-us1)&&(!ubuntu-eu2)/3770/display/redirect?page=changes>

Changes:

[xujyan] Cleaned up use of 'this' pointers in dispatched callback.

------------------------------------------
[...truncated 28.07 MB...]
I0606 20:39:42.257694  4463 slave.cpp:281] Agent using credential for: test-principal
I0606 20:39:42.257760  4463 credentials.hpp:37] Loading credentials for authentication from
'/tmp/Endpoint_SlaveEndpointTest_AuthorizedRequest_2_SVJXtc/http_credentials'
I0606 20:39:42.258241  4463 http.cpp:975] Creating default 'basic' HTTP authenticator for
realm 'mesos-agent-readonly'
I0606 20:39:42.258605  4463 http.cpp:975] Creating default 'basic' HTTP authenticator for
realm 'mesos-agent-readwrite'
I0606 20:39:42.260107  4463 slave.cpp:552] Agent resources: cpus(*):2; mem(*):1024; disk(*):1024;
ports(*):[31000-32000]
I0606 20:39:42.260324  4463 slave.cpp:560] Agent attributes: [  ]
I0606 20:39:42.260411  4463 slave.cpp:565] Agent hostname: 47e95ae5b2ee
I0606 20:39:42.260774  4458 status_update_manager.cpp:177] Pausing sending status updates
I0606 20:39:42.262795  4458 state.cpp:62] Recovering state from '/tmp/Endpoint_SlaveEndpointTest_AuthorizedRequest_2_VHyVet/meta'
I0606 20:39:42.263411  4458 status_update_manager.cpp:203] Recovering status update manager
I0606 20:39:42.263731  4460 containerizer.cpp:582] Recovering containerizer
I0606 20:39:42.266595  4460 provisioner.cpp:416] Provisioner recovery complete
I0606 20:39:42.267117  4459 slave.cpp:6127] Finished recovery
I0606 20:39:42.268393  4459 slave.cpp:6309] Querying resource estimator for oversubscribable
resources
I0606 20:39:42.269338  4461 slave.cpp:6323] Received oversubscribable resources {} from the
resource estimator
I0606 20:39:42.273833  4457 process.cpp:3778] Handling HTTP event for process 'slave(756)'
with path: '/slave(756)/containers'
I0606 20:39:42.276005  4457 http.cpp:1115] HTTP GET for /slave(756)/containers from 172.17.0.3:54360
I0606 20:39:42.276357  4457 http.cpp:936] Authorizing principal 'test-principal' to GET the
'/containers' endpoint
I0606 20:39:42.283545  4438 slave.cpp:817] Agent terminating
[       OK ] Endpoint/SlaveEndpointTest.AuthorizedRequest/2 (49 ms)
[ RUN      ] Endpoint/SlaveEndpointTest.UnauthorizedRequest/0
I0606 20:39:42.300704  4438 containerizer.cpp:230] Using isolation: posix/cpu,posix/mem,filesystem/posix,network/cni,environment_secret
W0606 20:39:42.301738  4438 backend.cpp:76] Failed to create 'aufs' backend: AufsBackend requires
root privileges
W0606 20:39:42.302062  4438 backend.cpp:76] Failed to create 'bind' backend: BindBackend requires
root privileges
I0606 20:39:42.302111  4438 provisioner.cpp:255] Using default backend 'copy'
I0606 20:39:42.307332  4459 slave.cpp:248] Mesos agent started on (757)@172.17.0.3:38550
I0606 20:39:42.307358  4459 slave.cpp:249] Flags at startup: --acls="" --appc_simple_discovery_uri_prefix="http://"
--appc_store_dir="/tmp/Endpoint_SlaveEndpointTest_UnauthorizedRequest_0_7bgzV7/store/appc"
--authenticate_http_readonly="true" --authenticate_http_readwrite="true" --authenticatee="crammd5"
--authentication_backoff_factor="1secs" --authorizer="local" --cgroups_cpu_enable_pids_and_tids_count="false"
--cgroups_enable_cfs="false" --cgroups_hierarchy="/sys/fs/cgroup" --cgroups_limit_swap="false"
--cgroups_root="mesos" --container_disk_watch_interval="15secs" --containerizers="mesos" --credential="/tmp/Endpoint_SlaveEndpointTest_UnauthorizedRequest_0_7bgzV7/credential"
--default_role="*" --disk_watch_interval="1mins" --docker="docker" --docker_kill_orphans="true"
--docker_registry="https://registry-1.docker.io" --docker_remove_delay="6hrs" --docker_socket="/var/run/docker.sock"
--docker_stop_timeout="0ns" --docker_store_dir="/tmp/Endpoint_SlaveEndpointTest_UnauthorizedRequest_0_7bgzV7/store/docker"
--docker_volume_checkpoint_dir="/var/run/mesos/isolators/docker/volume" --enforce_container_disk_quota="false"
--executor_registration_timeout="1mins" --executor_reregistration_timeout="2secs" --executor_shutdown_grace_period="5secs"
--fetcher_cache_dir="/tmp/Endpoint_SlaveEndpointTest_UnauthorizedRequest_0_7bgzV7/fetch" --fetcher_cache_size="2GB"
--frameworks_home="" --gc_delay="1weeks" --gc_disk_headroom="0.1" --hadoop_home="" --help="false"
--hostname_lookup="true" --http_command_executor="false" --http_credentials="/tmp/Endpoint_SlaveEndpointTest_UnauthorizedRequest_0_7bgzV7/http_credentials"
--http_heartbeat_interval="30secs" --initialize_driver_logging="true" --isolation="posix/cpu,posix/mem"
--launcher="posix" --launcher_dir="/mesos/mesos-1.4.0/_build/src" --logbufsecs="0" --logging_level="INFO"
--max_completed_executors_per_framework="150" --oversubscribed_resources_interval="15secs"
--perf_duration="10secs" --perf_interval="1mins" --port="5051" --qos_correction_interval_min="0ns"
--quiet="false" --recover="reconnect" --recovery_timeout="15mins" --registration_backoff_factor="10ms"
--resources="cpus:2;gpus:0;mem:1024;disk:1024;ports:[31000-32000]" --revocable_cpu_low_priority="true"
--runtime_dir="/tmp/Endpoint_SlaveEndpointTest_UnauthorizedRequest_0_7bgzV7" --sandbox_directory="/mnt/mesos/sandbox"
--strict="true" --switch_user="true" --systemd_enable_support="true" --systemd_runtime_directory="/run/systemd/system"
--version="false" --work_dir="/tmp/Endpoint_SlaveEndpointTest_UnauthorizedRequest_0_DX8Lxo"
I0606 20:39:42.307867  4459 credentials.hpp:86] Loading credential for authentication from
'/tmp/Endpoint_SlaveEndpointTest_UnauthorizedRequest_0_7bgzV7/credential'
I0606 20:39:42.308038  4459 slave.cpp:281] Agent using credential for: test-principal
I0606 20:39:42.308065  4459 credentials.hpp:37] Loading credentials for authentication from
'/tmp/Endpoint_SlaveEndpointTest_UnauthorizedRequest_0_7bgzV7/http_credentials'
I0606 20:39:42.308564  4459 http.cpp:975] Creating default 'basic' HTTP authenticator for
realm 'mesos-agent-readonly'
I0606 20:39:42.308960  4459 http.cpp:975] Creating default 'basic' HTTP authenticator for
realm 'mesos-agent-readwrite'
I0606 20:39:42.310693  4459 slave.cpp:552] Agent resources: cpus(*):2; mem(*):1024; disk(*):1024;
ports(*):[31000-32000]
I0606 20:39:42.310782  4459 slave.cpp:560] Agent attributes: [  ]
I0606 20:39:42.310796  4459 slave.cpp:565] Agent hostname: 47e95ae5b2ee
I0606 20:39:42.311019  4461 status_update_manager.cpp:177] Pausing sending status updates
I0606 20:39:42.313659  4459 state.cpp:62] Recovering state from '/tmp/Endpoint_SlaveEndpointTest_UnauthorizedRequest_0_DX8Lxo/meta'
I0606 20:39:42.314093  4460 status_update_manager.cpp:203] Recovering status update manager
I0606 20:39:42.314357  4460 containerizer.cpp:582] Recovering containerizer
I0606 20:39:42.316880  4457 provisioner.cpp:416] Provisioner recovery complete
I0606 20:39:42.317581  4458 slave.cpp:6127] Finished recovery
I0606 20:39:42.318294  4458 slave.cpp:6309] Querying resource estimator for oversubscribable
resources
I0606 20:39:42.318922  4458 slave.cpp:6323] Received oversubscribable resources {} from the
resource estimator
I0606 20:39:42.323590  4464 process.cpp:3778] Handling HTTP event for process 'slave(757)'
with path: '/slave(757)/monitor/statistics'
I0606 20:39:42.325816  4464 http.cpp:1115] HTTP GET for /slave(757)/monitor/statistics from
172.17.0.3:54362
I0606 20:39:42.325896  4464 http.cpp:936] Authorizing principal 'test-principal' to GET the
'/monitor/statistics' endpoint
I0606 20:39:42.330044  4463 slave.cpp:817] Agent terminating
[       OK ] Endpoint/SlaveEndpointTest.UnauthorizedRequest/0 (45 ms)
[ RUN      ] Endpoint/SlaveEndpointTest.UnauthorizedRequest/1
I0606 20:39:42.345445  4438 containerizer.cpp:230] Using isolation: posix/cpu,posix/mem,filesystem/posix,network/cni,environment_secret
W0606 20:39:42.346469  4438 backend.cpp:76] Failed to create 'aufs' backend: AufsBackend requires
root privileges
W0606 20:39:42.346810  4438 backend.cpp:76] Failed to create 'bind' backend: BindBackend requires
root privileges
I0606 20:39:42.346858  4438 provisioner.cpp:255] Using default backend 'copy'
I0606 20:39:42.351281  4461 slave.cpp:248] Mesos agent started on (758)@172.17.0.3:38550
I0606 20:39:42.351415  4461 slave.cpp:249] Flags at startup: --acls="" --appc_simple_discovery_uri_prefix="http://"
--appc_store_dir="/tmp/Endpoint_SlaveEndpointTest_UnauthorizedRequest_1_MQrFT3/store/appc"
--authenticate_http_readonly="true" --authenticate_http_readwrite="true" --authenticatee="crammd5"
--authentication_backoff_factor="1secs" --authorizer="local" --cgroups_cpu_enable_pids_and_tids_count="false"
--cgroups_enable_cfs="false" --cgroups_hierarchy="/sys/fs/cgroup" --cgroups_limit_swap="false"
--cgroups_root="mesos" --container_disk_watch_interval="15secs" --containerizers="mesos" --credential="/tmp/Endpoint_SlaveEndpointTest_UnauthorizedRequest_1_MQrFT3/credential"
--default_role="*" --disk_watch_interval="1mins" --docker="docker" --docker_kill_orphans="true"
--docker_registry="https://registry-1.docker.io" --docker_remove_delay="6hrs" --docker_socket="/var/run/docker.sock"
--docker_stop_timeout="0ns" --docker_store_dir="/tmp/Endpoint_SlaveEndpointTest_UnauthorizedRequest_1_MQrFT3/store/docker"
--docker_volume_checkpoint_dir="/var/run/mesos/isolators/docker/volume" --enforce_container_disk_quota="false"
--executor_registration_timeout="1mins" --executor_reregistration_timeout="2secs" --executor_shutdown_grace_period="5secs"
--fetcher_cache_dir="/tmp/Endpoint_SlaveEndpointTest_UnauthorizedRequest_1_MQrFT3/fetch" --fetcher_cache_size="2GB"
--frameworks_home="" --gc_delay="1weeks" --gc_disk_headroom="0.1" --hadoop_home="" --help="false"
--hostname_lookup="true" --http_command_executor="false" --http_credentials="/tmp/Endpoint_SlaveEndpointTest_UnauthorizedRequest_1_MQrFT3/http_credentials"
--http_heartbeat_interval="30secs" --initialize_driver_logging="true" --isolation="posix/cpu,posix/mem"
--launcher="posix" --launcher_dir="/mesos/mesos-1.4.0/_build/src" --logbufsecs="0" --logging_level="INFO"
--max_completed_executors_per_framework="150" --oversubscribed_resources_interval="15secs"
--perf_duration="10secs" --perf_interval="1mins" --port="5051" --qos_correction_interval_min="0ns"
--quiet="false" --recover="reconnect" --recovery_timeout="15mins" --registration_backoff_factor="10ms"
--resources="cpus:2;gpus:0;mem:1024;disk:1024;ports:[31000-32000]" --revocable_cpu_low_priority="true"
--runtime_dir="/tmp/Endpoint_SlaveEndpointTest_UnauthorizedRequest_1_MQrFT3" --sandbox_directory="/mnt/mesos/sandbox"
--strict="true" --switch_user="true" --systemd_enable_support="true" --systemd_runtime_directory="/run/systemd/system"
--version="false" --work_dir="/tmp/Endpoint_SlaveEndpointTest_UnauthorizedRequest_1_HJ4Ynk"
I0606 20:39:42.351841  4461 credentials.hpp:86] Loading credential for authentication from
'/tmp/Endpoint_SlaveEndpointTest_UnauthorizedRequest_1_MQrFT3/credential'
I0606 20:39:42.353410  4461 slave.cpp:281] Agent using credential for: test-principal
I0606 20:39:42.353442  4461 credentials.hpp:37] Loading credentials for authentication from
'/tmp/Endpoint_SlaveEndpointTest_UnauthorizedRequest_1_MQrFT3/http_credentials'
I0606 20:39:42.353682  4461 http.cpp:975] Creating default 'basic' HTTP authenticator for
realm 'mesos-agent-readonly'
I0606 20:39:42.353857  4461 http.cpp:975] Creating default 'basic' HTTP authenticator for
realm 'mesos-agent-readwrite'
I0606 20:39:42.355347  4461 slave.cpp:552] Agent resources: cpus(*):2; mem(*):1024; disk(*):1024;
ports(*):[31000-32000]
I0606 20:39:42.355429  4461 slave.cpp:560] Agent attributes: [  ]
I0606 20:39:42.355443  4461 slave.cpp:565] Agent hostname: 47e95ae5b2ee
I0606 20:39:42.355660  4458 status_update_manager.cpp:177] Pausing sending status updates
I0606 20:39:42.357204  4461 state.cpp:62] Recovering state from '/tmp/Endpoint_SlaveEndpointTest_UnauthorizedRequest_1_HJ4Ynk/meta'
I0606 20:39:42.357884  4462 status_update_manager.cpp:203] Recovering status update manager
I0606 20:39:42.358358  4458 containerizer.cpp:582] Recovering containerizer
I0606 20:39:42.361234  4462 provisioner.cpp:416] Provisioner recovery complete
I0606 20:39:42.361706  4461 slave.cpp:6127] Finished recovery
I0606 20:39:42.362447  4461 slave.cpp:6309] Querying resource estimator for oversubscribable
resources
I0606 20:39:42.362957  4463 slave.cpp:6323] Received oversubscribable resources {} from the
resource estimator
I0606 20:39:42.367875  4463 process.cpp:3778] Handling HTTP event for process 'slave(758)'
with path: '/slave(758)/monitor/statistics.json'
I0606 20:39:42.370599  4459 http.cpp:1115] HTTP GET for /slave(758)/monitor/statistics.json
from 172.17.0.3:54364
I0606 20:39:42.371446  4459 http.cpp:936] Authorizing principal 'test-principal' to GET the
'/monitor/statistics.json' endpoint
I0606 20:39:42.377317  4460 slave.cpp:817] Agent terminating
[       OK ] Endpoint/SlaveEndpointTest.UnauthorizedRequest/1 (53 ms)
[ RUN      ] Endpoint/SlaveEndpointTest.UnauthorizedRequest/2
I0606 20:39:42.398303  4438 containerizer.cpp:230] Using isolation: posix/cpu,posix/mem,filesystem/posix,network/cni,environment_secret
W0606 20:39:42.398972  4438 backend.cpp:76] Failed to create 'aufs' backend: AufsBackend requires
root privileges
W0606 20:39:42.399225  4438 backend.cpp:76] Failed to create 'bind' backend: BindBackend requires
root privileges
I0606 20:39:42.399273  4438 provisioner.cpp:255] Using default backend 'copy'
I0606 20:39:42.404112  4462 slave.cpp:248] Mesos agent started on (759)@172.17.0.3:38550
I0606 20:39:42.404146  4462 slave.cpp:249] Flags at startup: --acls="" --appc_simple_discovery_uri_prefix="http://"
--appc_store_dir="/tmp/Endpoint_SlaveEndpointTest_UnauthorizedRequest_2_VIEsr0/store/appc"
--authenticate_http_readonly="true" --authenticate_http_readwrite="true" --authenticatee="crammd5"
--authentication_backoff_factor="1secs" --authorizer="local" --cgroups_cpu_enable_pids_and_tids_count="false"
--cgroups_enable_cfs="false" --cgroups_hierarchy="/sys/fs/cgroup" --cgroups_limit_swap="false"
--cgroups_root="mesos" --container_disk_watch_interval="15secs" --containerizers="mesos" --credential="/tmp/Endpoint_SlaveEndpointTest_UnauthorizedRequest_2_VIEsr0/credential"
--default_role="*" --disk_watch_interval="1mins" --docker="docker" --docker_kill_orphans="true"
--docker_registry="https://registry-1.docker.io" --docker_remove_delay="6hrs" --docker_socket="/var/run/docker.sock"
--docker_stop_timeout="0ns" --docker_store_dir="/tmp/Endpoint_SlaveEndpointTest_UnauthorizedRequest_2_VIEsr0/store/docker"
--docker_volume_checkpoint_dir="/var/run/mesos/isolators/docker/volume" --enforce_container_disk_quota="false"
--executor_registration_timeout="1mins" --executor_reregistration_timeout="2secs" --executor_shutdown_grace_period="5secs"
--fetcher_cache_dir="/tmp/Endpoint_SlaveEndpointTest_UnauthorizedRequest_2_VIEsr0/fetch" --fetcher_cache_size="2GB"
--frameworks_home="" --gc_delay="1weeks" --gc_disk_headroom="0.1" --hadoop_home="" --help="false"
--hostname_lookup="true" --http_command_executor="false" --http_credentials="/tmp/Endpoint_SlaveEndpointTest_UnauthorizedRequest_2_VIEsr0/http_credentials"
--http_heartbeat_interval="30secs" --initialize_driver_logging="true" --isolation="posix/cpu,posix/mem"
--launcher="posix" --launcher_dir="/mesos/mesos-1.4.0/_build/src" --logbufsecs="0" --logging_level="INFO"
--max_completed_executors_per_framework="150" --oversubscribed_resources_interval="15secs"
--perf_duration="10secs" --perf_interval="1mins" --port="5051" --qos_correction_interval_min="0ns"
--quiet="false" --recover="reconnect" --recovery_timeout="15mins" --registration_backoff_factor="10ms"
--resources="cpus:2;gpus:0;mem:1024;disk:1024;ports:[31000-32000]" --revocable_cpu_low_priority="true"
--runtime_dir="/tmp/Endpoint_SlaveEndpointTest_UnauthorizedRequest_2_VIEsr0" --sandbox_directory="/mnt/mesos/sandbox"
--strict="true" --switch_user="true" --systemd_enable_support="true" --systemd_runtime_directory="/run/systemd/system"
--version="false" --work_dir="/tmp/Endpoint_SlaveEndpointTest_UnauthorizedRequest_2_f3psMg"
I0606 20:39:42.404597  4462 credentials.hpp:86] Loading credential for authentication from
'/tmp/Endpoint_SlaveEndpointTest_UnauthorizedRequest_2_VIEsr0/credential'
I0606 20:39:42.404764  4462 slave.cpp:281] Agent using credential for: test-principal
I0606 20:39:42.404811  4462 credentials.hpp:37] Loading credentials for authentication from
'/tmp/Endpoint_SlaveEndpointTest_UnauthorizedRequest_2_VIEsr0/http_credentials'
I0606 20:39:42.405267  4462 http.cpp:975] Creating default 'basic' HTTP authenticator for
realm 'mesos-agent-readonly'
I0606 20:39:42.405426  4462 http.cpp:975] Creating default 'basic' HTTP authenticator for
realm 'mesos-agent-readwrite'
I0606 20:39:42.407232  4462 slave.cpp:552] Agent resources: cpus(*):2; mem(*):1024; disk(*):1024;
ports(*):[31000-32000]
I0606 20:39:42.407315  4462 slave.cpp:560] Agent attributes: [  ]
I0606 20:39:42.407336  4462 slave.cpp:565] Agent hostname: 47e95ae5b2ee
I0606 20:39:42.407820  4463 status_update_manager.cpp:177] Pausing sending status updates
I0606 20:39:42.409709  4461 state.cpp:62] Recovering state from '/tmp/Endpoint_SlaveEndpointTest_UnauthorizedRequest_2_f3psMg/meta'
I0606 20:39:42.410676  4461 status_update_manager.cpp:203] Recovering status update manager
I0606 20:39:42.411069  4459 containerizer.cpp:582] Recovering containerizer
I0606 20:39:42.414310  4458 provisioner.cpp:416] Provisioner recovery complete
I0606 20:39:42.415009  4460 slave.cpp:6127] Finished recovery
I0606 20:39:42.416167  4460 slave.cpp:6309] Querying resource estimator for oversubscribable
resources
I0606 20:39:42.417217  4460 slave.cpp:6323] Received oversubscribable resources {} from the
resource estimator
I0606 20:39:42.420778  4459 process.cpp:3778] Handling HTTP event for process 'slave(759)'
with path: '/slave(759)/containers'
I0606 20:39:42.422365  4460 http.cpp:1115] HTTP GET for /slave(759)/containers from 172.17.0.3:54366
I0606 20:39:42.422953  4460 http.cpp:936] Authorizing principal 'test-principal' to GET the
'/containers' endpoint
I0606 20:39:42.427435  4438 slave.cpp:817] Agent terminating
[       OK ] Endpoint/SlaveEndpointTest.UnauthorizedRequest/2 (41 ms)
[ RUN      ] Endpoint/SlaveEndpointTest.NoAuthorizer/0
I0606 20:39:42.439128  4438 containerizer.cpp:230] Using isolation: posix/cpu,posix/mem,filesystem/posix,network/cni,environment_secret
W0606 20:39:42.439821  4438 backend.cpp:76] Failed to create 'aufs' backend: AufsBackend requires
root privileges
W0606 20:39:42.440068  4438 backend.cpp:76] Failed to create 'bind' backend: BindBackend requires
root privileges
I0606 20:39:42.440111  4438 provisioner.cpp:255] Using default backend 'copy'
I0606 20:39:42.442474  4438 cluster.cpp:448] Creating default 'local' authorizer
I0606 20:39:42.444280  4462 slave.cpp:248] Mesos agent started on (760)@172.17.0.3:38550
I0606 20:39:42.444314  4462 slave.cpp:249] Flags at startup: --acls="" --appc_simple_discovery_uri_prefix="http://"
--appc_store_dir="/tmp/Endpoint_SlaveEndpointTest_NoAuthorizer_0_qu6yuX/store/appc" --authenticate_http_readonly="true"
--authenticate_http_readwrite="true" --authenticatee="crammd5" --authentication_backoff_factor="1secs"
--authorizer="local" --cgroups_cpu_enable_pids_and_tids_count="false" --cgroups_enable_cfs="false"
--cgroups_hierarchy="/sys/fs/cgroup" --cgroups_limit_swap="false" --cgroups_root="mesos" --container_disk_watch_interval="15secs"
--containerizers="mesos" --credential="/tmp/Endpoint_SlaveEndpointTest_NoAuthorizer_0_qu6yuX/credential"
--default_role="*" --disk_watch_interval="1mins" --docker="docker" --docker_kill_orphans="true"
--docker_registry="https://registry-1.docker.io" --docker_remove_delay="6hrs" --docker_socket="/var/run/docker.sock"
--docker_stop_timeout="0ns" --docker_store_dir="/tmp/Endpoint_SlaveEndpointTest_NoAuthorizer_0_qu6yuX/store/docker"
--docker_volume_checkpoint_dir="/var/run/mesos/isolators/docker/volume" --enforce_container_disk_quota="false"
--executor_registration_timeout="1mins" --executor_reregistration_timeout="2secs" --executor_shutdown_grace_period="5secs"
--fetcher_cache_dir="/tmp/Endpoint_SlaveEndpointTest_NoAuthorizer_0_qu6yuX/fetch" --fetcher_cache_size="2GB"
--frameworks_home="" --gc_delay="1weeks" --gc_disk_headroom="0.1" --hadoop_home="" --help="false"
--hostname_lookup="true" --http_command_executor="false" --http_credentials="/tmp/Endpoint_SlaveEndpointTest_NoAuthorizer_0_qu6yuX/http_credentials"
--http_heartbeat_interval="30secs" --initialize_driver_logging="true" --isolation="posix/cpu,posix/mem"
--launcher="posix" --launcher_dir="/mesos/mesos-1.4.0/_build/src" --logbufsecs="0" --logging_level="INFO"
--max_completed_executors_per_framework="150" --oversubscribed_resources_interval="15secs"
--perf_duration="10secs" --perf_interval="1mins" --port="5051" --qos_correction_interval_min="0ns"
--quiet="false" --recover="reconnect" --recovery_timeout="15mins" --registration_backoff_factor="10ms"
--resources="cpus:2;gpus:0;mem:1024;disk:1024;ports:[31000-32000]" --revocable_cpu_low_priority="true"
--runtime_dir="/tmp/Endpoint_SlaveEndpointTest_NoAuthorizer_0_qu6yuX" --sandbox_directory="/mnt/mesos/sandbox"
--strict="true" --switch_user="true" --systemd_enable_support="true" --systemd_runtime_directory="/run/systemd/system"
--version="false" --work_dir="/tmp/Endpoint_SlaveEndpointTest_NoAuthorizer_0_m2ZiId"
I0606 20:39:42.445286  4462 credentials.hpp:86] Loading credential for authentication from
'/tmp/Endpoint_SlaveEndpointTest_NoAuthorizer_0_qu6yuX/credential'
I0606 20:39:42.445490  4462 slave.cpp:281] Agent using credential for: test-principal
I0606 20:39:42.445521  4462 credentials.hpp:37] Loading credentials for authentication from
'/tmp/Endpoint_SlaveEndpointTest_NoAuthorizer_0_qu6yuX/http_credentials'
I0606 20:39:42.445935  4462 http.cpp:975] Creating default 'basic' HTTP authenticator for
realm 'mesos-agent-readonly'
I0606 20:39:42.446255  4462 http.cpp:975] Creating default 'basic' HTTP authenticator for
realm 'mesos-agent-readwrite'
I0606 20:39:42.448029  4462 slave.cpp:552] Agent resources: cpus(*):2; mem(*):1024; disk(*):1024;
ports(*):[31000-32000]
I0606 20:39:42.448113  4462 slave.cpp:560] Agent attributes: [  ]
I0606 20:39:42.448127  4462 slave.cpp:565] Agent hostname: 47e95ae5b2ee
I0606 20:39:42.448374  4461 status_update_manager.cpp:177] Pausing sending status updates
I0606 20:39:42.450847  4462 state.cpp:62] Recovering state from '/tmp/Endpoint_SlaveEndpointTest_NoAuthorizer_0_m2ZiId/meta'
I0606 20:39:42.451359  4462 status_update_manager.cpp:203] Recovering status update manager
I0606 20:39:42.451877  4459 containerizer.cpp:582] Recovering containerizer
I0606 20:39:42.454147  4464 provisioner.cpp:416] Provisioner recovery complete
I0606 20:39:42.454839  4464 slave.cpp:6127] Finished recovery
I0606 20:39:42.455780  4464 slave.cpp:6309] Querying resource estimator for oversubscribable
resources
I0606 20:39:42.456197  4461 slave.cpp:6323] Received oversubscribable resources {} from the
resource estimator
I0606 20:39:42.461895  4459 process.cpp:3778] Handling HTTP event for process 'slave(760)'
with path: '/slave(760)/monitor/statistics'
I0606 20:39:42.465011  4459 http.cpp:1115] HTTP GET for /slave(760)/monitor/statistics from
172.17.0.3:54368
I0606 20:39:42.465184  4459 http.cpp:936] Authorizing principal 'test-principal' to GET the
'/monitor/statistics' endpoint
I0606 20:39:42.471470  4438 slave.cpp:817] Agent terminating
[       OK ] Endpoint/SlaveEndpointTest.NoAuthorizer/0 (70 ms)
[ RUN      ] Endpoint/SlaveEndpointTest.NoAuthorizer/1
I0606 20:39:42.514045  4438 containerizer.cpp:230] Using isolation: posix/cpu,posix/mem,filesystem/posix,network/cni,environment_secret
W0606 20:39:42.514776  4438 backend.cpp:76] Failed to create 'aufs' backend: AufsBackend requires
root privileges
W0606 20:39:42.514992  4438 backend.cpp:76] Failed to create 'bind' backend: BindBackend requires
root privileges
I0606 20:39:42.515072  4438 provisioner.cpp:255] Using default backend 'copy'
I0606 20:39:42.517860  4438 cluster.cpp:448] Creating default 'local' authorizer
I0606 20:39:42.521078  4463 slave.cpp:248] Mesos agent started on (761)@172.17.0.3:38550
I0606 20:39:42.521175  4463 slave.cpp:249] Flags at startup: --acls="" --appc_simple_discovery_uri_prefix="http://"
--appc_store_dir="/tmp/Endpoint_SlaveEndpointTest_NoAuthorizer_1_EssPgV/store/appc" --authenticate_http_readonly="true"
--authenticate_http_readwrite="true" --authenticatee="crammd5" --authentication_backoff_factor="1secs"
--authorizer="local" --cgroups_cpu_enable_pids_and_tids_count="false" --cgroups_enable_cfs="false"
--cgroups_hierarchy="/sys/fs/cgroup" --cgroups_limit_swap="false" --cgroups_root="mesos" --container_disk_watch_interval="15secs"
--containerizers="mesos" --credential="/tmp/Endpoint_SlaveEndpointTest_NoAuthorizer_1_EssPgV/credential"
--default_role="*" --disk_watch_interval="1mins" --docker="docker" --docker_kill_orphans="true"
--docker_registry="https://registry-1.docker.io" --docker_remove_delay="6hrs" --docker_socket="/var/run/docker.sock"
--docker_stop_timeout="0ns" --docker_store_dir="/tmp/Endpoint_SlaveEndpointTest_NoAuthorizer_1_EssPgV/store/docker"
--docker_volume_checkpoint_dir="/var/run/mesos/isolators/docker/volume" --enforce_container_disk_quota="false"
--executor_registration_timeout="1mins" --executor_reregistration_timeout="2secs" --executor_shutdown_grace_period="5secs"
--fetcher_cache_dir="/tmp/Endpoint_SlaveEndpointTest_NoAuthorizer_1_EssPgV/fetch" --fetcher_cache_size="2GB"
--frameworks_home="" --gc_delay="1weeks" --gc_disk_headroom="0.1" --hadoop_home="" --help="false"
--hostname_lookup="true" --http_command_executor="false" --http_credentials="/tmp/Endpoint_SlaveEndpointTest_NoAuthorizer_1_EssPgV/http_credentials"
--http_heartbeat_interval="30secs" --initialize_driver_logging="true" --isolation="posix/cpu,posix/mem"
--launcher="posix" --launcher_dir="/mesos/mesos-1.4.0/_build/src" --logbufsecs="0" --logging_level="INFO"
--max_completed_executors_per_framework="150" --oversubscribed_resources_interval="15secs"
--perf_duration="10secs" --perf_interval="1mins" --port="5051" --qos_correction_interval_min="0ns"
--quiet="false" --recover="reconnect" --recovery_timeout="15mins" --registration_backoff_factor="10ms"
--resources="cpus:2;gpus:0;mem:1024;disk:1024;ports:[31000-32000]" --revocable_cpu_low_priority="true"
--runtime_dir="/tmp/Endpoint_SlaveEndpointTest_NoAuthorizer_1_EssPgV" --sandbox_directory="/mnt/mesos/sandbox"
--strict="true" --switch_user="true" --systemd_enable_support="true" --systemd_runtime_directory="/run/systemd/system"
--version="false" --work_dir="/tmp/Endpoint_SlaveEndpointTest_NoAuthorizer_1_sAGEhb"
I0606 20:39:42.522035  4463 credentials.hpp:86] Loading credential for authentication from
'/tmp/Endpoint_SlaveEndpointTest_NoAuthorizer_1_EssPgV/credential'
I0606 20:39:42.522406  4463 slave.cpp:281] Agent using credential for: test-principal
I0606 20:39:42.522459  4463 credentials.hpp:37] Loading credentials for authentication from
'/tmp/Endpoint_SlaveEndpointTest_NoAuthorizer_1_EssPgV/http_credentials'
I0606 20:39:42.522811  4463 http.cpp:975] Creating default 'basic' HTTP authenticator for
realm 'mesos-agent-readonly'
I0606 20:39:42.523203  4463 http.cpp:975] Creating default 'basic' HTTP authenticator for
realm 'mesos-agent-readwrite'
I0606 20:39:42.524920  4463 slave.cpp:552] Agent resources: cpus(*):2; mem(*):1024; disk(*):1024;
ports(*):[31000-32000]
I0606 20:39:42.525027  4463 slave.cpp:560] Agent attributes: [  ]
I0606 20:39:42.525068  4463 slave.cpp:565] Agent hostname: 47e95ae5b2ee
I0606 20:39:42.525302  4457 status_update_manager.cpp:177] Pausing sending status updates
I0606 20:39:42.527134  4458 state.cpp:62] Recovering state from '/tmp/Endpoint_SlaveEndpointTest_NoAuthorizer_1_sAGEhb/meta'
I0606 20:39:42.527796  4460 status_update_manager.cpp:203] Recovering status update manager
I0606 20:39:42.528128  4460 containerizer.cpp:582] Recovering containerizer
I0606 20:39:42.530719  4464 provisioner.cpp:416] Provisioner recovery complete
I0606 20:39:42.531373  4460 slave.cpp:6127] Finished recovery
I0606 20:39:42.532336  4460 slave.cpp:6309] Querying resource estimator for oversubscribable
resources
I0606 20:39:42.532753  4460 slave.cpp:6323] Received oversubscribable resources {} from the
resource estimator
I0606 20:39:42.539244  4462 process.cpp:3778] Handling HTTP event for process 'slave(761)'
with path: '/slave(761)/monitor/statistics.json'
I0606 20:39:42.541492  4462 http.cpp:1115] HTTP GET for /slave(761)/monitor/statistics.json
from 172.17.0.3:54370
I0606 20:39:42.541592  4462 http.cpp:936] Authorizing principal 'test-principal' to GET the
'/monitor/statistics.json' endpoint
I0606 20:39:42.548741  4438 slave.cpp:817] Agent terminating
[       OK ] Endpoint/SlaveEndpointTest.NoAuthorizer/1 (63 ms)
[ RUN      ] Endpoint/SlaveEndpointTest.NoAuthorizer/2
I0606 20:39:42.577168  4438 containerizer.cpp:230] Using isolation: posix/cpu,posix/mem,filesystem/posix,network/cni,environment_secret
W0606 20:39:42.577935  4438 backend.cpp:76] Failed to create 'aufs' backend: AufsBackend requires
root privileges
W0606 20:39:42.578063  4438 backend.cpp:76] Failed to create 'bind' backend: BindBackend requires
root privileges
I0606 20:39:42.578181  4438 provisioner.cpp:255] Using default backend 'copy'
I0606 20:39:42.580677  4438 cluster.cpp:448] Creating default 'local' authorizer
I0606 20:39:42.582804  4458 slave.cpp:248] Mesos agent started on (762)@172.17.0.3:38550
I0606 20:39:42.582836  4458 slave.cpp:249] Flags at startup: --acls="" --appc_simple_discovery_uri_prefix="http://"
--appc_store_dir="/tmp/Endpoint_SlaveEndpointTest_NoAuthorizer_2_T1t9NT/store/appc" --authenticate_http_readonly="true"
--authenticate_http_readwrite="true" --authenticatee="crammd5" --authentication_backoff_factor="1secs"
--authorizer="local" --cgroups_cpu_enable_pids_and_tids_count="false" --cgroups_enable_cfs="false"
--cgroups_hierarchy="/sys/fs/cgroup" --cgroups_limit_swap="false" --cgroups_root="mesos" --container_disk_watch_interval="15secs"
--containerizers="mesos" --credential="/tmp/Endpoint_SlaveEndpointTest_NoAuthorizer_2_T1t9NT/credential"
--default_role="*" --disk_watch_interval="1mins" --docker="docker" --docker_kill_orphans="true"
--docker_registry="https://registry-1.docker.io" --docker_remove_delay="6hrs" --docker_socket="/var/run/docker.sock"
--docker_stop_timeout="0ns" --docker_store_dir="/tmp/Endpoint_SlaveEndpointTest_NoAuthorizer_2_T1t9NT/store/docker"
--docker_volume_checkpoint_dir="/var/run/mesos/isolators/docker/volume" --enforce_container_disk_quota="false"
--executor_registration_timeout="1mins" --executor_reregistration_timeout="2secs" --executor_shutdown_grace_period="5secs"
--fetcher_cache_dir="/tmp/Endpoint_SlaveEndpointTest_NoAuthorizer_2_T1t9NT/fetch" --fetcher_cache_size="2GB"
--frameworks_home="" --gc_delay="1weeks" --gc_disk_headroom="0.1" --hadoop_home="" --help="false"
--hostname_lookup="true" --http_command_executor="false" --http_credentials="/tmp/Endpoint_SlaveEndpointTest_NoAuthorizer_2_T1t9NT/http_credentials"
--http_heartbeat_interval="30secs" --initialize_driver_logging="true" --isolation="posix/cpu,posix/mem"
--launcher="posix" --launcher_dir="/mesos/mesos-1.4.0/_build/src" --logbufsecs="0" --logging_level="INFO"
--max_completed_executors_per_framework="150" --oversubscribed_resources_interval="15secs"
--perf_duration="10secs" --perf_interval="1mins" --port="5051" --qos_correction_interval_min="0ns"
--quiet="false" --recover="reconnect" --recovery_timeout="15mins" --registration_backoff_factor="10ms"
--resources="cpus:2;gpus:0;mem:1024;disk:1024;ports:[31000-32000]" --revocable_cpu_low_priority="true"
--runtime_dir="/tmp/Endpoint_SlaveEndpointTest_NoAuthorizer_2_T1t9NT" --sandbox_directory="/mnt/mesos/sandbox"
--strict="true" --switch_user="true" --systemd_enable_support="true" --systemd_runtime_directory="/run/systemd/system"
--version="false" --work_dir="/tmp/Endpoint_SlaveEndpointTest_NoAuthorizer_2_aB8LD9"
I0606 20:39:42.583225  4458 credentials.hpp:86] Loading credential for authentication from
'/tmp/Endpoint_SlaveEndpointTest_NoAuthorizer_2_T1t9NT/credential'
I0606 20:39:42.583428  4458 slave.cpp:281] Agent using credential for: test-principal
I0606 20:39:42.583458  4458 credentials.hpp:37] Loading credentials for authentication from
'/tmp/Endpoint_SlaveEndpointTest_NoAuthorizer_2_T1t9NT/http_credentials'
I0606 20:39:42.583710  4458 http.cpp:975] Creating default 'basic' HTTP authenticator for
realm 'mesos-agent-readonly'
I0606 20:39:42.583894  4458 http.cpp:975] Creating default 'basic' HTTP authenticator for
realm 'mesos-agent-readwrite'
I0606 20:39:42.585657  4458 slave.cpp:552] Agent resources: cpus(*):2; mem(*):1024; disk(*):1024;
ports(*):[31000-32000]
I0606 20:39:42.585741  4458 slave.cpp:560] Agent attributes: [  ]
I0606 20:39:42.585755  4458 slave.cpp:565] Agent hostname: 47e95ae5b2ee
I0606 20:39:42.586002  4459 status_update_manager.cpp:177] Pausing sending status updates
I0606 20:39:42.587714  4460 state.cpp:62] Recovering state from '/tmp/Endpoint_SlaveEndpointTest_NoAuthorizer_2_aB8LD9/meta'
I0606 20:39:42.588416  4460 status_update_manager.cpp:203] Recovering status update manager
I0606 20:39:42.588670  4460 containerizer.cpp:582] Recovering containerizer
I0606 20:39:42.590792  4464 provisioner.cpp:416] Provisioner recovery complete
I0606 20:39:42.591377  4460 slave.cpp:6127] Finished recovery
I0606 20:39:42.592072  4460 slave.cpp:6309] Querying resource estimator for oversubscribable
resources
I0606 20:39:42.592550  4463 slave.cpp:6323] Received oversubscribable resources {} from the
resource estimator
I0606 20:39:42.596557  4462 process.cpp:3778] Handling HTTP event for process 'slave(762)'
with path: '/slave(762)/containers'
I0606 20:39:42.598938  4462 http.cpp:1115] HTTP GET for /slave(762)/containers from 172.17.0.3:54372
I0606 20:39:42.599026  4462 http.cpp:936] Authorizing principal 'test-principal' to GET the
'/containers' endpoint
I0606 20:39:42.605439  4464 slave.cpp:817] Agent terminating
[       OK ] Endpoint/SlaveEndpointTest.NoAuthorizer/2 (51 ms)
[----------] 9 tests from Endpoint/SlaveEndpointTest (479 ms total)

[----------] Global test environment tear-down
../../src/tests/environment.cpp:736: Failure
Failed
Tests completed with child processes remaining:
-+- 4438 /mesos/mesos-1.4.0/_build/src/.libs/lt-mesos-tests 
 |--- 16160 /mesos/mesos-1.4.0/_build/src/.libs/lt-mesos-io-switchboard --heartbeat_interval=30secs
--help=false --socket_address=/tmp/mesos-io-switchboard-59775909-d369-42bd-91a7-d5658f1f4e67
--stderr_from_fd=22 --stderr_to_fd=2 --stdin_to_fd=22 --stdout_from_fd=22 --stdout_to_fd=1
--tty=true --wait_for_connection=false 
 \-+- 16161 /mesos/mesos-1.4.0/_build/src/.libs/lt-mesos-containerizer launch 
   \-+- 16188 sh -c sleep 1000 
     \--- 16189 sleep 1000 
[==========] 1588 tests from 176 test cases ran. (562956 ms total)
[  PASSED  ] 1587 tests.
[  FAILED  ] 1 test, listed below:
[  FAILED  ] IOSwitchboardTest.ContainerAttach

 1 FAILED TEST
  YOU HAVE 22 DISABLED TESTS

E0606 20:39:42.676296  4465 process.cpp:968] Failed to accept socket: future discarded
make[4]: *** [check-local] Error 1
make[4]: Leaving directory `/mesos/mesos-1.4.0/_build/src'
make[3]: *** [check-am] Error 2
make[3]: Leaving directory `/mesos/mesos-1.4.0/_build/src'
make[2]: *** [check] Error 2
make[2]: Leaving directory `/mesos/mesos-1.4.0/_build/src'
make[1]: *** [check-recursive] Error 1
make[1]: Leaving directory `/mesos/mesos-1.4.0/_build'
make: *** [distcheck] Error 1
+ docker rmi mesos-1496777397-9779
Untagged: mesos-1496777397-9779:latest
Deleted: sha256:b852836d8e6e08c05dd695bcff1c1e40f4b60c3f64b8f58145eb3700f54ce9cf
Deleted: sha256:2a508d30d40a56e9c6956294b5ed521696515bc8e11e47039c3703674f41ad53
Deleted: sha256:3efc7864f26ad59062e7f676c3a2496ea0bd5d229337cdfaafc3c12be0a4f3e8
Deleted: sha256:55ffd684ad7a2ec32b6b10b8708560c5c38bd73123567d76c27c579da6e91ed7
Deleted: sha256:ac94c58f7f0d7fd859ecc2b7689c61e28e3124500a84a28f01e03db248955ab4
Deleted: sha256:503b8b92d13bfd9d00cb4fd4b97a587b7d102db2ad59ad768bfee0524fdec5ef
Deleted: sha256:55429ef1af16e1077e7cab9d3fa21d6ac1da593c4df927ff8535557cd7b0d6f6
Deleted: sha256:04854d88925b616c5b8cab018920317738888b20819b102b9601790dac432518
Deleted: sha256:96812020fe9755d4726e416d46edb4e29a1cc09ca6a23e57cdc4097cc3b6532b
Deleted: sha256:2849812e4611c1db8d93cc23bfdc42c41b3bc76fea6938facaffce633d5da094
Deleted: sha256:5a8430735547dddc89105fb97b850dc0d92e48daae2aa45648875e0aadd5ecd6
Deleted: sha256:88a8e252e81a5f06c510d042f7c1ac0987a6902a1c2219c044d14dcf4c56e234
Deleted: sha256:b64306398369e2e8e4793660e2818da9713ceec60c089c079d7f3f0cef44552f
Deleted: sha256:fd75234534b5686fecdbb47aaa583d41cddc6c6dec619b69f60743579f9b0f1b
Deleted: sha256:993f96f522f2e02782d3b63db10a97880ea9f0d258a4ac9f129e307b3a9fb6b4
Deleted: sha256:d15ce795623859e9f470c61608b63b9d4d20648099a15ac314be0f35844f1fa4
Deleted: sha256:3c29815b1853de942881576a3a8ab155ea39963f5ba58929455e737350a126fc
Deleted: sha256:7f8e0f81e8dfe9d55462df8e41befdc08e1a8025ff6510ee620445c284b497fb
Deleted: sha256:f2cde295c85a39aa682dbc071580f11b2597aff9312cdba6fae1318482432b44
Deleted: sha256:7d93854a325798e0668f8d0ab025359f4cd0b5c8ab075ab9b1f2e96abdede47e
Deleted: sha256:fe8e1b002f70f09ac08330b360226e3e84e0fabfdcf131f104b60f10196c1968
Deleted: sha256:e8aa9b01da3a6a59c3c134913eb97d8e16cd153f749a77730807a904bc0d9afe
Deleted: sha256:15b1c11d83e421266b4c762c3ecfbff4d976b1e9c38cc2db64ccb9de7dd54314
Deleted: sha256:c8f6734e798d84ef1abed564e3973438c754b0d60c4d0d210f0fa77aa42e47d1
Build step 'Execute shell' marked build as failure
Not sending mail to unregistered user xujyan@apple.com
Not sending mail to unregistered user neil.conway@gmail.com

Mime
View raw message