mesos-builds mailing list archives

Site index · List index
Message view « Date » · « Thread »
Top « Date » · « Thread »
From Apache Jenkins Server <jenk...@builds.apache.org>
Subject Build failed in Jenkins: Mesos-Reviewbot #18255
Date Sat, 03 Jun 2017 01:32:12 GMT
See <https://builds.apache.org/job/Mesos-Reviewbot/18255/display/redirect>

------------------------------------------
[...truncated 27.93 MB...]
I0603 01:32:05.445201  4506 containerizer.cpp:230] Using isolation: posix/cpu,posix/mem,filesystem/posix,network/cni,environment_secret
W0603 01:32:05.446089  4506 backend.cpp:76] Failed to create 'overlay' backend: OverlayBackend
requires root privileges
W0603 01:32:05.446364  4506 backend.cpp:76] Failed to create 'bind' backend: BindBackend requires
root privileges
I0603 01:32:05.446465  4506 provisioner.cpp:255] Using default backend 'copy'
I0603 01:32:05.453619  4528 slave.cpp:248] Mesos agent started on (754)@172.17.0.2:33431
I0603 01:32:05.453972  4528 slave.cpp:249] Flags at startup: --acls="" --appc_simple_discovery_uri_prefix="http://"
--appc_store_dir="/tmp/Endpoint_SlaveEndpointTest_AuthorizedRequest_2_H8MAdH/store/appc" --authenticate_http_readonly="true"
--authenticate_http_readwrite="true" --authenticatee="crammd5" --authentication_backoff_factor="1secs"
--authorizer="local" --cgroups_cpu_enable_pids_and_tids_count="false" --cgroups_enable_cfs="false"
--cgroups_hierarchy="/sys/fs/cgroup" --cgroups_limit_swap="false" --cgroups_root="mesos" --container_disk_watch_interval="15secs"
--containerizers="mesos" --credential="/tmp/Endpoint_SlaveEndpointTest_AuthorizedRequest_2_H8MAdH/credential"
--default_role="*" --disk_watch_interval="1mins" --docker="docker" --docker_kill_orphans="true"
--docker_registry="https://registry-1.docker.io" --docker_remove_delay="6hrs" --docker_socket="/var/run/docker.sock"
--docker_stop_timeout="0ns" --docker_store_dir="/tmp/Endpoint_SlaveEndpointTest_AuthorizedRequest_2_H8MAdH/store/docker"
--docker_volume_checkpoint_dir="/var/run/mesos/isolators/docker/volume" --enforce_container_disk_quota="false"
--executor_registration_timeout="1mins" --executor_reregistration_timeout="2secs" --executor_shutdown_grace_period="5secs"
--fetcher_cache_dir="/tmp/Endpoint_SlaveEndpointTest_AuthorizedRequest_2_H8MAdH/fetch" --fetcher_cache_size="2GB"
--frameworks_home="" --gc_delay="1weeks" --gc_disk_headroom="0.1" --hadoop_home="" --help="false"
--hostname_lookup="true" --http_command_executor="false" --http_credentials="/tmp/Endpoint_SlaveEndpointTest_AuthorizedRequest_2_H8MAdH/http_credentials"
--http_heartbeat_interval="30secs" --initialize_driver_logging="true" --isolation="posix/cpu,posix/mem"
--launcher="posix" --launcher_dir="/mesos/mesos-1.4.0/_build/src" --logbufsecs="0" --logging_level="INFO"
--max_completed_executors_per_framework="150" --oversubscribed_resources_interval="15secs"
--perf_duration="10secs" --perf_interval="1mins" --port="5051" --qos_correction_interval_min="0ns"
--quiet="false" --recover="reconnect" --recovery_timeout="15mins" --registration_backoff_factor="10ms"
--resources="cpus:2;gpus:0;mem:1024;disk:1024;ports:[31000-32000]" --revocable_cpu_low_priority="true"
--runtime_dir="/tmp/Endpoint_SlaveEndpointTest_AuthorizedRequest_2_H8MAdH" --sandbox_directory="/mnt/mesos/sandbox"
--strict="true" --switch_user="true" --systemd_enable_support="true" --systemd_runtime_directory="/run/systemd/system"
--version="false" --work_dir="/tmp/Endpoint_SlaveEndpointTest_AuthorizedRequest_2_dMECU9"
I0603 01:32:05.454717  4528 credentials.hpp:86] Loading credential for authentication from
'/tmp/Endpoint_SlaveEndpointTest_AuthorizedRequest_2_H8MAdH/credential'
I0603 01:32:05.455008  4528 slave.cpp:281] Agent using credential for: test-principal
I0603 01:32:05.455183  4528 credentials.hpp:37] Loading credentials for authentication from
'/tmp/Endpoint_SlaveEndpointTest_AuthorizedRequest_2_H8MAdH/http_credentials'
I0603 01:32:05.455677  4528 http.cpp:975] Creating default 'basic' HTTP authenticator for
realm 'mesos-agent-readonly'
I0603 01:32:05.455994  4528 http.cpp:975] Creating default 'basic' HTTP authenticator for
realm 'mesos-agent-readwrite'
I0603 01:32:05.458461  4528 slave.cpp:552] Agent resources: cpus(*):2; mem(*):1024; disk(*):1024;
ports(*):[31000-32000]
I0603 01:32:05.458652  4528 slave.cpp:560] Agent attributes: [  ]
I0603 01:32:05.458705  4528 slave.cpp:565] Agent hostname: 6d2caac8a02a
I0603 01:32:05.459034  4532 status_update_manager.cpp:177] Pausing sending status updates
I0603 01:32:05.461519  4532 state.cpp:62] Recovering state from '/tmp/Endpoint_SlaveEndpointTest_AuthorizedRequest_2_dMECU9/meta'
I0603 01:32:05.462020  4526 status_update_manager.cpp:203] Recovering status update manager
I0603 01:32:05.462435  4525 containerizer.cpp:582] Recovering containerizer
I0603 01:32:05.464651  4530 provisioner.cpp:416] Provisioner recovery complete
I0603 01:32:05.465312  4527 slave.cpp:6119] Finished recovery
I0603 01:32:05.465997  4527 slave.cpp:6301] Querying resource estimator for oversubscribable
resources
I0603 01:32:05.466452  4527 slave.cpp:6315] Received oversubscribable resources {} from the
resource estimator
I0603 01:32:05.471863  4527 process.cpp:3778] Handling HTTP event for process 'slave(754)'
with path: '/slave(754)/containers'
I0603 01:32:05.474390  4527 http.cpp:1115] HTTP GET for /slave(754)/containers from 172.17.0.2:51408
I0603 01:32:05.474591  4527 http.cpp:936] Authorizing principal 'test-principal' to GET the
'/containers' endpoint
I0603 01:32:05.480976  4506 slave.cpp:817] Agent terminating
[       OK ] Endpoint/SlaveEndpointTest.AuthorizedRequest/2 (56 ms)
[ RUN      ] Endpoint/SlaveEndpointTest.UnauthorizedRequest/0
I0603 01:32:05.499382  4506 containerizer.cpp:230] Using isolation: posix/cpu,posix/mem,filesystem/posix,network/cni,environment_secret
W0603 01:32:05.500442  4506 backend.cpp:76] Failed to create 'overlay' backend: OverlayBackend
requires root privileges
W0603 01:32:05.500790  4506 backend.cpp:76] Failed to create 'bind' backend: BindBackend requires
root privileges
I0603 01:32:05.501082  4506 provisioner.cpp:255] Using default backend 'copy'
I0603 01:32:05.507050  4530 slave.cpp:248] Mesos agent started on (755)@172.17.0.2:33431
I0603 01:32:05.507097  4530 slave.cpp:249] Flags at startup: --acls="" --appc_simple_discovery_uri_prefix="http://"
--appc_store_dir="/tmp/Endpoint_SlaveEndpointTest_UnauthorizedRequest_0_dFTCVQ/store/appc"
--authenticate_http_readonly="true" --authenticate_http_readwrite="true" --authenticatee="crammd5"
--authentication_backoff_factor="1secs" --authorizer="local" --cgroups_cpu_enable_pids_and_tids_count="false"
--cgroups_enable_cfs="false" --cgroups_hierarchy="/sys/fs/cgroup" --cgroups_limit_swap="false"
--cgroups_root="mesos" --container_disk_watch_interval="15secs" --containerizers="mesos" --credential="/tmp/Endpoint_SlaveEndpointTest_UnauthorizedRequest_0_dFTCVQ/credential"
--default_role="*" --disk_watch_interval="1mins" --docker="docker" --docker_kill_orphans="true"
--docker_registry="https://registry-1.docker.io" --docker_remove_delay="6hrs" --docker_socket="/var/run/docker.sock"
--docker_stop_timeout="0ns" --docker_store_dir="/tmp/Endpoint_SlaveEndpointTest_UnauthorizedRequest_0_dFTCVQ/store/docker"
--docker_volume_checkpoint_dir="/var/run/mesos/isolators/docker/volume" --enforce_container_disk_quota="false"
--executor_registration_timeout="1mins" --executor_reregistration_timeout="2secs" --executor_shutdown_grace_period="5secs"
--fetcher_cache_dir="/tmp/Endpoint_SlaveEndpointTest_UnauthorizedRequest_0_dFTCVQ/fetch" --fetcher_cache_size="2GB"
--frameworks_home="" --gc_delay="1weeks" --gc_disk_headroom="0.1" --hadoop_home="" --help="false"
--hostname_lookup="true" --http_command_executor="false" --http_credentials="/tmp/Endpoint_SlaveEndpointTest_UnauthorizedRequest_0_dFTCVQ/http_credentials"
--http_heartbeat_interval="30secs" --initialize_driver_logging="true" --isolation="posix/cpu,posix/mem"
--launcher="posix" --launcher_dir="/mesos/mesos-1.4.0/_build/src" --logbufsecs="0" --logging_level="INFO"
--max_completed_executors_per_framework="150" --oversubscribed_resources_interval="15secs"
--perf_duration="10secs" --perf_interval="1mins" --port="5051" --qos_correction_interval_min="0ns"
--quiet="false" --recover="reconnect" --recovery_timeout="15mins" --registration_backoff_factor="10ms"
--resources="cpus:2;gpus:0;mem:1024;disk:1024;ports:[31000-32000]" --revocable_cpu_low_priority="true"
--runtime_dir="/tmp/Endpoint_SlaveEndpointTest_UnauthorizedRequest_0_dFTCVQ" --sandbox_directory="/mnt/mesos/sandbox"
--strict="true" --switch_user="true" --systemd_enable_support="true" --systemd_runtime_directory="/run/systemd/system"
--version="false" --work_dir="/tmp/Endpoint_SlaveEndpointTest_UnauthorizedRequest_0_lYqPtj"
I0603 01:32:05.507827  4530 credentials.hpp:86] Loading credential for authentication from
'/tmp/Endpoint_SlaveEndpointTest_UnauthorizedRequest_0_dFTCVQ/credential'
I0603 01:32:05.508108  4530 slave.cpp:281] Agent using credential for: test-principal
I0603 01:32:05.508136  4530 credentials.hpp:37] Loading credentials for authentication from
'/tmp/Endpoint_SlaveEndpointTest_UnauthorizedRequest_0_dFTCVQ/http_credentials'
I0603 01:32:05.508514  4530 http.cpp:975] Creating default 'basic' HTTP authenticator for
realm 'mesos-agent-readonly'
I0603 01:32:05.508745  4530 http.cpp:975] Creating default 'basic' HTTP authenticator for
realm 'mesos-agent-readwrite'
I0603 01:32:05.510751  4530 slave.cpp:552] Agent resources: cpus(*):2; mem(*):1024; disk(*):1024;
ports(*):[31000-32000]
I0603 01:32:05.510891  4530 slave.cpp:560] Agent attributes: [  ]
I0603 01:32:05.510910  4530 slave.cpp:565] Agent hostname: 6d2caac8a02a
I0603 01:32:05.511174  4529 status_update_manager.cpp:177] Pausing sending status updates
I0603 01:32:05.513675  4530 state.cpp:62] Recovering state from '/tmp/Endpoint_SlaveEndpointTest_UnauthorizedRequest_0_lYqPtj/meta'
I0603 01:32:05.514242  4530 status_update_manager.cpp:203] Recovering status update manager
I0603 01:32:05.514624  4530 containerizer.cpp:582] Recovering containerizer
I0603 01:32:05.517166  4530 provisioner.cpp:416] Provisioner recovery complete
I0603 01:32:05.517750  4532 slave.cpp:6119] Finished recovery
I0603 01:32:05.518512  4532 slave.cpp:6301] Querying resource estimator for oversubscribable
resources
I0603 01:32:05.519290  4532 slave.cpp:6315] Received oversubscribable resources {} from the
resource estimator
I0603 01:32:05.524462  4525 process.cpp:3778] Handling HTTP event for process 'slave(755)'
with path: '/slave(755)/monitor/statistics'
I0603 01:32:05.527109  4525 http.cpp:1115] HTTP GET for /slave(755)/monitor/statistics from
172.17.0.2:51410
I0603 01:32:05.527231  4525 http.cpp:936] Authorizing principal 'test-principal' to GET the
'/monitor/statistics' endpoint
I0603 01:32:05.531709  4506 slave.cpp:817] Agent terminating
[       OK ] Endpoint/SlaveEndpointTest.UnauthorizedRequest/0 (48 ms)
[ RUN      ] Endpoint/SlaveEndpointTest.UnauthorizedRequest/1
I0603 01:32:05.547260  4506 containerizer.cpp:230] Using isolation: posix/cpu,posix/mem,filesystem/posix,network/cni,environment_secret
W0603 01:32:05.548128  4506 backend.cpp:76] Failed to create 'overlay' backend: OverlayBackend
requires root privileges
W0603 01:32:05.548457  4506 backend.cpp:76] Failed to create 'bind' backend: BindBackend requires
root privileges
I0603 01:32:05.548532  4506 provisioner.cpp:255] Using default backend 'copy'
I0603 01:32:05.555703  4527 slave.cpp:248] Mesos agent started on (756)@172.17.0.2:33431
I0603 01:32:05.556363  4527 slave.cpp:249] Flags at startup: --acls="" --appc_simple_discovery_uri_prefix="http://"
--appc_store_dir="/tmp/Endpoint_SlaveEndpointTest_UnauthorizedRequest_1_5sbE90/store/appc"
--authenticate_http_readonly="true" --authenticate_http_readwrite="true" --authenticatee="crammd5"
--authentication_backoff_factor="1secs" --authorizer="local" --cgroups_cpu_enable_pids_and_tids_count="false"
--cgroups_enable_cfs="false" --cgroups_hierarchy="/sys/fs/cgroup" --cgroups_limit_swap="false"
--cgroups_root="mesos" --container_disk_watch_interval="15secs" --containerizers="mesos" --credential="/tmp/Endpoint_SlaveEndpointTest_UnauthorizedRequest_1_5sbE90/credential"
--default_role="*" --disk_watch_interval="1mins" --docker="docker" --docker_kill_orphans="true"
--docker_registry="https://registry-1.docker.io" --docker_remove_delay="6hrs" --docker_socket="/var/run/docker.sock"
--docker_stop_timeout="0ns" --docker_store_dir="/tmp/Endpoint_SlaveEndpointTest_UnauthorizedRequest_1_5sbE90/store/docker"
--docker_volume_checkpoint_dir="/var/run/mesos/isolators/docker/volume" --enforce_container_disk_quota="false"
--executor_registration_timeout="1mins" --executor_reregistration_timeout="2secs" --executor_shutdown_grace_period="5secs"
--fetcher_cache_dir="/tmp/Endpoint_SlaveEndpointTest_UnauthorizedRequest_1_5sbE90/fetch" --fetcher_cache_size="2GB"
--frameworks_home="" --gc_delay="1weeks" --gc_disk_headroom="0.1" --hadoop_home="" --help="false"
--hostname_lookup="true" --http_command_executor="false" --http_credentials="/tmp/Endpoint_SlaveEndpointTest_UnauthorizedRequest_1_5sbE90/http_credentials"
--http_heartbeat_interval="30secs" --initialize_driver_logging="true" --isolation="posix/cpu,posix/mem"
--launcher="posix" --launcher_dir="/mesos/mesos-1.4.0/_build/src" --logbufsecs="0" --logging_level="INFO"
--max_completed_executors_per_framework="150" --oversubscribed_resources_interval="15secs"
--perf_duration="10secs" --perf_interval="1mins" --port="5051" --qos_correction_interval_min="0ns"
--quiet="false" --recover="reconnect" --recovery_timeout="15mins" --registration_backoff_factor="10ms"
--resources="cpus:2;gpus:0;mem:1024;disk:1024;ports:[31000-32000]" --revocable_cpu_low_priority="true"
--runtime_dir="/tmp/Endpoint_SlaveEndpointTest_UnauthorizedRequest_1_5sbE90" --sandbox_directory="/mnt/mesos/sandbox"
--strict="true" --switch_user="true" --systemd_enable_support="true" --systemd_runtime_directory="/run/systemd/system"
--version="false" --work_dir="/tmp/Endpoint_SlaveEndpointTest_UnauthorizedRequest_1_RK30zt"
I0603 01:32:05.557271  4527 credentials.hpp:86] Loading credential for authentication from
'/tmp/Endpoint_SlaveEndpointTest_UnauthorizedRequest_1_5sbE90/credential'
I0603 01:32:05.558344  4527 slave.cpp:281] Agent using credential for: test-principal
I0603 01:32:05.558703  4527 credentials.hpp:37] Loading credentials for authentication from
'/tmp/Endpoint_SlaveEndpointTest_UnauthorizedRequest_1_5sbE90/http_credentials'
I0603 01:32:05.559453  4527 http.cpp:975] Creating default 'basic' HTTP authenticator for
realm 'mesos-agent-readonly'
I0603 01:32:05.560108  4527 http.cpp:975] Creating default 'basic' HTTP authenticator for
realm 'mesos-agent-readwrite'
I0603 01:32:05.563014  4527 slave.cpp:552] Agent resources: cpus(*):2; mem(*):1024; disk(*):1024;
ports(*):[31000-32000]
I0603 01:32:05.563616  4527 slave.cpp:560] Agent attributes: [  ]
I0603 01:32:05.563895  4527 slave.cpp:565] Agent hostname: 6d2caac8a02a
I0603 01:32:05.564327  4531 status_update_manager.cpp:177] Pausing sending status updates
I0603 01:32:05.567353  4530 state.cpp:62] Recovering state from '/tmp/Endpoint_SlaveEndpointTest_UnauthorizedRequest_1_RK30zt/meta'
I0603 01:32:05.568107  4530 status_update_manager.cpp:203] Recovering status update manager
I0603 01:32:05.568336  4530 containerizer.cpp:582] Recovering containerizer
I0603 01:32:05.571321  4530 provisioner.cpp:416] Provisioner recovery complete
I0603 01:32:05.572211  4530 slave.cpp:6119] Finished recovery
I0603 01:32:05.572854  4530 slave.cpp:6301] Querying resource estimator for oversubscribable
resources
I0603 01:32:05.573878  4529 slave.cpp:6315] Received oversubscribable resources {} from the
resource estimator
I0603 01:32:05.578600  4525 process.cpp:3778] Handling HTTP event for process 'slave(756)'
with path: '/slave(756)/monitor/statistics.json'
I0603 01:32:05.580507  4532 http.cpp:1115] HTTP GET for /slave(756)/monitor/statistics.json
from 172.17.0.2:51412
I0603 01:32:05.580636  4532 http.cpp:936] Authorizing principal 'test-principal' to GET the
'/monitor/statistics.json' endpoint
I0603 01:32:05.584800  4506 slave.cpp:817] Agent terminating
[       OK ] Endpoint/SlaveEndpointTest.UnauthorizedRequest/1 (61 ms)
[ RUN      ] Endpoint/SlaveEndpointTest.UnauthorizedRequest/2
I0603 01:32:05.610108  4506 containerizer.cpp:230] Using isolation: posix/cpu,posix/mem,filesystem/posix,network/cni,environment_secret
W0603 01:32:05.610949  4506 backend.cpp:76] Failed to create 'overlay' backend: OverlayBackend
requires root privileges
W0603 01:32:05.611145  4506 backend.cpp:76] Failed to create 'bind' backend: BindBackend requires
root privileges
I0603 01:32:05.611196  4506 provisioner.cpp:255] Using default backend 'copy'
I0603 01:32:05.617184  4529 slave.cpp:248] Mesos agent started on (757)@172.17.0.2:33431
I0603 01:32:05.617228  4529 slave.cpp:249] Flags at startup: --acls="" --appc_simple_discovery_uri_prefix="http://"
--appc_store_dir="/tmp/Endpoint_SlaveEndpointTest_UnauthorizedRequest_2_fudG0b/store/appc"
--authenticate_http_readonly="true" --authenticate_http_readwrite="true" --authenticatee="crammd5"
--authentication_backoff_factor="1secs" --authorizer="local" --cgroups_cpu_enable_pids_and_tids_count="false"
--cgroups_enable_cfs="false" --cgroups_hierarchy="/sys/fs/cgroup" --cgroups_limit_swap="false"
--cgroups_root="mesos" --container_disk_watch_interval="15secs" --containerizers="mesos" --credential="/tmp/Endpoint_SlaveEndpointTest_UnauthorizedRequest_2_fudG0b/credential"
--default_role="*" --disk_watch_interval="1mins" --docker="docker" --docker_kill_orphans="true"
--docker_registry="https://registry-1.docker.io" --docker_remove_delay="6hrs" --docker_socket="/var/run/docker.sock"
--docker_stop_timeout="0ns" --docker_store_dir="/tmp/Endpoint_SlaveEndpointTest_UnauthorizedRequest_2_fudG0b/store/docker"
--docker_volume_checkpoint_dir="/var/run/mesos/isolators/docker/volume" --enforce_container_disk_quota="false"
--executor_registration_timeout="1mins" --executor_reregistration_timeout="2secs" --executor_shutdown_grace_period="5secs"
--fetcher_cache_dir="/tmp/Endpoint_SlaveEndpointTest_UnauthorizedRequest_2_fudG0b/fetch" --fetcher_cache_size="2GB"
--frameworks_home="" --gc_delay="1weeks" --gc_disk_headroom="0.1" --hadoop_home="" --help="false"
--hostname_lookup="true" --http_command_executor="false" --http_credentials="/tmp/Endpoint_SlaveEndpointTest_UnauthorizedRequest_2_fudG0b/http_credentials"
--http_heartbeat_interval="30secs" --initialize_driver_logging="true" --isolation="posix/cpu,posix/mem"
--launcher="posix" --launcher_dir="/mesos/mesos-1.4.0/_build/src" --logbufsecs="0" --logging_level="INFO"
--max_completed_executors_per_framework="150" --oversubscribed_resources_interval="15secs"
--perf_duration="10secs" --perf_interval="1mins" --port="5051" --qos_correction_interval_min="0ns"
--quiet="false" --recover="reconnect" --recovery_timeout="15mins" --registration_backoff_factor="10ms"
--resources="cpus:2;gpus:0;mem:1024;disk:1024;ports:[31000-32000]" --revocable_cpu_low_priority="true"
--runtime_dir="/tmp/Endpoint_SlaveEndpointTest_UnauthorizedRequest_2_fudG0b" --sandbox_directory="/mnt/mesos/sandbox"
--strict="true" --switch_user="true" --systemd_enable_support="true" --systemd_runtime_directory="/run/systemd/system"
--version="false" --work_dir="/tmp/Endpoint_SlaveEndpointTest_UnauthorizedRequest_2_JyRYgE"
I0603 01:32:05.619122  4529 credentials.hpp:86] Loading credential for authentication from
'/tmp/Endpoint_SlaveEndpointTest_UnauthorizedRequest_2_fudG0b/credential'
I0603 01:32:05.619828  4529 slave.cpp:281] Agent using credential for: test-principal
I0603 01:32:05.619869  4529 credentials.hpp:37] Loading credentials for authentication from
'/tmp/Endpoint_SlaveEndpointTest_UnauthorizedRequest_2_fudG0b/http_credentials'
I0603 01:32:05.620486  4529 http.cpp:975] Creating default 'basic' HTTP authenticator for
realm 'mesos-agent-readonly'
I0603 01:32:05.621033  4529 http.cpp:975] Creating default 'basic' HTTP authenticator for
realm 'mesos-agent-readwrite'
I0603 01:32:05.623345  4529 slave.cpp:552] Agent resources: cpus(*):2; mem(*):1024; disk(*):1024;
ports(*):[31000-32000]
I0603 01:32:05.623497  4529 slave.cpp:560] Agent attributes: [  ]
I0603 01:32:05.623623  4529 slave.cpp:565] Agent hostname: 6d2caac8a02a
I0603 01:32:05.624135  4531 status_update_manager.cpp:177] Pausing sending status updates
I0603 01:32:05.626219  4529 state.cpp:62] Recovering state from '/tmp/Endpoint_SlaveEndpointTest_UnauthorizedRequest_2_JyRYgE/meta'
I0603 01:32:05.626910  4529 status_update_manager.cpp:203] Recovering status update manager
I0603 01:32:05.627230  4527 containerizer.cpp:582] Recovering containerizer
I0603 01:32:05.629473  4529 provisioner.cpp:416] Provisioner recovery complete
I0603 01:32:05.630213  4527 slave.cpp:6119] Finished recovery
I0603 01:32:05.630842  4527 slave.cpp:6301] Querying resource estimator for oversubscribable
resources
I0603 01:32:05.631290  4531 slave.cpp:6315] Received oversubscribable resources {} from the
resource estimator
I0603 01:32:05.637003  4530 process.cpp:3778] Handling HTTP event for process 'slave(757)'
with path: '/slave(757)/containers'
I0603 01:32:05.639039  4526 http.cpp:1115] HTTP GET for /slave(757)/containers from 172.17.0.2:51416
I0603 01:32:05.639194  4526 http.cpp:936] Authorizing principal 'test-principal' to GET the
'/containers' endpoint
I0603 01:32:05.643246  4530 slave.cpp:817] Agent terminating
[       OK ] Endpoint/SlaveEndpointTest.UnauthorizedRequest/2 (49 ms)
[ RUN      ] Endpoint/SlaveEndpointTest.NoAuthorizer/0
I0603 01:32:05.659168  4506 containerizer.cpp:230] Using isolation: posix/cpu,posix/mem,filesystem/posix,network/cni,environment_secret
W0603 01:32:05.659955  4506 backend.cpp:76] Failed to create 'overlay' backend: OverlayBackend
requires root privileges
W0603 01:32:05.660135  4506 backend.cpp:76] Failed to create 'bind' backend: BindBackend requires
root privileges
I0603 01:32:05.660183  4506 provisioner.cpp:255] Using default backend 'copy'
I0603 01:32:05.662611  4506 cluster.cpp:448] Creating default 'local' authorizer
I0603 01:32:05.665480  4529 slave.cpp:248] Mesos agent started on (758)@172.17.0.2:33431
I0603 01:32:05.665525  4529 slave.cpp:249] Flags at startup: --acls="" --appc_simple_discovery_uri_prefix="http://"
--appc_store_dir="/tmp/Endpoint_SlaveEndpointTest_NoAuthorizer_0_DCD7on/store/appc" --authenticate_http_readonly="true"
--authenticate_http_readwrite="true" --authenticatee="crammd5" --authentication_backoff_factor="1secs"
--authorizer="local" --cgroups_cpu_enable_pids_and_tids_count="false" --cgroups_enable_cfs="false"
--cgroups_hierarchy="/sys/fs/cgroup" --cgroups_limit_swap="false" --cgroups_root="mesos" --container_disk_watch_interval="15secs"
--containerizers="mesos" --credential="/tmp/Endpoint_SlaveEndpointTest_NoAuthorizer_0_DCD7on/credential"
--default_role="*" --disk_watch_interval="1mins" --docker="docker" --docker_kill_orphans="true"
--docker_registry="https://registry-1.docker.io" --docker_remove_delay="6hrs" --docker_socket="/var/run/docker.sock"
--docker_stop_timeout="0ns" --docker_store_dir="/tmp/Endpoint_SlaveEndpointTest_NoAuthorizer_0_DCD7on/store/docker"
--docker_volume_checkpoint_dir="/var/run/mesos/isolators/docker/volume" --enforce_container_disk_quota="false"
--executor_registration_timeout="1mins" --executor_reregistration_timeout="2secs" --executor_shutdown_grace_period="5secs"
--fetcher_cache_dir="/tmp/Endpoint_SlaveEndpointTest_NoAuthorizer_0_DCD7on/fetch" --fetcher_cache_size="2GB"
--frameworks_home="" --gc_delay="1weeks" --gc_disk_headroom="0.1" --hadoop_home="" --help="false"
--hostname_lookup="true" --http_command_executor="false" --http_credentials="/tmp/Endpoint_SlaveEndpointTest_NoAuthorizer_0_DCD7on/http_credentials"
--http_heartbeat_interval="30secs" --initialize_driver_logging="true" --isolation="posix/cpu,posix/mem"
--launcher="posix" --launcher_dir="/mesos/mesos-1.4.0/_build/src" --logbufsecs="0" --logging_level="INFO"
--max_completed_executors_per_framework="150" --oversubscribed_resources_interval="15secs"
--perf_duration="10secs" --perf_interval="1mins" --port="5051" --qos_correction_interval_min="0ns"
--quiet="false" --recover="reconnect" --recovery_timeout="15mins" --registration_backoff_factor="10ms"
--resources="cpus:2;gpus:0;mem:1024;disk:1024;ports:[31000-32000]" --revocable_cpu_low_priority="true"
--runtime_dir="/tmp/Endpoint_SlaveEndpointTest_NoAuthorizer_0_DCD7on" --sandbox_directory="/mnt/mesos/sandbox"
--strict="true" --switch_user="true" --systemd_enable_support="true" --systemd_runtime_directory="/run/systemd/system"
--version="false" --work_dir="/tmp/Endpoint_SlaveEndpointTest_NoAuthorizer_0_psbrxP"
I0603 01:32:05.666790  4529 credentials.hpp:86] Loading credential for authentication from
'/tmp/Endpoint_SlaveEndpointTest_NoAuthorizer_0_DCD7on/credential'
I0603 01:32:05.667187  4529 slave.cpp:281] Agent using credential for: test-principal
I0603 01:32:05.667248  4529 credentials.hpp:37] Loading credentials for authentication from
'/tmp/Endpoint_SlaveEndpointTest_NoAuthorizer_0_DCD7on/http_credentials'
I0603 01:32:05.667657  4529 http.cpp:975] Creating default 'basic' HTTP authenticator for
realm 'mesos-agent-readonly'
I0603 01:32:05.668115  4529 http.cpp:975] Creating default 'basic' HTTP authenticator for
realm 'mesos-agent-readwrite'
I0603 01:32:05.670442  4529 slave.cpp:552] Agent resources: cpus(*):2; mem(*):1024; disk(*):1024;
ports(*):[31000-32000]
I0603 01:32:05.670584  4529 slave.cpp:560] Agent attributes: [  ]
I0603 01:32:05.670704  4529 slave.cpp:565] Agent hostname: 6d2caac8a02a
I0603 01:32:05.671236  4526 status_update_manager.cpp:177] Pausing sending status updates
I0603 01:32:05.673835  4530 state.cpp:62] Recovering state from '/tmp/Endpoint_SlaveEndpointTest_NoAuthorizer_0_psbrxP/meta'
I0603 01:32:05.679363  4525 status_update_manager.cpp:203] Recovering status update manager
I0603 01:32:05.679744  4528 containerizer.cpp:582] Recovering containerizer
I0603 01:32:05.682121  4531 provisioner.cpp:416] Provisioner recovery complete
I0603 01:32:05.683027  4525 slave.cpp:6119] Finished recovery
I0603 01:32:05.683671  4525 slave.cpp:6301] Querying resource estimator for oversubscribable
resources
I0603 01:32:05.684077  4531 slave.cpp:6315] Received oversubscribable resources {} from the
resource estimator
I0603 01:32:05.688522  4532 process.cpp:3778] Handling HTTP event for process 'slave(758)'
with path: '/slave(758)/monitor/statistics'
I0603 01:32:05.690632  4532 http.cpp:1115] HTTP GET for /slave(758)/monitor/statistics from
172.17.0.2:51418
I0603 01:32:05.690970  4532 http.cpp:936] Authorizing principal 'test-principal' to GET the
'/monitor/statistics' endpoint
I0603 01:32:05.699267  4529 slave.cpp:817] Agent terminating
[       OK ] Endpoint/SlaveEndpointTest.NoAuthorizer/0 (56 ms)
[ RUN      ] Endpoint/SlaveEndpointTest.NoAuthorizer/1
I0603 01:32:05.715358  4506 containerizer.cpp:230] Using isolation: posix/cpu,posix/mem,filesystem/posix,network/cni,environment_secret
W0603 01:32:05.716222  4506 backend.cpp:76] Failed to create 'overlay' backend: OverlayBackend
requires root privileges
W0603 01:32:05.716401  4506 backend.cpp:76] Failed to create 'bind' backend: BindBackend requires
root privileges
I0603 01:32:05.716452  4506 provisioner.cpp:255] Using default backend 'copy'
I0603 01:32:05.719102  4506 cluster.cpp:448] Creating default 'local' authorizer
I0603 01:32:05.721957  4530 slave.cpp:248] Mesos agent started on (759)@172.17.0.2:33431
I0603 01:32:05.722040  4530 slave.cpp:249] Flags at startup: --acls="" --appc_simple_discovery_uri_prefix="http://"
--appc_store_dir="/tmp/Endpoint_SlaveEndpointTest_NoAuthorizer_1_N9RAnz/store/appc" --authenticate_http_readonly="true"
--authenticate_http_readwrite="true" --authenticatee="crammd5" --authentication_backoff_factor="1secs"
--authorizer="local" --cgroups_cpu_enable_pids_and_tids_count="false" --cgroups_enable_cfs="false"
--cgroups_hierarchy="/sys/fs/cgroup" --cgroups_limit_swap="false" --cgroups_root="mesos" --container_disk_watch_interval="15secs"
--containerizers="mesos" --credential="/tmp/Endpoint_SlaveEndpointTest_NoAuthorizer_1_N9RAnz/credential"
--default_role="*" --disk_watch_interval="1mins" --docker="docker" --docker_kill_orphans="true"
--docker_registry="https://registry-1.docker.io" --docker_remove_delay="6hrs" --docker_socket="/var/run/docker.sock"
--docker_stop_timeout="0ns" --docker_store_dir="/tmp/Endpoint_SlaveEndpointTest_NoAuthorizer_1_N9RAnz/store/docker"
--docker_volume_checkpoint_dir="/var/run/mesos/isolators/docker/volume" --enforce_container_disk_quota="false"
--executor_registration_timeout="1mins" --executor_reregistration_timeout="2secs" --executor_shutdown_grace_period="5secs"
--fetcher_cache_dir="/tmp/Endpoint_SlaveEndpointTest_NoAuthorizer_1_N9RAnz/fetch" --fetcher_cache_size="2GB"
--frameworks_home="" --gc_delay="1weeks" --gc_disk_headroom="0.1" --hadoop_home="" --help="false"
--hostname_lookup="true" --http_command_executor="false" --http_credentials="/tmp/Endpoint_SlaveEndpointTest_NoAuthorizer_1_N9RAnz/http_credentials"
--http_heartbeat_interval="30secs" --initialize_driver_logging="true" --isolation="posix/cpu,posix/mem"
--launcher="posix" --launcher_dir="/mesos/mesos-1.4.0/_build/src" --logbufsecs="0" --logging_level="INFO"
--max_completed_executors_per_framework="150" --oversubscribed_resources_interval="15secs"
--perf_duration="10secs" --perf_interval="1mins" --port="5051" --qos_correction_interval_min="0ns"
--quiet="false" --recover="reconnect" --recovery_timeout="15mins" --registration_backoff_factor="10ms"
--resources="cpus:2;gpus:0;mem:1024;disk:1024;ports:[31000-32000]" --revocable_cpu_low_priority="true"
--runtime_dir="/tmp/Endpoint_SlaveEndpointTest_NoAuthorizer_1_N9RAnz" --sandbox_directory="/mnt/mesos/sandbox"
--strict="true" --switch_user="true" --systemd_enable_support="true" --systemd_runtime_directory="/run/systemd/system"
--version="false" --work_dir="/tmp/Endpoint_SlaveEndpointTest_NoAuthorizer_1_fzrKm1"
I0603 01:32:05.722862  4530 credentials.hpp:86] Loading credential for authentication from
'/tmp/Endpoint_SlaveEndpointTest_NoAuthorizer_1_N9RAnz/credential'
I0603 01:32:05.723203  4530 slave.cpp:281] Agent using credential for: test-principal
I0603 01:32:05.723261  4530 credentials.hpp:37] Loading credentials for authentication from
'/tmp/Endpoint_SlaveEndpointTest_NoAuthorizer_1_N9RAnz/http_credentials'
I0603 01:32:05.723668  4530 http.cpp:975] Creating default 'basic' HTTP authenticator for
realm 'mesos-agent-readonly'
I0603 01:32:05.723971  4530 http.cpp:975] Creating default 'basic' HTTP authenticator for
realm 'mesos-agent-readwrite'
I0603 01:32:05.726196  4530 slave.cpp:552] Agent resources: cpus(*):2; mem(*):1024; disk(*):1024;
ports(*):[31000-32000]
I0603 01:32:05.726475  4530 slave.cpp:560] Agent attributes: [  ]
I0603 01:32:05.726524  4530 slave.cpp:565] Agent hostname: 6d2caac8a02a
I0603 01:32:05.726789  4525 status_update_manager.cpp:177] Pausing sending status updates
I0603 01:32:05.729277  4525 state.cpp:62] Recovering state from '/tmp/Endpoint_SlaveEndpointTest_NoAuthorizer_1_fzrKm1/meta'
I0603 01:32:05.729776  4529 status_update_manager.cpp:203] Recovering status update manager
I0603 01:32:05.730259  4527 containerizer.cpp:582] Recovering containerizer
I0603 01:32:05.732656  4530 provisioner.cpp:416] Provisioner recovery complete
I0603 01:32:05.733211  4526 slave.cpp:6119] Finished recovery
I0603 01:32:05.733911  4526 slave.cpp:6301] Querying resource estimator for oversubscribable
resources
I0603 01:32:05.734787  4525 slave.cpp:6315] Received oversubscribable resources {} from the
resource estimator
I0603 01:32:05.739301  4526 process.cpp:3778] Handling HTTP event for process 'slave(759)'
with path: '/slave(759)/monitor/statistics.json'
I0603 01:32:05.742509  4526 http.cpp:1115] HTTP GET for /slave(759)/monitor/statistics.json
from 172.17.0.2:51420
I0603 01:32:05.743031  4526 http.cpp:936] Authorizing principal 'test-principal' to GET the
'/monitor/statistics.json' endpoint
I0603 01:32:05.749438  4529 slave.cpp:817] Agent terminating
[       OK ] Endpoint/SlaveEndpointTest.NoAuthorizer/1 (59 ms)
[ RUN      ] Endpoint/SlaveEndpointTest.NoAuthorizer/2
I0603 01:32:05.776415  4506 containerizer.cpp:230] Using isolation: posix/cpu,posix/mem,filesystem/posix,network/cni,environment_secret
W0603 01:32:05.777390  4506 backend.cpp:76] Failed to create 'overlay' backend: OverlayBackend
requires root privileges
W0603 01:32:05.777696  4506 backend.cpp:76] Failed to create 'bind' backend: BindBackend requires
root privileges
I0603 01:32:05.777794  4506 provisioner.cpp:255] Using default backend 'copy'
I0603 01:32:05.780774  4506 cluster.cpp:448] Creating default 'local' authorizer
I0603 01:32:05.784752  4528 slave.cpp:248] Mesos agent started on (760)@172.17.0.2:33431
I0603 01:32:05.784801  4528 slave.cpp:249] Flags at startup: --acls="" --appc_simple_discovery_uri_prefix="http://"
--appc_store_dir="/tmp/Endpoint_SlaveEndpointTest_NoAuthorizer_2_VxwlXL/store/appc" --authenticate_http_readonly="true"
--authenticate_http_readwrite="true" --authenticatee="crammd5" --authentication_backoff_factor="1secs"
--authorizer="local" --cgroups_cpu_enable_pids_and_tids_count="false" --cgroups_enable_cfs="false"
--cgroups_hierarchy="/sys/fs/cgroup" --cgroups_limit_swap="false" --cgroups_root="mesos" --container_disk_watch_interval="15secs"
--containerizers="mesos" --credential="/tmp/Endpoint_SlaveEndpointTest_NoAuthorizer_2_VxwlXL/credential"
--default_role="*" --disk_watch_interval="1mins" --docker="docker" --docker_kill_orphans="true"
--docker_registry="https://registry-1.docker.io" --docker_remove_delay="6hrs" --docker_socket="/var/run/docker.sock"
--docker_stop_timeout="0ns" --docker_store_dir="/tmp/Endpoint_SlaveEndpointTest_NoAuthorizer_2_VxwlXL/store/docker"
--docker_volume_checkpoint_dir="/var/run/mesos/isolators/docker/volume" --enforce_container_disk_quota="false"
--executor_registration_timeout="1mins" --executor_reregistration_timeout="2secs" --executor_shutdown_grace_period="5secs"
--fetcher_cache_dir="/tmp/Endpoint_SlaveEndpointTest_NoAuthorizer_2_VxwlXL/fetch" --fetcher_cache_size="2GB"
--frameworks_home="" --gc_delay="1weeks" --gc_disk_headroom="0.1" --hadoop_home="" --help="false"
--hostname_lookup="true" --http_command_executor="false" --http_credentials="/tmp/Endpoint_SlaveEndpointTest_NoAuthorizer_2_VxwlXL/http_credentials"
--http_heartbeat_interval="30secs" --initialize_driver_logging="true" --isolation="posix/cpu,posix/mem"
--launcher="posix" --launcher_dir="/mesos/mesos-1.4.0/_build/src" --logbufsecs="0" --logging_level="INFO"
--max_completed_executors_per_framework="150" --oversubscribed_resources_interval="15secs"
--perf_duration="10secs" --perf_interval="1mins" --port="5051" --qos_correction_interval_min="0ns"
--quiet="false" --recover="reconnect" --recovery_timeout="15mins" --registration_backoff_factor="10ms"
--resources="cpus:2;gpus:0;mem:1024;disk:1024;ports:[31000-32000]" --revocable_cpu_low_priority="true"
--runtime_dir="/tmp/Endpoint_SlaveEndpointTest_NoAuthorizer_2_VxwlXL" --sandbox_directory="/mnt/mesos/sandbox"
--strict="true" --switch_user="true" --systemd_enable_support="true" --systemd_runtime_directory="/run/systemd/system"
--version="false" --work_dir="/tmp/Endpoint_SlaveEndpointTest_NoAuthorizer_2_JyVMMd"
I0603 01:32:05.785501  4528 credentials.hpp:86] Loading credential for authentication from
'/tmp/Endpoint_SlaveEndpointTest_NoAuthorizer_2_VxwlXL/credential'
I0603 01:32:05.785758  4528 slave.cpp:281] Agent using credential for: test-principal
I0603 01:32:05.785782  4528 credentials.hpp:37] Loading credentials for authentication from
'/tmp/Endpoint_SlaveEndpointTest_NoAuthorizer_2_VxwlXL/http_credentials'
I0603 01:32:05.786150  4528 http.cpp:975] Creating default 'basic' HTTP authenticator for
realm 'mesos-agent-readonly'
I0603 01:32:05.786383  4528 http.cpp:975] Creating default 'basic' HTTP authenticator for
realm 'mesos-agent-readwrite'
I0603 01:32:05.788430  4528 slave.cpp:552] Agent resources: cpus(*):2; mem(*):1024; disk(*):1024;
ports(*):[31000-32000]
I0603 01:32:05.788573  4528 slave.cpp:560] Agent attributes: [  ]
I0603 01:32:05.788592  4528 slave.cpp:565] Agent hostname: 6d2caac8a02a
I0603 01:32:05.788858  4527 status_update_manager.cpp:177] Pausing sending status updates
I0603 01:32:05.790702  4530 state.cpp:62] Recovering state from '/tmp/Endpoint_SlaveEndpointTest_NoAuthorizer_2_JyVMMd/meta'
I0603 01:32:05.791440  4530 status_update_manager.cpp:203] Recovering status update manager
I0603 01:32:05.791661  4530 containerizer.cpp:582] Recovering containerizer
I0603 01:32:05.794895  4530 provisioner.cpp:416] Provisioner recovery complete
I0603 01:32:05.795547  4528 slave.cpp:6119] Finished recovery
I0603 01:32:05.796172  4528 slave.cpp:6301] Querying resource estimator for oversubscribable
resources
I0603 01:32:05.796663  4526 slave.cpp:6315] Received oversubscribable resources {} from the
resource estimator
I0603 01:32:05.802258  4527 process.cpp:3778] Handling HTTP event for process 'slave(760)'
with path: '/slave(760)/containers'
I0603 01:32:05.804361  4532 http.cpp:1115] HTTP GET for /slave(760)/containers from 172.17.0.2:51422
I0603 01:32:05.804489  4532 http.cpp:936] Authorizing principal 'test-principal' to GET the
'/containers' endpoint
I0603 01:32:05.809981  4506 slave.cpp:817] Agent terminating
[       OK ] Endpoint/SlaveEndpointTest.NoAuthorizer/2 (50 ms)
[----------] 9 tests from Endpoint/SlaveEndpointTest (518 ms total)

[----------] Global test environment tear-down
[==========] 1586 tests from 176 test cases ran. (718463 ms total)
[  PASSED  ] 1582 tests.
[  FAILED  ] 4 tests, listed below:
[  FAILED  ] DefaultExecutorCheckTest.CommandCheckDeliveredAndReconciled
[  FAILED  ] DefaultExecutorCheckTest.CommandCheckStatusChange
[  FAILED  ] DefaultExecutorCheckTest.CommandCheckSeesParentsEnv
[  FAILED  ] DefaultExecutorCheckTest.CommandCheckSharesWorkDirWithTask

 4 FAILED TESTS
  YOU HAVE 22 DISABLED TESTS

E0603 01:32:05.951160  4533 process.cpp:968] Failed to accept socket: future discarded
make[4]: *** [check-local] Error 1
make[4]: Leaving directory `/mesos/mesos-1.4.0/_build/src'
make[3]: *** [check-am] Error 2
make[3]: Leaving directory `/mesos/mesos-1.4.0/_build/src'
make[2]: *** [check] Error 2
make[2]: Leaving directory `/mesos/mesos-1.4.0/_build/src'
make[1]: *** [check-recursive] Error 1
make[1]: Leaving directory `/mesos/mesos-1.4.0/_build'
make: *** [distcheck] Error 1
+ docker rmi mesos-1496447999-26051
Untagged: mesos-1496447999-26051:latest
Deleted: sha256:7954c067539bffba59e664336f68a2c1f0e48eec01be79a74b7a181da4ef5eda
Deleted: sha256:c91598d874a7ae6da21d86c8c396f141b392c1386ecd27b00d7c8663cb7e91d6
Deleted: sha256:b7c008caff7c29a827e2c7267e0510e2b9906cec51b322187f0e4e831e0651ca
Deleted: sha256:ec4b4f970791a1028f8bf8bbc617bb8573b192b8f1dc9c11e5263b93c6302102
Deleted: sha256:ba209218f3a8e588d4d74fb6964a8d033d883efc5a4fbb1aaa0bffb2b0ffac61
Deleted: sha256:dca1a45c41dbeea6bc3830884a76f668ce298acf44b3803c74cc5f5ce16b2950
Deleted: sha256:bb6d75c2521048e4de3a83f40bbd8bbfc006314900b337c2ae5636841045f8ff
Deleted: sha256:cbb8411f4017f2f71ef021421d12e6602872a628ad42bd8c97781fc198ad7cc5
Deleted: sha256:ca9480e7d1f2926d4c2d236356845e20647727fec240d76833fdd847415ac0d7
Deleted: sha256:b440491b036fb39e024b3387ef779383a667e3147478b41ac960185e74e05435
Deleted: sha256:42717cb6a4ba0ec41ba893505a40cf4051dfeefd0aa47600dc1a8ba93bf2e41a
Deleted: sha256:bcc742078bee13380fd784977c7511f69f9ad668200af934957f8874ee5b3d00
Deleted: sha256:328233fa07b1c214e74554f4ec21365274890dc5062088a743383581a8fd9a4b
Deleted: sha256:69fce2b27ed5aa0b1dec450164d92d7dae95c10e9f757c38f53f07654d1487c5
Deleted: sha256:8033c31043a47c4f5e2f7104c1e0eec965e18331454d743d65669a5172395010
Deleted: sha256:ae7205a01f8737bf06dea0959c5c0cb0b1d64c3035d8ef8a613e9f544b0e2ebd
Deleted: sha256:844a96d470cf7fef9c20288e659c77283f5709a847ed69d68c7468e092bee65f
Deleted: sha256:73acdf7334cd6eb24dcafd7c7d6c46bd49870262ac200360960267107927ccf4
Deleted: sha256:6493418c723b35f6d39bc2c50b27cf6716cdeca9b2988656581219e8ef0d03d0
Deleted: sha256:2725341609b60bfb3b42b91a55738aa068d7d95b1797d703730c7170ff154c7a
Deleted: sha256:3b5da8d84741d0ebc462bd3605d133207f9a37fe0f8426c24303461e901d290c
Deleted: sha256:b5e5900ab28755c55f03390dd48ada59f2aa327b1363a449bdd01375d9b640aa
Deleted: sha256:54b2e5f8de966be1347547aa1bd7b95ff54b6d8024116861dfd28581b6709b48
Deleted: sha256:5ed8d736a8099d70d167c0790e2b56a102190ad0a69902bf5f2f212f7a456283
Build step 'Execute shell' marked build as failure

Mime
View raw message