mesos-builds mailing list archives

Site index · List index
Message view « Date » · « Thread »
Top « Date » · « Thread »
From Apache Jenkins Server <jenk...@builds.apache.org>
Subject Build failed in Jenkins: Mesos-Buildbot » autotools,gcc,--verbose --enable-libevent --enable-ssl,GLOG_v=1 MESOS_VERBOSE=1,centos:7,(ubuntu)&&(!ubuntu-us1)&&(!ubuntu-eu2) #3842
Date Tue, 27 Jun 2017 09:58:23 GMT
See <https://builds.apache.org/job/Mesos-Buildbot/BUILDTOOL=autotools,COMPILER=gcc,CONFIGURATION=--verbose%20--enable-libevent%20--enable-ssl,ENVIRONMENT=GLOG_v=1%20MESOS_VERBOSE=1,OS=centos%3A7,label_exp=(ubuntu)&&(!ubuntu-us1)&&(!ubuntu-eu2)/3842/display/redirect?page=changes>

Changes:

[adam] Marked 1.2.2 as WIP in CHANGELOG.

[alexr] Forward declared CheckerProcess.

------------------------------------------
[...truncated 2.70 MB...]
I0627 09:58:11.726527  2483 openssl.cpp:424] CA directory path unspecified! NOTE: Set CA directory
path with LIBPROCESS_SSL_CA_DIR=<dirpath>
I0627 09:58:11.726539  2483 openssl.cpp:429] Will not verify peer certificate!
NOTE: Set LIBPROCESS_SSL_VERIFY_CERT=1 to enable peer certificate verification
I0627 09:58:11.726549  2483 openssl.cpp:435] Will only verify peer certificate if presented!
NOTE: Set LIBPROCESS_SSL_REQUIRE_CERT=1 to require peer certificate verification
I0627 09:58:11.739032  2500 libevent_ssl_socket.cpp:1170] Socket error: error:140760FC:SSL
routines:SSL23_GET_CLIENT_HELLO:unknown protocol
[       OK ] SSLTest.NoValidDowngradeEachProtocol (1006 ms)
[ RUN      ] SSLTest.PeerAddress
I0627 09:58:12.046114  2483 openssl.cpp:419] CA file path is unspecified! NOTE: Set CA file
path with LIBPROCESS_SSL_CA_FILE=<filepath>
I0627 09:58:12.046142  2483 openssl.cpp:424] CA directory path unspecified! NOTE: Set CA directory
path with LIBPROCESS_SSL_CA_DIR=<dirpath>
I0627 09:58:12.046150  2483 openssl.cpp:429] Will not verify peer certificate!
NOTE: Set LIBPROCESS_SSL_VERIFY_CERT=1 to enable peer certificate verification
I0627 09:58:12.046156  2483 openssl.cpp:435] Will only verify peer certificate if presented!
NOTE: Set LIBPROCESS_SSL_REQUIRE_CERT=1 to require peer certificate verification
[       OK ] SSLTest.PeerAddress (224 ms)
[ RUN      ] SSLTest.HTTPSGet
I0627 09:58:13.182519  2483 openssl.cpp:419] CA file path is unspecified! NOTE: Set CA file
path with LIBPROCESS_SSL_CA_FILE=<filepath>
I0627 09:58:13.182545  2483 openssl.cpp:424] CA directory path unspecified! NOTE: Set CA directory
path with LIBPROCESS_SSL_CA_DIR=<dirpath>
I0627 09:58:13.182550  2483 openssl.cpp:429] Will not verify peer certificate!
NOTE: Set LIBPROCESS_SSL_VERIFY_CERT=1 to enable peer certificate verification
I0627 09:58:13.182554  2483 openssl.cpp:435] Will only verify peer certificate if presented!
NOTE: Set LIBPROCESS_SSL_REQUIRE_CERT=1 to require peer certificate verification
[       OK ] SSLTest.HTTPSGet (1138 ms)
[ RUN      ] SSLTest.HTTPSPost
I0627 09:58:13.422013  2483 openssl.cpp:419] CA file path is unspecified! NOTE: Set CA file
path with LIBPROCESS_SSL_CA_FILE=<filepath>
I0627 09:58:13.422030  2483 openssl.cpp:424] CA directory path unspecified! NOTE: Set CA directory
path with LIBPROCESS_SSL_CA_DIR=<dirpath>
I0627 09:58:13.422035  2483 openssl.cpp:429] Will not verify peer certificate!
NOTE: Set LIBPROCESS_SSL_VERIFY_CERT=1 to enable peer certificate verification
I0627 09:58:13.422039  2483 openssl.cpp:435] Will only verify peer certificate if presented!
NOTE: Set LIBPROCESS_SSL_REQUIRE_CERT=1 to require peer certificate verification
[       OK ] SSLTest.HTTPSPost (239 ms)
[ RUN      ] SSLTest.SilentSocket
I0627 09:58:13.583866  2483 openssl.cpp:419] CA file path is unspecified! NOTE: Set CA file
path with LIBPROCESS_SSL_CA_FILE=<filepath>
I0627 09:58:13.583883  2483 openssl.cpp:424] CA directory path unspecified! NOTE: Set CA directory
path with LIBPROCESS_SSL_CA_DIR=<dirpath>
I0627 09:58:13.583887  2483 openssl.cpp:429] Will not verify peer certificate!
NOTE: Set LIBPROCESS_SSL_VERIFY_CERT=1 to enable peer certificate verification
I0627 09:58:13.583891  2483 openssl.cpp:435] Will only verify peer certificate if presented!
NOTE: Set LIBPROCESS_SSL_REQUIRE_CERT=1 to require peer certificate verification
I0627 09:58:13.590242  2500 libevent_ssl_socket.cpp:1170] Socket error: error:00000000:lib(0):func(0):reason(0)
[       OK ] SSLTest.SilentSocket (162 ms)
[----------] 15 tests from SSLTest (9608 ms total)

[----------] 42 tests from Scheme/HTTPTest
[ RUN      ] Scheme/HTTPTest.Endpoints/0
I0627 09:58:13.955958  2483 openssl.cpp:419] CA file path is unspecified! NOTE: Set CA file
path with LIBPROCESS_SSL_CA_FILE=<filepath>
I0627 09:58:13.955974  2483 openssl.cpp:424] CA directory path unspecified! NOTE: Set CA directory
path with LIBPROCESS_SSL_CA_DIR=<dirpath>
I0627 09:58:13.955979  2483 openssl.cpp:429] Will not verify peer certificate!
NOTE: Set LIBPROCESS_SSL_VERIFY_CERT=1 to enable peer certificate verification
I0627 09:58:13.955983  2483 openssl.cpp:435] Will only verify peer certificate if presented!
NOTE: Set LIBPROCESS_SSL_REQUIRE_CERT=1 to require peer certificate verification
I0627 09:58:13.956324  2500 process.cpp:968] Failed to accept socket: future discarded
I0627 09:58:13.959195  2483 process.cpp:1282] libprocess is initialized on 172.17.0.4:36755
with 16 worker threads
I0627 09:58:13.964536  3245 process.cpp:3779] Handling HTTP event for process '(74)' with
path: '/(74)/body'
I0627 09:58:13.969743  3239 process.cpp:3779] Handling HTTP event for process '(74)' with
path: '/(74)/pipe'
I0627 09:58:13.978221  3238 process.cpp:3779] Handling HTTP event for process '(74)' with
path: '/(74)/body'
I0627 09:58:13.978785  3244 process.cpp:3836] Failed to process request for '/(74)/body':
failure
I0627 09:58:13.978803  3239 process.cpp:1495] Returning '500 Internal Server Error' for '/(74)/body'
(failure)
[       OK ] Scheme/HTTPTest.Endpoints/0 (390 ms)
[ RUN      ] Scheme/HTTPTest.Endpoints/1
I0627 09:58:13.983570  2483 process.cpp:1282] libprocess is initialized on 172.17.0.4:37835
with 16 worker threads
I0627 09:58:13.988858  3261 process.cpp:3779] Handling HTTP event for process '(75)' with
path: '/(75)/body'
I0627 09:58:13.990890  3254 process.cpp:3779] Handling HTTP event for process '(75)' with
path: '/(75)/pipe'
I0627 09:58:13.993651  3263 process.cpp:3779] Handling HTTP event for process '(75)' with
path: '/(75)/body'
I0627 09:58:13.994285  3259 process.cpp:3836] Failed to process request for '/(75)/body':
failure
I0627 09:58:13.994316  3254 process.cpp:1495] Returning '500 Internal Server Error' for '/(75)/body'
(failure)
I0627 09:58:13.995359  3266 process.cpp:855] Decode failure: Connection reset by peer
E0627 09:58:13.995415  3266 process.cpp:2469] Failed to shutdown socket with fd 9, address
172.17.0.4:37835: Transport endpoint is not connected
[       OK ] Scheme/HTTPTest.Endpoints/1 (15 ms)
[ RUN      ] Scheme/HTTPTest.EndpointsHelp/0
I0627 09:58:14.545239  2483 openssl.cpp:419] CA file path is unspecified! NOTE: Set CA file
path with LIBPROCESS_SSL_CA_FILE=<filepath>
I0627 09:58:14.545265  2483 openssl.cpp:424] CA directory path unspecified! NOTE: Set CA directory
path with LIBPROCESS_SSL_CA_DIR=<dirpath>
I0627 09:58:14.545270  2483 openssl.cpp:429] Will not verify peer certificate!
NOTE: Set LIBPROCESS_SSL_VERIFY_CERT=1 to enable peer certificate verification
I0627 09:58:14.545274  2483 openssl.cpp:435] Will only verify peer certificate if presented!
NOTE: Set LIBPROCESS_SSL_REQUIRE_CERT=1 to require peer certificate verification
I0627 09:58:14.545719  3266 process.cpp:968] Failed to accept socket: future discarded
I0627 09:58:14.551070  2483 process.cpp:1282] libprocess is initialized on 172.17.0.4:40354
with 16 worker threads
I0627 09:58:14.556752  3269 process.cpp:3779] Handling HTTP event for process 'help' with
path: '/help'
I0627 09:58:14.562573  3273 process.cpp:3779] Handling HTTP event for process 'help' with
path: '/help'
I0627 09:58:14.568815  3275 process.cpp:3779] Handling HTTP event for process 'help' with
path: '/help/(76)/body'
I0627 09:58:14.574556  3267 process.cpp:3779] Handling HTTP event for process 'help' with
path: '/help/(76)/a/b/c'
[       OK ] Scheme/HTTPTest.EndpointsHelp/0 (581 ms)
[ RUN      ] Scheme/HTTPTest.EndpointsHelp/1
I0627 09:58:14.578845  2483 process.cpp:1282] libprocess is initialized on 172.17.0.4:56652
with 16 worker threads
I0627 09:58:14.579936  3288 process.cpp:3779] Handling HTTP event for process 'help' with
path: '/help'
I0627 09:58:14.582108  3284 process.cpp:3779] Handling HTTP event for process 'help' with
path: '/help'
I0627 09:58:14.585065  3291 process.cpp:3779] Handling HTTP event for process 'help' with
path: '/help/(77)/body'
I0627 09:58:14.587013  3299 process.cpp:3779] Handling HTTP event for process 'help' with
path: '/help/(77)/a/b/c'
[       OK ] Scheme/HTTPTest.EndpointsHelp/1 (12 ms)
[ RUN      ] Scheme/HTTPTest.EndpointsHelpRemoval/0
I0627 09:58:14.809187  2483 openssl.cpp:419] CA file path is unspecified! NOTE: Set CA file
path with LIBPROCESS_SSL_CA_FILE=<filepath>
I0627 09:58:14.809211  2483 openssl.cpp:424] CA directory path unspecified! NOTE: Set CA directory
path with LIBPROCESS_SSL_CA_DIR=<dirpath>
I0627 09:58:14.809216  2483 openssl.cpp:429] Will not verify peer certificate!
NOTE: Set LIBPROCESS_SSL_VERIFY_CERT=1 to enable peer certificate verification
I0627 09:58:14.809221  2483 openssl.cpp:435] Will only verify peer certificate if presented!
NOTE: Set LIBPROCESS_SSL_REQUIRE_CERT=1 to require peer certificate verification
I0627 09:58:14.809854  3300 process.cpp:968] Failed to accept socket: future discarded
I0627 09:58:14.819442  2483 process.cpp:1282] libprocess is initialized on 172.17.0.4:57147
with 16 worker threads
I0627 09:58:14.825234  3301 process.cpp:3779] Handling HTTP event for process 'help' with
path: '/help/(78)/body'
I0627 09:58:14.831148  3308 process.cpp:3779] Handling HTTP event for process 'help' with
path: '/help/(78)/bogus'
[       OK ] Scheme/HTTPTest.EndpointsHelpRemoval/0 (244 ms)
[ RUN      ] Scheme/HTTPTest.EndpointsHelpRemoval/1
I0627 09:58:14.843358  2483 process.cpp:1282] libprocess is initialized on 172.17.0.4:56930
with 16 worker threads
I0627 09:58:14.845175  3318 process.cpp:3779] Handling HTTP event for process 'help' with
path: '/help/(79)/body'
I0627 09:58:14.847957  3333 process.cpp:3779] Handling HTTP event for process 'help' with
path: '/help/(79)/bogus'
[       OK ] Scheme/HTTPTest.EndpointsHelpRemoval/1 (17 ms)
[ RUN      ] Scheme/HTTPTest.PipeEOF/0
I0627 09:58:15.313211  2483 openssl.cpp:419] CA file path is unspecified! NOTE: Set CA file
path with LIBPROCESS_SSL_CA_FILE=<filepath>
I0627 09:58:15.313238  2483 openssl.cpp:424] CA directory path unspecified! NOTE: Set CA directory
path with LIBPROCESS_SSL_CA_DIR=<dirpath>
I0627 09:58:15.313244  2483 openssl.cpp:429] Will not verify peer certificate!
NOTE: Set LIBPROCESS_SSL_VERIFY_CERT=1 to enable peer certificate verification
I0627 09:58:15.313248  2483 openssl.cpp:435] Will only verify peer certificate if presented!
NOTE: Set LIBPROCESS_SSL_REQUIRE_CERT=1 to require peer certificate verification
I0627 09:58:15.313824  3334 process.cpp:968] Failed to accept socket: future discarded
I0627 09:58:15.319384  2483 process.cpp:1282] libprocess is initialized on 172.17.0.4:55525
with 16 worker threads
[       OK ] Scheme/HTTPTest.PipeEOF/0 (473 ms)
[ RUN      ] Scheme/HTTPTest.PipeEOF/1
I0627 09:58:15.326624  2483 process.cpp:1282] libprocess is initialized on 172.17.0.4:42622
with 16 worker threads
[       OK ] Scheme/HTTPTest.PipeEOF/1 (5 ms)
[ RUN      ] Scheme/HTTPTest.PipeFailure/0
I0627 09:58:15.508410  2483 openssl.cpp:419] CA file path is unspecified! NOTE: Set CA file
path with LIBPROCESS_SSL_CA_FILE=<filepath>
I0627 09:58:15.508433  2483 openssl.cpp:424] CA directory path unspecified! NOTE: Set CA directory
path with LIBPROCESS_SSL_CA_DIR=<dirpath>
I0627 09:58:15.508440  2483 openssl.cpp:429] Will not verify peer certificate!
NOTE: Set LIBPROCESS_SSL_VERIFY_CERT=1 to enable peer certificate verification
I0627 09:58:15.508443  2483 openssl.cpp:435] Will only verify peer certificate if presented!
NOTE: Set LIBPROCESS_SSL_REQUIRE_CERT=1 to require peer certificate verification
I0627 09:58:15.509001  3368 process.cpp:968] Failed to accept socket: future discarded
I0627 09:58:15.519163  2483 process.cpp:1282] libprocess is initialized on 172.17.0.4:58751
with 16 worker threads
[       OK ] Scheme/HTTPTest.PipeFailure/0 (192 ms)
[ RUN      ] Scheme/HTTPTest.PipeFailure/1
I0627 09:58:15.522048  2483 process.cpp:1282] libprocess is initialized on 172.17.0.4:52505
with 16 worker threads
[       OK ] Scheme/HTTPTest.PipeFailure/1 (3 ms)
[ RUN      ] Scheme/HTTPTest.PipeReaderCloses/0
I0627 09:58:15.880883  2483 openssl.cpp:419] CA file path is unspecified! NOTE: Set CA file
path with LIBPROCESS_SSL_CA_FILE=<filepath>
I0627 09:58:15.880909  2483 openssl.cpp:424] CA directory path unspecified! NOTE: Set CA directory
path with LIBPROCESS_SSL_CA_DIR=<dirpath>
I0627 09:58:15.880915  2483 openssl.cpp:429] Will not verify peer certificate!
NOTE: Set LIBPROCESS_SSL_VERIFY_CERT=1 to enable peer certificate verification
I0627 09:58:15.880919  2483 openssl.cpp:435] Will only verify peer certificate if presented!
NOTE: Set LIBPROCESS_SSL_REQUIRE_CERT=1 to require peer certificate verification
I0627 09:58:15.881491  3402 process.cpp:968] Failed to accept socket: future discarded
I0627 09:58:15.892014  2483 process.cpp:1282] libprocess is initialized on 172.17.0.4:36678
with 16 worker threads
[       OK ] Scheme/HTTPTest.PipeReaderCloses/0 (370 ms)
[ RUN      ] Scheme/HTTPTest.PipeReaderCloses/1
I0627 09:58:15.903012  2483 process.cpp:1282] libprocess is initialized on 172.17.0.4:41582
with 16 worker threads
[       OK ] Scheme/HTTPTest.PipeReaderCloses/1 (11 ms)
[ RUN      ] Scheme/HTTPTest.Encode/0
I0627 09:58:16.135630  2483 openssl.cpp:419] CA file path is unspecified! NOTE: Set CA file
path with LIBPROCESS_SSL_CA_FILE=<filepath>
I0627 09:58:16.135658  2483 openssl.cpp:424] CA directory path unspecified! NOTE: Set CA directory
path with LIBPROCESS_SSL_CA_DIR=<dirpath>
I0627 09:58:16.135663  2483 openssl.cpp:429] Will not verify peer certificate!
NOTE: Set LIBPROCESS_SSL_VERIFY_CERT=1 to enable peer certificate verification
I0627 09:58:16.135669  2483 openssl.cpp:435] Will only verify peer certificate if presented!
NOTE: Set LIBPROCESS_SSL_REQUIRE_CERT=1 to require peer certificate verification
I0627 09:58:16.136117  3436 process.cpp:968] Failed to accept socket: future discarded
I0627 09:58:16.139673  2483 process.cpp:1282] libprocess is initialized on 172.17.0.4:51402
with 16 worker threads
[       OK ] Scheme/HTTPTest.Encode/0 (237 ms)
[ RUN      ] Scheme/HTTPTest.Encode/1
I0627 09:58:16.142267  2483 process.cpp:1282] libprocess is initialized on 172.17.0.4:60093
with 16 worker threads
[       OK ] Scheme/HTTPTest.Encode/1 (2 ms)
[ RUN      ] Scheme/HTTPTest.PathParse/0
I0627 09:58:16.475003  2483 openssl.cpp:419] CA file path is unspecified! NOTE: Set CA file
path with LIBPROCESS_SSL_CA_FILE=<filepath>
I0627 09:58:16.475028  2483 openssl.cpp:424] CA directory path unspecified! NOTE: Set CA directory
path with LIBPROCESS_SSL_CA_DIR=<dirpath>
I0627 09:58:16.475033  2483 openssl.cpp:429] Will not verify peer certificate!
NOTE: Set LIBPROCESS_SSL_VERIFY_CERT=1 to enable peer certificate verification
I0627 09:58:16.475037  2483 openssl.cpp:435] Will only verify peer certificate if presented!
NOTE: Set LIBPROCESS_SSL_REQUIRE_CERT=1 to require peer certificate verification
I0627 09:58:16.475680  3470 process.cpp:968] Failed to accept socket: future discarded
I0627 09:58:16.479239  2483 process.cpp:1282] libprocess is initialized on 172.17.0.4:44013
with 16 worker threads
[       OK ] Scheme/HTTPTest.PathParse/0 (337 ms)
[ RUN      ] Scheme/HTTPTest.PathParse/1
I0627 09:58:16.487437  2483 process.cpp:1282] libprocess is initialized on 172.17.0.4:43948
with 16 worker threads
[       OK ] Scheme/HTTPTest.PathParse/1 (8 ms)
[ RUN      ] Scheme/HTTPTest.Get/0
I0627 09:58:16.931704  2483 openssl.cpp:419] CA file path is unspecified! NOTE: Set CA file
path with LIBPROCESS_SSL_CA_FILE=<filepath>
I0627 09:58:16.931727  2483 openssl.cpp:424] CA directory path unspecified! NOTE: Set CA directory
path with LIBPROCESS_SSL_CA_DIR=<dirpath>
I0627 09:58:16.931732  2483 openssl.cpp:429] Will not verify peer certificate!
NOTE: Set LIBPROCESS_SSL_VERIFY_CERT=1 to enable peer certificate verification
I0627 09:58:16.931740  2483 openssl.cpp:435] Will only verify peer certificate if presented!
NOTE: Set LIBPROCESS_SSL_REQUIRE_CERT=1 to require peer certificate verification
I0627 09:58:16.932193  3504 process.cpp:968] Failed to accept socket: future discarded
*** Aborted at 1498557496 (unix time) try "date -d @1498557496" if you are using GNU date
***
PC: @     0x7f5397f30912 (unknown)
*** SIGSEGV (@0x7f5349e18068) received by PID 2483 (TID 0x7f53937cd700) from PID 1239515240;
stack trace: ***
I0627 09:58:16.934547  2483 process.cpp:1282] libprocess is initialized on 172.17.0.4:50357
with 16 worker threads
    @     0x7f53987ac370 (unknown)
    @     0x7f5397f30912 (unknown)
    @     0x7f5397f30f8c (unknown)
    @           0x42b1a3 process::UPID::UPID()
    @           0x8fcdec process::DispatchEvent::DispatchEvent()
I0627 09:58:16.940096  3518 process.cpp:3779] Handling HTTP event for process '(80)' with
path: '/(80)/get'
    @           0x8f5275 process::internal::dispatch()
    @           0x910002 process::dispatch<>()
I0627 09:58:16.945485  3519 process.cpp:3779] Handling HTTP event for process '(80)' with
path: '/(80)/get'
    @           0x8f4184 process::ProcessBase::route()
[       OK ] Scheme/HTTPTest.Get/0 (463 ms)
[ RUN      ] Scheme/HTTPTest.Get/1
    @           0x9e88b9 process::ProcessBase::route<>()
    @           0x9e4bb2 process::Help::initialize()
    @           0x8ed69a process::ProcessManager::resume()
    @           0x8e9a98 _ZZN7process14ProcessManager12init_threadsEvENKUt_clEv
    @           0x8fc38c _ZNSt12_Bind_simpleIFZN7process14ProcessManager12init_threadsEvEUt_vEE9_M_invokeIIEEEvSt12_Index_tupleIIXspT_EEE
    @           0x8fc2d0 _ZNSt12_Bind_simpleIFZN7process14ProcessManager12init_threadsEvEUt_vEEclEv
    @           0x8fc25a _ZNSt6thread5_ImplISt12_Bind_simpleIFZN7process14ProcessManager12init_threadsEvEUt_vEEE6_M_runEv
    @     0x7f5397f27230 (unknown)
    @     0x7f53987a4dc5 start_thread
    @     0x7f539769076d __clone
make[7]: *** [check-local] Segmentation fault
make[7]: Leaving directory `/mesos/mesos-1.4.0/_build/3rdparty/libprocess'
make[6]: *** [check-am] Error 2
make[6]: Leaving directory `/mesos/mesos-1.4.0/_build/3rdparty/libprocess'
make[5]: *** [check-recursive] Error 1
make[5]: Leaving directory `/mesos/mesos-1.4.0/_build/3rdparty/libprocess'
make[4]: *** [check] Error 2
make[4]: Leaving directory `/mesos/mesos-1.4.0/_build/3rdparty/libprocess'
make[3]: *** [check-recursive] Error 1
make[3]: Leaving directory `/mesos/mesos-1.4.0/_build/3rdparty'
make[2]: *** [check] Error 2
make[2]: Leaving directory `/mesos/mesos-1.4.0/_build/3rdparty'
make[1]: *** [check-recursive] Error 1
make[1]: Leaving directory `/mesos/mesos-1.4.0/_build'
make: *** [distcheck] Error 1
+ docker rmi mesos-1498556047-30254
Untagged: mesos-1498556047-30254:latest
Deleted: sha256:8bebaa37627de13ffdd6eb3349a1b54691ac100b3975b3df62352cbd4a05a033
Deleted: sha256:89e72263ecd26fae6cab68845d82ccd93a3bd4009776e478fe0552d03c6de723
Deleted: sha256:14638bcd6d61f17bac207eb67c60a39fd1f86fe31b937bfff82cf4332c1363ed
Deleted: sha256:7e96aadc3e07d20614d0b897465339a36f196f5d97a8b585304fda2c6aa1bd9f
Deleted: sha256:060fc3d4442ac89d395fc4e8e93437fce1ab79b33cabd383cd2dc43e9b31301f
Deleted: sha256:ce79335a872842b8e63250c9b8d5e3eb06bc293ef42f95906e90f5a09b8e4834
Deleted: sha256:37c7faffe19ba861b0c7d9a46b41124787df74110be958646c301d5af881aaed
Deleted: sha256:11669e4c57788751479f62ddabd768f002819d976ad80811bb38772d482548ca
Deleted: sha256:3ad33cf78d264bd89167a597002f53d6e21fe8c9dcb57abc213f77199ab377fa
Deleted: sha256:8174340ca29c673b7a5787fa135e11f4d8ad447cac88018931178f5718eb242f
Deleted: sha256:abc7870b35ef24492097fb919210d7bcda985fd80a101b69ec815607ffa0ebda
Deleted: sha256:6f4bd41f1460caabf264fd40b4eecac859a4bbf60071f913cabd73751ce110dc
Deleted: sha256:60c0546b777ae7fb7fe11bd4fab46247c9d25b9a64524051909fb93a7f634c79
Deleted: sha256:33b17f6a5b12db1aefe16e6f28b77fab4ecc474c1d4e5a2c6c212ef811730952
Deleted: sha256:263b29f99dd47901ae2056c3990294d28345ffc2764215daecffcd0c06eff5e6
Deleted: sha256:7ef0e394c2c075681b6526262db06cf31cdc0d92a6974c6806e3c7f17a3fb93d
Deleted: sha256:cf566363b275f50470fd5f4794391525330782d1ce6f2f182f3bd8d8eff062dd
Deleted: sha256:70f4f9d57e0deb4a26f2c763cdfb7ac95c820c695eb2e5d5ca728e4edc05e24c
Deleted: sha256:dabacdaa368dc6dfe936094aff0e6b74fd0b35360b261e811bb1860a660be908
Deleted: sha256:6304cc7fbcdfdf758f437cf969bae34b229e24c41e89ace4b50f83a6fc0a0b2c
Deleted: sha256:5787e771db72742fb89c678dd2828e2a861e202123373707e5178558e3a9861e
Deleted: sha256:b04a21e646ee8c0ca33bd2800563fa6f115d0fd965863e7db058ae42addfab5e
Deleted: sha256:bbb5d27ffa4b337c8dc780ba6842c1f28b6eb266f88421c40047ff77c633d76a
Deleted: sha256:b083c8e730c5b85a66e7ba4ff6fa7a65d01c5a457f60e9883d53590f32685b2a
Deleted: sha256:b2119c94981c15b02d04f2526317e063af296d7d652d48e58f597609d505a0ea
Build step 'Execute shell' marked build as failure
Not sending mail to unregistered user neil.conway@gmail.com

Mime
View raw message