mesos-builds mailing list archives

Site index · List index
Message view « Date » · « Thread »
Top « Date » · « Thread »
From Apache Jenkins Server <jenk...@builds.apache.org>
Subject Build failed in Jenkins: Mesos-Buildbot » autotools,gcc,--verbose --enable-libevent --enable-ssl,GLOG_v=1 MESOS_VERBOSE=1,centos:7,(ubuntu)&&(!ubuntu-us1)&&(!ubuntu-eu2) #3779
Date Thu, 08 Jun 2017 21:45:35 GMT
See <https://builds.apache.org/job/Mesos-Buildbot/BUILDTOOL=autotools,COMPILER=gcc,CONFIGURATION=--verbose%20--enable-libevent%20--enable-ssl,ENVIRONMENT=GLOG_v=1%20MESOS_VERBOSE=1,OS=centos%3A7,label_exp=(ubuntu)&&(!ubuntu-us1)&&(!ubuntu-eu2)/3779/display/redirect?page=changes>

Changes:

[bmahler] Updated Gauge to take std::function instead of Deferred.

------------------------------------------
[...truncated 29.23 MB...]
[ RUN      ] Endpoint/SlaveEndpointTest.UnauthorizedRequest/0
I0608 21:45:28.185426  8732 containerizer.cpp:230] Using isolation: posix/cpu,posix/mem,filesystem/posix,network/cni,environment_secret
W0608 21:45:28.186187  8732 backend.cpp:76] Failed to create 'aufs' backend: AufsBackend requires
root privileges
W0608 21:45:28.186308  8732 backend.cpp:76] Failed to create 'bind' backend: BindBackend requires
root privileges
I0608 21:45:28.186352  8732 provisioner.cpp:255] Using default backend 'copy'
I0608 21:45:28.191448 29015 slave.cpp:248] Mesos agent started on (760)@172.17.0.3:43187
I0608 21:45:28.191490 29015 slave.cpp:249] Flags at startup: --acls="" --appc_simple_discovery_uri_prefix="http://"
--appc_store_dir="/tmp/Endpoint_SlaveEndpointTest_UnauthorizedRequest_0_vPdxC5/store/appc"
--authenticate_http_executors="true" --authenticate_http_readonly="true" --authenticate_http_readwrite="true"
--authenticatee="crammd5" --authentication_backoff_factor="1secs" --authorizer="local" --cgroups_cpu_enable_pids_and_tids_count="false"
--cgroups_enable_cfs="false" --cgroups_hierarchy="/sys/fs/cgroup" --cgroups_limit_swap="false"
--cgroups_root="mesos" --container_disk_watch_interval="15secs" --containerizers="mesos" --credential="/tmp/Endpoint_SlaveEndpointTest_UnauthorizedRequest_0_vPdxC5/credential"
--default_role="*" --disk_watch_interval="1mins" --docker="docker" --docker_kill_orphans="true"
--docker_registry="https://registry-1.docker.io" --docker_remove_delay="6hrs" --docker_socket="/var/run/docker.sock"
--docker_stop_timeout="0ns" --docker_store_dir="/tmp/Endpoint_SlaveEndpointTest_UnauthorizedRequest_0_vPdxC5/store/docker"
--docker_volume_checkpoint_dir="/var/run/mesos/isolators/docker/volume" --enforce_container_disk_quota="false"
--executor_registration_timeout="1mins" --executor_reregistration_timeout="2secs" --executor_secret_key="/tmp/Endpoint_SlaveEndpointTest_UnauthorizedRequest_0_vPdxC5/executor_secret_key"
--executor_shutdown_grace_period="5secs" --fetcher_cache_dir="/tmp/Endpoint_SlaveEndpointTest_UnauthorizedRequest_0_vPdxC5/fetch"
--fetcher_cache_size="2GB" --frameworks_home="" --gc_delay="1weeks" --gc_disk_headroom="0.1"
--hadoop_home="" --help="false" --hostname_lookup="true" --http_command_executor="false" --http_credentials="/tmp/Endpoint_SlaveEndpointTest_UnauthorizedRequest_0_vPdxC5/http_credentials"
--http_heartbeat_interval="30secs" --initialize_driver_logging="true" --isolation="posix/cpu,posix/mem"
--launcher="posix" --launcher_dir="/mesos/mesos-1.4.0/_build/src" --logbufsecs="0" --logging_level="INFO"
--max_completed_executors_per_framework="150" --oversubscribed_resources_interval="15secs"
--perf_duration="10secs" --perf_interval="1mins" --port="5051" --qos_correction_interval_min="0ns"
--quiet="false" --recover="reconnect" --recovery_timeout="15mins" --registration_backoff_factor="10ms"
--resources="cpus:2;gpus:0;mem:1024;disk:1024;ports:[31000-32000]" --revocable_cpu_low_priority="true"
--runtime_dir="/tmp/Endpoint_SlaveEndpointTest_UnauthorizedRequest_0_vPdxC5" --sandbox_directory="/mnt/mesos/sandbox"
--strict="true" --switch_user="true" --systemd_enable_support="true" --systemd_runtime_directory="/run/systemd/system"
--version="false" --work_dir="/tmp/Endpoint_SlaveEndpointTest_UnauthorizedRequest_0_3YLtEX"
I0608 21:45:28.192003 29015 credentials.hpp:86] Loading credential for authentication from
'/tmp/Endpoint_SlaveEndpointTest_UnauthorizedRequest_0_vPdxC5/credential'
I0608 21:45:28.192265 29015 slave.cpp:281] Agent using credential for: test-principal
I0608 21:45:28.192289 29015 credentials.hpp:37] Loading credentials for authentication from
'/tmp/Endpoint_SlaveEndpointTest_UnauthorizedRequest_0_vPdxC5/http_credentials'
I0608 21:45:28.192643 29015 http.cpp:975] Creating default 'basic' HTTP authenticator for
realm 'mesos-agent-executor'
I0608 21:45:28.192775 29015 http.cpp:996] Creating default 'jwt' HTTP authenticator for realm
'mesos-agent-executor'
I0608 21:45:28.192960 29015 http.cpp:975] Creating default 'basic' HTTP authenticator for
realm 'mesos-agent-readonly'
I0608 21:45:28.193042 29015 http.cpp:996] Creating default 'jwt' HTTP authenticator for realm
'mesos-agent-readonly'
I0608 21:45:28.193207 29015 http.cpp:975] Creating default 'basic' HTTP authenticator for
realm 'mesos-agent-readwrite'
I0608 21:45:28.193289 29015 http.cpp:996] Creating default 'jwt' HTTP authenticator for realm
'mesos-agent-readwrite'
I0608 21:45:28.194864 29015 slave.cpp:552] Agent resources: cpus(*):2; mem(*):1024; disk(*):1024;
ports(*):[31000-32000]
I0608 21:45:28.194964 29015 slave.cpp:560] Agent attributes: [  ]
I0608 21:45:28.194984 29015 slave.cpp:565] Agent hostname: e6e6b71db3a8
I0608 21:45:28.197232 29015 status_update_manager.cpp:177] Pausing sending status updates
I0608 21:45:28.197968 29015 state.cpp:62] Recovering state from '/tmp/Endpoint_SlaveEndpointTest_UnauthorizedRequest_0_3YLtEX/meta'
I0608 21:45:28.198501 29015 status_update_manager.cpp:203] Recovering status update manager
I0608 21:45:28.198681 29015 containerizer.cpp:582] Recovering containerizer
I0608 21:45:28.200796 29015 provisioner.cpp:416] Provisioner recovery complete
I0608 21:45:28.201445 29004 slave.cpp:6127] Finished recovery
I0608 21:45:28.202255 29004 slave.cpp:6309] Querying resource estimator for oversubscribable
resources
I0608 21:45:28.202678 29014 slave.cpp:6323] Received oversubscribable resources {} from the
resource estimator
I0608 21:45:28.205502 28997 process.cpp:3778] Handling HTTP event for process 'slave(760)'
with path: '/slave(760)/monitor/statistics'
I0608 21:45:28.208428 28995 http.cpp:1115] HTTP GET for /slave(760)/monitor/statistics from
172.17.0.3:37934
I0608 21:45:28.208560 28995 http.cpp:936] Authorizing principal 'test-principal' to GET the
'/monitor/statistics' endpoint
I0608 21:45:28.211930 29015 slave.cpp:817] Agent terminating
[       OK ] Endpoint/SlaveEndpointTest.UnauthorizedRequest/0 (40 ms)
[ RUN      ] Endpoint/SlaveEndpointTest.UnauthorizedRequest/1
I0608 21:45:28.224061  8732 containerizer.cpp:230] Using isolation: posix/cpu,posix/mem,filesystem/posix,network/cni,environment_secret
W0608 21:45:28.224555  8732 backend.cpp:76] Failed to create 'aufs' backend: AufsBackend requires
root privileges
W0608 21:45:28.224660  8732 backend.cpp:76] Failed to create 'bind' backend: BindBackend requires
root privileges
I0608 21:45:28.224696  8732 provisioner.cpp:255] Using default backend 'copy'
I0608 21:45:28.227692 28996 slave.cpp:248] Mesos agent started on (761)@172.17.0.3:43187
I0608 21:45:28.227712 28996 slave.cpp:249] Flags at startup: --acls="" --appc_simple_discovery_uri_prefix="http://"
--appc_store_dir="/tmp/Endpoint_SlaveEndpointTest_UnauthorizedRequest_1_p5J6OB/store/appc"
--authenticate_http_executors="true" --authenticate_http_readonly="true" --authenticate_http_readwrite="true"
--authenticatee="crammd5" --authentication_backoff_factor="1secs" --authorizer="local" --cgroups_cpu_enable_pids_and_tids_count="false"
--cgroups_enable_cfs="false" --cgroups_hierarchy="/sys/fs/cgroup" --cgroups_limit_swap="false"
--cgroups_root="mesos" --container_disk_watch_interval="15secs" --containerizers="mesos" --credential="/tmp/Endpoint_SlaveEndpointTest_UnauthorizedRequest_1_p5J6OB/credential"
--default_role="*" --disk_watch_interval="1mins" --docker="docker" --docker_kill_orphans="true"
--docker_registry="https://registry-1.docker.io" --docker_remove_delay="6hrs" --docker_socket="/var/run/docker.sock"
--docker_stop_timeout="0ns" --docker_store_dir="/tmp/Endpoint_SlaveEndpointTest_UnauthorizedRequest_1_p5J6OB/store/docker"
--docker_volume_checkpoint_dir="/var/run/mesos/isolators/docker/volume" --enforce_container_disk_quota="false"
--executor_registration_timeout="1mins" --executor_reregistration_timeout="2secs" --executor_secret_key="/tmp/Endpoint_SlaveEndpointTest_UnauthorizedRequest_1_p5J6OB/executor_secret_key"
--executor_shutdown_grace_period="5secs" --fetcher_cache_dir="/tmp/Endpoint_SlaveEndpointTest_UnauthorizedRequest_1_p5J6OB/fetch"
--fetcher_cache_size="2GB" --frameworks_home="" --gc_delay="1weeks" --gc_disk_headroom="0.1"
--hadoop_home="" --help="false" --hostname_lookup="true" --http_command_executor="false" --http_credentials="/tmp/Endpoint_SlaveEndpointTest_UnauthorizedRequest_1_p5J6OB/http_credentials"
--http_heartbeat_interval="30secs" --initialize_driver_logging="true" --isolation="posix/cpu,posix/mem"
--launcher="posix" --launcher_dir="/mesos/mesos-1.4.0/_build/src" --logbufsecs="0" --logging_level="INFO"
--max_completed_executors_per_framework="150" --oversubscribed_resources_interval="15secs"
--perf_duration="10secs" --perf_interval="1mins" --port="5051" --qos_correction_interval_min="0ns"
--quiet="false" --recover="reconnect" --recovery_timeout="15mins" --registration_backoff_factor="10ms"
--resources="cpus:2;gpus:0;mem:1024;disk:1024;ports:[31000-32000]" --revocable_cpu_low_priority="true"
--runtime_dir="/tmp/Endpoint_SlaveEndpointTest_UnauthorizedRequest_1_p5J6OB" --sandbox_directory="/mnt/mesos/sandbox"
--strict="true" --switch_user="true" --systemd_enable_support="true" --systemd_runtime_directory="/run/systemd/system"
--version="false" --work_dir="/tmp/Endpoint_SlaveEndpointTest_UnauthorizedRequest_1_twe9Kt"
I0608 21:45:28.228075 28996 credentials.hpp:86] Loading credential for authentication from
'/tmp/Endpoint_SlaveEndpointTest_UnauthorizedRequest_1_p5J6OB/credential'
I0608 21:45:28.228246 28996 slave.cpp:281] Agent using credential for: test-principal
I0608 21:45:28.228266 28996 credentials.hpp:37] Loading credentials for authentication from
'/tmp/Endpoint_SlaveEndpointTest_UnauthorizedRequest_1_p5J6OB/http_credentials'
I0608 21:45:28.228530 28996 http.cpp:975] Creating default 'basic' HTTP authenticator for
realm 'mesos-agent-executor'
I0608 21:45:28.228639 28996 http.cpp:996] Creating default 'jwt' HTTP authenticator for realm
'mesos-agent-executor'
I0608 21:45:28.228886 28996 http.cpp:975] Creating default 'basic' HTTP authenticator for
realm 'mesos-agent-readonly'
I0608 21:45:28.228977 28996 http.cpp:996] Creating default 'jwt' HTTP authenticator for realm
'mesos-agent-readonly'
I0608 21:45:28.229174 28996 http.cpp:975] Creating default 'basic' HTTP authenticator for
realm 'mesos-agent-readwrite'
I0608 21:45:28.229274 28996 http.cpp:996] Creating default 'jwt' HTTP authenticator for realm
'mesos-agent-readwrite'
I0608 21:45:28.230506 28996 slave.cpp:552] Agent resources: cpus(*):2; mem(*):1024; disk(*):1024;
ports(*):[31000-32000]
I0608 21:45:28.230576 28996 slave.cpp:560] Agent attributes: [  ]
I0608 21:45:28.230587 28996 slave.cpp:565] Agent hostname: e6e6b71db3a8
I0608 21:45:28.230710 29010 status_update_manager.cpp:177] Pausing sending status updates
I0608 21:45:28.232461 29015 state.cpp:62] Recovering state from '/tmp/Endpoint_SlaveEndpointTest_UnauthorizedRequest_1_twe9Kt/meta'
I0608 21:45:28.232787 29003 status_update_manager.cpp:203] Recovering status update manager
I0608 21:45:28.232967 28994 containerizer.cpp:582] Recovering containerizer
I0608 21:45:28.234295 29007 provisioner.cpp:416] Provisioner recovery complete
I0608 21:45:28.234630 28994 slave.cpp:6127] Finished recovery
I0608 21:45:28.235112 28994 slave.cpp:6309] Querying resource estimator for oversubscribable
resources
I0608 21:45:28.235510 28993 slave.cpp:6323] Received oversubscribable resources {} from the
resource estimator
I0608 21:45:28.237546 28994 process.cpp:3778] Handling HTTP event for process 'slave(761)'
with path: '/slave(761)/monitor/statistics.json'
I0608 21:45:28.239120 29015 http.cpp:1115] HTTP GET for /slave(761)/monitor/statistics.json
from 172.17.0.3:37938
I0608 21:45:28.239190 29015 http.cpp:936] Authorizing principal 'test-principal' to GET the
'/monitor/statistics.json' endpoint
I0608 21:45:28.241461 29001 slave.cpp:817] Agent terminating
[       OK ] Endpoint/SlaveEndpointTest.UnauthorizedRequest/1 (28 ms)
[ RUN      ] Endpoint/SlaveEndpointTest.UnauthorizedRequest/2
I0608 21:45:28.252720  8732 containerizer.cpp:230] Using isolation: posix/cpu,posix/mem,filesystem/posix,network/cni,environment_secret
W0608 21:45:28.253222  8732 backend.cpp:76] Failed to create 'aufs' backend: AufsBackend requires
root privileges
W0608 21:45:28.253324  8732 backend.cpp:76] Failed to create 'bind' backend: BindBackend requires
root privileges
I0608 21:45:28.253360  8732 provisioner.cpp:255] Using default backend 'copy'
I0608 21:45:28.256525 28997 slave.cpp:248] Mesos agent started on (762)@172.17.0.3:43187
I0608 21:45:28.256544 28997 slave.cpp:249] Flags at startup: --acls="" --appc_simple_discovery_uri_prefix="http://"
--appc_store_dir="/tmp/Endpoint_SlaveEndpointTest_UnauthorizedRequest_2_Adwpj8/store/appc"
--authenticate_http_executors="true" --authenticate_http_readonly="true" --authenticate_http_readwrite="true"
--authenticatee="crammd5" --authentication_backoff_factor="1secs" --authorizer="local" --cgroups_cpu_enable_pids_and_tids_count="false"
--cgroups_enable_cfs="false" --cgroups_hierarchy="/sys/fs/cgroup" --cgroups_limit_swap="false"
--cgroups_root="mesos" --container_disk_watch_interval="15secs" --containerizers="mesos" --credential="/tmp/Endpoint_SlaveEndpointTest_UnauthorizedRequest_2_Adwpj8/credential"
--default_role="*" --disk_watch_interval="1mins" --docker="docker" --docker_kill_orphans="true"
--docker_registry="https://registry-1.docker.io" --docker_remove_delay="6hrs" --docker_socket="/var/run/docker.sock"
--docker_stop_timeout="0ns" --docker_store_dir="/tmp/Endpoint_SlaveEndpointTest_UnauthorizedRequest_2_Adwpj8/store/docker"
--docker_volume_checkpoint_dir="/var/run/mesos/isolators/docker/volume" --enforce_container_disk_quota="false"
--executor_registration_timeout="1mins" --executor_reregistration_timeout="2secs" --executor_secret_key="/tmp/Endpoint_SlaveEndpointTest_UnauthorizedRequest_2_Adwpj8/executor_secret_key"
--executor_shutdown_grace_period="5secs" --fetcher_cache_dir="/tmp/Endpoint_SlaveEndpointTest_UnauthorizedRequest_2_Adwpj8/fetch"
--fetcher_cache_size="2GB" --frameworks_home="" --gc_delay="1weeks" --gc_disk_headroom="0.1"
--hadoop_home="" --help="false" --hostname_lookup="true" --http_command_executor="false" --http_credentials="/tmp/Endpoint_SlaveEndpointTest_UnauthorizedRequest_2_Adwpj8/http_credentials"
--http_heartbeat_interval="30secs" --initialize_driver_logging="true" --isolation="posix/cpu,posix/mem"
--launcher="posix" --launcher_dir="/mesos/mesos-1.4.0/_build/src" --logbufsecs="0" --logging_level="INFO"
--max_completed_executors_per_framework="150" --oversubscribed_resources_interval="15secs"
--perf_duration="10secs" --perf_interval="1mins" --port="5051" --qos_correction_interval_min="0ns"
--quiet="false" --recover="reconnect" --recovery_timeout="15mins" --registration_backoff_factor="10ms"
--resources="cpus:2;gpus:0;mem:1024;disk:1024;ports:[31000-32000]" --revocable_cpu_low_priority="true"
--runtime_dir="/tmp/Endpoint_SlaveEndpointTest_UnauthorizedRequest_2_Adwpj8" --sandbox_directory="/mnt/mesos/sandbox"
--strict="true" --switch_user="true" --systemd_enable_support="true" --systemd_runtime_directory="/run/systemd/system"
--version="false" --work_dir="/tmp/Endpoint_SlaveEndpointTest_UnauthorizedRequest_2_3bobb0"
I0608 21:45:28.256964 28997 credentials.hpp:86] Loading credential for authentication from
'/tmp/Endpoint_SlaveEndpointTest_UnauthorizedRequest_2_Adwpj8/credential'
I0608 21:45:28.257164 28997 slave.cpp:281] Agent using credential for: test-principal
I0608 21:45:28.257184 28997 credentials.hpp:37] Loading credentials for authentication from
'/tmp/Endpoint_SlaveEndpointTest_UnauthorizedRequest_2_Adwpj8/http_credentials'
I0608 21:45:28.257448 28997 http.cpp:975] Creating default 'basic' HTTP authenticator for
realm 'mesos-agent-executor'
I0608 21:45:28.257560 28997 http.cpp:996] Creating default 'jwt' HTTP authenticator for realm
'mesos-agent-executor'
I0608 21:45:28.257766 28997 http.cpp:975] Creating default 'basic' HTTP authenticator for
realm 'mesos-agent-readonly'
I0608 21:45:28.257860 28997 http.cpp:996] Creating default 'jwt' HTTP authenticator for realm
'mesos-agent-readonly'
I0608 21:45:28.258033 28997 http.cpp:975] Creating default 'basic' HTTP authenticator for
realm 'mesos-agent-readwrite'
I0608 21:45:28.258124 28997 http.cpp:996] Creating default 'jwt' HTTP authenticator for realm
'mesos-agent-readwrite'
I0608 21:45:28.259528 28997 slave.cpp:552] Agent resources: cpus(*):2; mem(*):1024; disk(*):1024;
ports(*):[31000-32000]
I0608 21:45:28.259598 28997 slave.cpp:560] Agent attributes: [  ]
I0608 21:45:28.259611 28997 slave.cpp:565] Agent hostname: e6e6b71db3a8
I0608 21:45:28.259750 29011 status_update_manager.cpp:177] Pausing sending status updates
I0608 21:45:28.261518 28992 state.cpp:62] Recovering state from '/tmp/Endpoint_SlaveEndpointTest_UnauthorizedRequest_2_3bobb0/meta'
I0608 21:45:28.261853 29000 status_update_manager.cpp:203] Recovering status update manager
I0608 21:45:28.262089 28993 containerizer.cpp:582] Recovering containerizer
I0608 21:45:28.263445 28999 provisioner.cpp:416] Provisioner recovery complete
I0608 21:45:28.263849 28993 slave.cpp:6127] Finished recovery
I0608 21:45:28.264397 28993 slave.cpp:6309] Querying resource estimator for oversubscribable
resources
I0608 21:45:28.264658 29004 slave.cpp:6323] Received oversubscribable resources {} from the
resource estimator
I0608 21:45:28.266477 28995 process.cpp:3778] Handling HTTP event for process 'slave(762)'
with path: '/slave(762)/containers'
I0608 21:45:28.268535 28995 http.cpp:1115] HTTP GET for /slave(762)/containers from 172.17.0.3:37940
I0608 21:45:28.268615 28995 http.cpp:936] Authorizing principal 'test-principal' to GET the
'/containers' endpoint
I0608 21:45:28.273653 28994 slave.cpp:817] Agent terminating
[       OK ] Endpoint/SlaveEndpointTest.UnauthorizedRequest/2 (31 ms)
[ RUN      ] Endpoint/SlaveEndpointTest.NoAuthorizer/0
I0608 21:45:28.287317  8732 containerizer.cpp:230] Using isolation: posix/cpu,posix/mem,filesystem/posix,network/cni,environment_secret
W0608 21:45:28.288159  8732 backend.cpp:76] Failed to create 'aufs' backend: AufsBackend requires
root privileges
W0608 21:45:28.288305  8732 backend.cpp:76] Failed to create 'bind' backend: BindBackend requires
root privileges
I0608 21:45:28.288355  8732 provisioner.cpp:255] Using default backend 'copy'
I0608 21:45:28.290518  8732 cluster.cpp:448] Creating default 'local' authorizer
I0608 21:45:28.293212 29013 slave.cpp:248] Mesos agent started on (763)@172.17.0.3:43187
I0608 21:45:28.293246 29013 slave.cpp:249] Flags at startup: --acls="" --appc_simple_discovery_uri_prefix="http://"
--appc_store_dir="/tmp/Endpoint_SlaveEndpointTest_NoAuthorizer_0_BZSB6E/store/appc" --authenticate_http_executors="true"
--authenticate_http_readonly="true" --authenticate_http_readwrite="true" --authenticatee="crammd5"
--authentication_backoff_factor="1secs" --authorizer="local" --cgroups_cpu_enable_pids_and_tids_count="false"
--cgroups_enable_cfs="false" --cgroups_hierarchy="/sys/fs/cgroup" --cgroups_limit_swap="false"
--cgroups_root="mesos" --container_disk_watch_interval="15secs" --containerizers="mesos" --credential="/tmp/Endpoint_SlaveEndpointTest_NoAuthorizer_0_BZSB6E/credential"
--default_role="*" --disk_watch_interval="1mins" --docker="docker" --docker_kill_orphans="true"
--docker_registry="https://registry-1.docker.io" --docker_remove_delay="6hrs" --docker_socket="/var/run/docker.sock"
--docker_stop_timeout="0ns" --docker_store_dir="/tmp/Endpoint_SlaveEndpointTest_NoAuthorizer_0_BZSB6E/store/docker"
--docker_volume_checkpoint_dir="/var/run/mesos/isolators/docker/volume" --enforce_container_disk_quota="false"
--executor_registration_timeout="1mins" --executor_reregistration_timeout="2secs" --executor_secret_key="/tmp/Endpoint_SlaveEndpointTest_NoAuthorizer_0_BZSB6E/executor_secret_key"
--executor_shutdown_grace_period="5secs" --fetcher_cache_dir="/tmp/Endpoint_SlaveEndpointTest_NoAuthorizer_0_BZSB6E/fetch"
--fetcher_cache_size="2GB" --frameworks_home="" --gc_delay="1weeks" --gc_disk_headroom="0.1"
--hadoop_home="" --help="false" --hostname_lookup="true" --http_command_executor="false" --http_credentials="/tmp/Endpoint_SlaveEndpointTest_NoAuthorizer_0_BZSB6E/http_credentials"
--http_heartbeat_interval="30secs" --initialize_driver_logging="true" --isolation="posix/cpu,posix/mem"
--launcher="posix" --launcher_dir="/mesos/mesos-1.4.0/_build/src" --logbufsecs="0" --logging_level="INFO"
--max_completed_executors_per_framework="150" --oversubscribed_resources_interval="15secs"
--perf_duration="10secs" --perf_interval="1mins" --port="5051" --qos_correction_interval_min="0ns"
--quiet="false" --recover="reconnect" --recovery_timeout="15mins" --registration_backoff_factor="10ms"
--resources="cpus:2;gpus:0;mem:1024;disk:1024;ports:[31000-32000]" --revocable_cpu_low_priority="true"
--runtime_dir="/tmp/Endpoint_SlaveEndpointTest_NoAuthorizer_0_BZSB6E" --sandbox_directory="/mnt/mesos/sandbox"
--strict="true" --switch_user="true" --systemd_enable_support="true" --systemd_runtime_directory="/run/systemd/system"
--version="false" --work_dir="/tmp/Endpoint_SlaveEndpointTest_NoAuthorizer_0_t22uTw"
I0608 21:45:28.293768 29013 credentials.hpp:86] Loading credential for authentication from
'/tmp/Endpoint_SlaveEndpointTest_NoAuthorizer_0_BZSB6E/credential'
I0608 21:45:28.294049 29013 slave.cpp:281] Agent using credential for: test-principal
I0608 21:45:28.294075 29013 credentials.hpp:37] Loading credentials for authentication from
'/tmp/Endpoint_SlaveEndpointTest_NoAuthorizer_0_BZSB6E/http_credentials'
I0608 21:45:28.294438 29013 http.cpp:975] Creating default 'basic' HTTP authenticator for
realm 'mesos-agent-executor'
I0608 21:45:28.294579 29013 http.cpp:996] Creating default 'jwt' HTTP authenticator for realm
'mesos-agent-executor'
I0608 21:45:28.294822 29013 http.cpp:975] Creating default 'basic' HTTP authenticator for
realm 'mesos-agent-readonly'
I0608 21:45:28.294914 29013 http.cpp:996] Creating default 'jwt' HTTP authenticator for realm
'mesos-agent-readonly'
I0608 21:45:28.295203 29013 http.cpp:975] Creating default 'basic' HTTP authenticator for
realm 'mesos-agent-readwrite'
I0608 21:45:28.295428 29013 http.cpp:996] Creating default 'jwt' HTTP authenticator for realm
'mesos-agent-readwrite'
I0608 21:45:28.297407 29013 slave.cpp:552] Agent resources: cpus(*):2; mem(*):1024; disk(*):1024;
ports(*):[31000-32000]
I0608 21:45:28.297523 29013 slave.cpp:560] Agent attributes: [  ]
I0608 21:45:28.297544 29013 slave.cpp:565] Agent hostname: e6e6b71db3a8
I0608 21:45:28.297752 29006 status_update_manager.cpp:177] Pausing sending status updates
I0608 21:45:28.299808 29008 state.cpp:62] Recovering state from '/tmp/Endpoint_SlaveEndpointTest_NoAuthorizer_0_t22uTw/meta'
I0608 21:45:28.300178 28992 status_update_manager.cpp:203] Recovering status update manager
I0608 21:45:28.300371 29002 containerizer.cpp:582] Recovering containerizer
I0608 21:45:28.302175 28994 provisioner.cpp:416] Provisioner recovery complete
I0608 21:45:28.302593 29009 slave.cpp:6127] Finished recovery
I0608 21:45:28.303257 29009 slave.cpp:6309] Querying resource estimator for oversubscribable
resources
I0608 21:45:28.303639 29013 slave.cpp:6323] Received oversubscribable resources {} from the
resource estimator
I0608 21:45:28.306895 29005 process.cpp:3778] Handling HTTP event for process 'slave(763)'
with path: '/slave(763)/monitor/statistics'
I0608 21:45:28.309638 29005 http.cpp:1115] HTTP GET for /slave(763)/monitor/statistics from
172.17.0.3:37942
I0608 21:45:28.309738 29005 http.cpp:936] Authorizing principal 'test-principal' to GET the
'/monitor/statistics' endpoint
I0608 21:45:28.314108 29002 slave.cpp:817] Agent terminating
[       OK ] Endpoint/SlaveEndpointTest.NoAuthorizer/0 (40 ms)
[ RUN      ] Endpoint/SlaveEndpointTest.NoAuthorizer/1
I0608 21:45:28.328410  8732 containerizer.cpp:230] Using isolation: posix/cpu,posix/mem,filesystem/posix,network/cni,environment_secret
W0608 21:45:28.329367  8732 backend.cpp:76] Failed to create 'aufs' backend: AufsBackend requires
root privileges
W0608 21:45:28.329555  8732 backend.cpp:76] Failed to create 'bind' backend: BindBackend requires
root privileges
I0608 21:45:28.329732  8732 provisioner.cpp:255] Using default backend 'copy'
I0608 21:45:28.332238  8732 cluster.cpp:448] Creating default 'local' authorizer
I0608 21:45:28.334465 29001 slave.cpp:248] Mesos agent started on (764)@172.17.0.3:43187
I0608 21:45:28.334496 29001 slave.cpp:249] Flags at startup: --acls="" --appc_simple_discovery_uri_prefix="http://"
--appc_store_dir="/tmp/Endpoint_SlaveEndpointTest_NoAuthorizer_1_QqGXhc/store/appc" --authenticate_http_executors="true"
--authenticate_http_readonly="true" --authenticate_http_readwrite="true" --authenticatee="crammd5"
--authentication_backoff_factor="1secs" --authorizer="local" --cgroups_cpu_enable_pids_and_tids_count="false"
--cgroups_enable_cfs="false" --cgroups_hierarchy="/sys/fs/cgroup" --cgroups_limit_swap="false"
--cgroups_root="mesos" --container_disk_watch_interval="15secs" --containerizers="mesos" --credential="/tmp/Endpoint_SlaveEndpointTest_NoAuthorizer_1_QqGXhc/credential"
--default_role="*" --disk_watch_interval="1mins" --docker="docker" --docker_kill_orphans="true"
--docker_registry="https://registry-1.docker.io" --docker_remove_delay="6hrs" --docker_socket="/var/run/docker.sock"
--docker_stop_timeout="0ns" --docker_store_dir="/tmp/Endpoint_SlaveEndpointTest_NoAuthorizer_1_QqGXhc/store/docker"
--docker_volume_checkpoint_dir="/var/run/mesos/isolators/docker/volume" --enforce_container_disk_quota="false"
--executor_registration_timeout="1mins" --executor_reregistration_timeout="2secs" --executor_secret_key="/tmp/Endpoint_SlaveEndpointTest_NoAuthorizer_1_QqGXhc/executor_secret_key"
--executor_shutdown_grace_period="5secs" --fetcher_cache_dir="/tmp/Endpoint_SlaveEndpointTest_NoAuthorizer_1_QqGXhc/fetch"
--fetcher_cache_size="2GB" --frameworks_home="" --gc_delay="1weeks" --gc_disk_headroom="0.1"
--hadoop_home="" --help="false" --hostname_lookup="true" --http_command_executor="false" --http_credentials="/tmp/Endpoint_SlaveEndpointTest_NoAuthorizer_1_QqGXhc/http_credentials"
--http_heartbeat_interval="30secs" --initialize_driver_logging="true" --isolation="posix/cpu,posix/mem"
--launcher="posix" --launcher_dir="/mesos/mesos-1.4.0/_build/src" --logbufsecs="0" --logging_level="INFO"
--max_completed_executors_per_framework="150" --oversubscribed_resources_interval="15secs"
--perf_duration="10secs" --perf_interval="1mins" --port="5051" --qos_correction_interval_min="0ns"
--quiet="false" --recover="reconnect" --recovery_timeout="15mins" --registration_backoff_factor="10ms"
--resources="cpus:2;gpus:0;mem:1024;disk:1024;ports:[31000-32000]" --revocable_cpu_low_priority="true"
--runtime_dir="/tmp/Endpoint_SlaveEndpointTest_NoAuthorizer_1_QqGXhc" --sandbox_directory="/mnt/mesos/sandbox"
--strict="true" --switch_user="true" --systemd_enable_support="true" --systemd_runtime_directory="/run/systemd/system"
--version="false" --work_dir="/tmp/Endpoint_SlaveEndpointTest_NoAuthorizer_1_okbJY3"
I0608 21:45:28.335018 29001 credentials.hpp:86] Loading credential for authentication from
'/tmp/Endpoint_SlaveEndpointTest_NoAuthorizer_1_QqGXhc/credential'
I0608 21:45:28.335294 29001 slave.cpp:281] Agent using credential for: test-principal
I0608 21:45:28.335320 29001 credentials.hpp:37] Loading credentials for authentication from
'/tmp/Endpoint_SlaveEndpointTest_NoAuthorizer_1_QqGXhc/http_credentials'
I0608 21:45:28.335687 29001 http.cpp:975] Creating default 'basic' HTTP authenticator for
realm 'mesos-agent-executor'
I0608 21:45:28.335827 29001 http.cpp:996] Creating default 'jwt' HTTP authenticator for realm
'mesos-agent-executor'
I0608 21:45:28.336051 29001 http.cpp:975] Creating default 'basic' HTTP authenticator for
realm 'mesos-agent-readonly'
I0608 21:45:28.336144 29001 http.cpp:996] Creating default 'jwt' HTTP authenticator for realm
'mesos-agent-readonly'
I0608 21:45:28.336323 29001 http.cpp:975] Creating default 'basic' HTTP authenticator for
realm 'mesos-agent-readwrite'
I0608 21:45:28.336412 29001 http.cpp:996] Creating default 'jwt' HTTP authenticator for realm
'mesos-agent-readwrite'
I0608 21:45:28.338155 29001 slave.cpp:552] Agent resources: cpus(*):2; mem(*):1024; disk(*):1024;
ports(*):[31000-32000]
I0608 21:45:28.338259 29001 slave.cpp:560] Agent attributes: [  ]
I0608 21:45:28.338279 29001 slave.cpp:565] Agent hostname: e6e6b71db3a8
I0608 21:45:28.338428 28994 status_update_manager.cpp:177] Pausing sending status updates
I0608 21:45:28.340529 29004 state.cpp:62] Recovering state from '/tmp/Endpoint_SlaveEndpointTest_NoAuthorizer_1_okbJY3/meta'
I0608 21:45:28.341130 29004 status_update_manager.cpp:203] Recovering status update manager
I0608 21:45:28.341346 29005 containerizer.cpp:582] Recovering containerizer
I0608 21:45:28.342974 29006 provisioner.cpp:416] Provisioner recovery complete
I0608 21:45:28.343358 28993 slave.cpp:6127] Finished recovery
I0608 21:45:28.343952 28993 slave.cpp:6309] Querying resource estimator for oversubscribable
resources
I0608 21:45:28.344267 29001 slave.cpp:6323] Received oversubscribable resources {} from the
resource estimator
I0608 21:45:28.346801 28992 process.cpp:3778] Handling HTTP event for process 'slave(764)'
with path: '/slave(764)/monitor/statistics.json'
I0608 21:45:28.348938 28992 http.cpp:1115] HTTP GET for /slave(764)/monitor/statistics.json
from 172.17.0.3:37946
I0608 21:45:28.349016 28992 http.cpp:936] Authorizing principal 'test-principal' to GET the
'/monitor/statistics.json' endpoint
I0608 21:45:28.352763 29014 slave.cpp:817] Agent terminating
[       OK ] Endpoint/SlaveEndpointTest.NoAuthorizer/1 (37 ms)
[ RUN      ] Endpoint/SlaveEndpointTest.NoAuthorizer/2
I0608 21:45:28.365125  8732 containerizer.cpp:230] Using isolation: posix/cpu,posix/mem,filesystem/posix,network/cni,environment_secret
W0608 21:45:28.365763  8732 backend.cpp:76] Failed to create 'aufs' backend: AufsBackend requires
root privileges
W0608 21:45:28.365865  8732 backend.cpp:76] Failed to create 'bind' backend: BindBackend requires
root privileges
I0608 21:45:28.365898  8732 provisioner.cpp:255] Using default backend 'copy'
I0608 21:45:28.367717  8732 cluster.cpp:448] Creating default 'local' authorizer
I0608 21:45:28.369350 28997 slave.cpp:248] Mesos agent started on (765)@172.17.0.3:43187
I0608 21:45:28.369374 28997 slave.cpp:249] Flags at startup: --acls="" --appc_simple_discovery_uri_prefix="http://"
--appc_store_dir="/tmp/Endpoint_SlaveEndpointTest_NoAuthorizer_2_LKShQJ/store/appc" --authenticate_http_executors="true"
--authenticate_http_readonly="true" --authenticate_http_readwrite="true" --authenticatee="crammd5"
--authentication_backoff_factor="1secs" --authorizer="local" --cgroups_cpu_enable_pids_and_tids_count="false"
--cgroups_enable_cfs="false" --cgroups_hierarchy="/sys/fs/cgroup" --cgroups_limit_swap="false"
--cgroups_root="mesos" --container_disk_watch_interval="15secs" --containerizers="mesos" --credential="/tmp/Endpoint_SlaveEndpointTest_NoAuthorizer_2_LKShQJ/credential"
--default_role="*" --disk_watch_interval="1mins" --docker="docker" --docker_kill_orphans="true"
--docker_registry="https://registry-1.docker.io" --docker_remove_delay="6hrs" --docker_socket="/var/run/docker.sock"
--docker_stop_timeout="0ns" --docker_store_dir="/tmp/Endpoint_SlaveEndpointTest_NoAuthorizer_2_LKShQJ/store/docker"
--docker_volume_checkpoint_dir="/var/run/mesos/isolators/docker/volume" --enforce_container_disk_quota="false"
--executor_registration_timeout="1mins" --executor_reregistration_timeout="2secs" --executor_secret_key="/tmp/Endpoint_SlaveEndpointTest_NoAuthorizer_2_LKShQJ/executor_secret_key"
--executor_shutdown_grace_period="5secs" --fetcher_cache_dir="/tmp/Endpoint_SlaveEndpointTest_NoAuthorizer_2_LKShQJ/fetch"
--fetcher_cache_size="2GB" --frameworks_home="" --gc_delay="1weeks" --gc_disk_headroom="0.1"
--hadoop_home="" --help="false" --hostname_lookup="true" --http_command_executor="false" --http_credentials="/tmp/Endpoint_SlaveEndpointTest_NoAuthorizer_2_LKShQJ/http_credentials"
--http_heartbeat_interval="30secs" --initialize_driver_logging="true" --isolation="posix/cpu,posix/mem"
--launcher="posix" --launcher_dir="/mesos/mesos-1.4.0/_build/src" --logbufsecs="0" --logging_level="INFO"
--max_completed_executors_per_framework="150" --oversubscribed_resources_interval="15secs"
--perf_duration="10secs" --perf_interval="1mins" --port="5051" --qos_correction_interval_min="0ns"
--quiet="false" --recover="reconnect" --recovery_timeout="15mins" --registration_backoff_factor="10ms"
--resources="cpus:2;gpus:0;mem:1024;disk:1024;ports:[31000-32000]" --revocable_cpu_low_priority="true"
--runtime_dir="/tmp/Endpoint_SlaveEndpointTest_NoAuthorizer_2_LKShQJ" --sandbox_directory="/mnt/mesos/sandbox"
--strict="true" --switch_user="true" --systemd_enable_support="true" --systemd_runtime_directory="/run/systemd/system"
--version="false" --work_dir="/tmp/Endpoint_SlaveEndpointTest_NoAuthorizer_2_NmnrrB"
I0608 21:45:28.369793 28997 credentials.hpp:86] Loading credential for authentication from
'/tmp/Endpoint_SlaveEndpointTest_NoAuthorizer_2_LKShQJ/credential'
I0608 21:45:28.369959 28997 slave.cpp:281] Agent using credential for: test-principal
I0608 21:45:28.369983 28997 credentials.hpp:37] Loading credentials for authentication from
'/tmp/Endpoint_SlaveEndpointTest_NoAuthorizer_2_LKShQJ/http_credentials'
I0608 21:45:28.370301 28997 http.cpp:975] Creating default 'basic' HTTP authenticator for
realm 'mesos-agent-executor'
I0608 21:45:28.370410 28997 http.cpp:996] Creating default 'jwt' HTTP authenticator for realm
'mesos-agent-executor'
I0608 21:45:28.370620 28997 http.cpp:975] Creating default 'basic' HTTP authenticator for
realm 'mesos-agent-readonly'
I0608 21:45:28.370709 28997 http.cpp:996] Creating default 'jwt' HTTP authenticator for realm
'mesos-agent-readonly'
I0608 21:45:28.370980 28997 http.cpp:975] Creating default 'basic' HTTP authenticator for
realm 'mesos-agent-readwrite'
I0608 21:45:28.371091 28997 http.cpp:996] Creating default 'jwt' HTTP authenticator for realm
'mesos-agent-readwrite'
I0608 21:45:28.372629 28997 slave.cpp:552] Agent resources: cpus(*):2; mem(*):1024; disk(*):1024;
ports(*):[31000-32000]
I0608 21:45:28.372717 28997 slave.cpp:560] Agent attributes: [  ]
I0608 21:45:28.372732 28997 slave.cpp:565] Agent hostname: e6e6b71db3a8
I0608 21:45:28.372881 28999 status_update_manager.cpp:177] Pausing sending status updates
I0608 21:45:28.374305 29008 state.cpp:62] Recovering state from '/tmp/Endpoint_SlaveEndpointTest_NoAuthorizer_2_NmnrrB/meta'
I0608 21:45:28.374799 28995 status_update_manager.cpp:203] Recovering status update manager
I0608 21:45:28.375041 29009 containerizer.cpp:582] Recovering containerizer
I0608 21:45:28.376691 28992 provisioner.cpp:416] Provisioner recovery complete
I0608 21:45:28.377427 28992 slave.cpp:6127] Finished recovery
I0608 21:45:28.377936 28992 slave.cpp:6309] Querying resource estimator for oversubscribable
resources
I0608 21:45:28.378188 28992 slave.cpp:6323] Received oversubscribable resources {} from the
resource estimator
I0608 21:45:28.380128 28997 process.cpp:3778] Handling HTTP event for process 'slave(765)'
with path: '/slave(765)/containers'
I0608 21:45:28.382191 29007 http.cpp:1115] HTTP GET for /slave(765)/containers from 172.17.0.3:37948
I0608 21:45:28.382268 29007 http.cpp:936] Authorizing principal 'test-principal' to GET the
'/containers' endpoint
I0608 21:45:28.386137 28998 slave.cpp:817] Agent terminating
[       OK ] Endpoint/SlaveEndpointTest.NoAuthorizer/2 (32 ms)
[----------] 9 tests from Endpoint/SlaveEndpointTest (371 ms total)

[----------] Global test environment tear-down
[==========] 1594 tests from 178 test cases ran. (657239 ms total)
[  PASSED  ] 1589 tests.
[  FAILED  ] 5 tests, listed below:
[  FAILED  ] CommandExecutorCheckTest.CommandCheckDeliveredAndReconciled
[  FAILED  ] DefaultExecutorCheckTest.CommandCheckDeliveredAndReconciled
[  FAILED  ] DefaultExecutorCheckTest.CommandCheckStatusChange
[  FAILED  ] DefaultExecutorCheckTest.CommandCheckSeesParentsEnv
[  FAILED  ] DefaultExecutorCheckTest.CommandCheckSharesWorkDirWithTask

 5 FAILED TESTS
  YOU HAVE 22 DISABLED TESTS

E0608 21:45:28.462240 29016 process.cpp:968] Failed to accept socket: future discarded
make[4]: *** [check-local] Error 1
make[4]: Leaving directory `/mesos/mesos-1.4.0/_build/src'
make[3]: *** [check-am] Error 2
make[3]: Leaving directory `/mesos/mesos-1.4.0/_build/src'
make[2]: *** [check] Error 2
make[2]: Leaving directory `/mesos/mesos-1.4.0/_build/src'
make[1]: *** [check-recursive] Error 1
make[1]: Leaving directory `/mesos/mesos-1.4.0/_build'
make: *** [distcheck] Error 1
+ docker rmi mesos-1496955270-3577
Untagged: mesos-1496955270-3577:latest
Deleted: sha256:cd1105ae0945015fe2286c2eee53d81d57c15968bd4d865a315df50e8f08bcd8
Deleted: sha256:74fcd56652b03fe1b436326b3ea2f844aee72f77af6f1cce69314bc607722a87
Deleted: sha256:2887faf3cdc86d2451c01ef11567b97693052ffc3d27d769ef2b44648686d64d
Deleted: sha256:46ea030df3265696157c07f83c99b8b8beab51ab0a46919ee3dc5265b630da74
Deleted: sha256:d9e4461dd865bad31e279c6054bf48ad3f3417ce8ce03f8965dc5dc790fe7228
Deleted: sha256:d863b10c771c4b6dcf5fb22930191076972e32204a7a2310c6b0bd3dacad1936
Deleted: sha256:d687d150ff6be1de236d5ece7f4e498cdaeff603d5117f3a63a21023901c1029
Deleted: sha256:cac230fde4d65cb59fa9c875bd61662cb32b0f7d332cb8b70313dd6fea07ddca
Deleted: sha256:a49f19e62b5d2c5d800269443295d0b8c2b6777bc9f044fccab62ffa599bd42c
Deleted: sha256:95b1aa60110a839598ebf96d305b08bc1097f754623dab0fee655e40d463dc4a
Deleted: sha256:23ccd29abccadf197c9672dd27a4f4b7a74b281d85a697a431007a1e400d39c6
Deleted: sha256:90cbcc7c3c08226fc2d849699829fcb25d3b91f001b6520418cb03bb56e34a1f
Deleted: sha256:c147cb19e824516771c3267e2f8d7c783241ff7920f2ca0ac9edbacebddc8458
Deleted: sha256:b3978686963fe8471a4ed05504ea1739160dcedbc79d1df8af524acf49a6c6c2
Deleted: sha256:d9117fea7a08bdd6748a210aa04e4df692c26fd53280c54966c49e1afacfd0e7
Deleted: sha256:f975d1d4141fff53fc0fc3809f4a0234ab8c59b82a5d02b3909b9383c2f466a4
Deleted: sha256:2dca890c26cbd7a9d9dceb48f2c8b66c041c92d81db503856fd3442e414f5aa1
Deleted: sha256:f5d466087f7fa83dd2e9aecbd0a0647806c90047e5c9bcd8165ebb417110882c
Deleted: sha256:158eecd39a90d08f016a51de9b748921b3636b0b6cb4e6d56c288c6a1689f60b
Deleted: sha256:c2431bbf79f7dc50249e9eef1c0d5d99eac6333e695d35a42beb70541e22854c
Deleted: sha256:c000443468df43ae59d5c25732a5d134f50e57858d484e458fa6eb1a3842e3cb
Deleted: sha256:eaacf5fdcc421502aab69051637ad3c5b31b5dd6477a03db91c35e502b77ad83
Deleted: sha256:c1daf0203baab4ab761f327d7700f4c785b076ab184df12cdfb69fe4a01aff72
Deleted: sha256:ac516e6f74a6deded78d290bf5ac7d467d511879d88ad925edbd4e2948c2de3f
Deleted: sha256:1ae3d7438d729fa587134e801fc1801f08e204df3b090ffa4084a7449328207f
Build step 'Execute shell' marked build as failure
Not sending mail to unregistered user toenshoff@me.com

Mime
View raw message