mesos-builds mailing list archives

Site index · List index
Message view « Date » · « Thread »
Top « Date » · « Thread »
From Apache Jenkins Server <jenk...@builds.apache.org>
Subject Build failed in Jenkins: Mesos-Reviewbot #18317
Date Fri, 09 Jun 2017 05:27:40 GMT
See <https://builds.apache.org/job/Mesos-Reviewbot/18317/display/redirect>

------------------------------------------
[...truncated 28.10 MB...]
I0609 05:27:34.700745  4864 slave.cpp:817] Agent terminating
[       OK ] Endpoint/SlaveEndpointTest.AuthorizedRequest/1 (54 ms)
[ RUN      ] Endpoint/SlaveEndpointTest.AuthorizedRequest/2
I0609 05:27:34.713687  4830 containerizer.cpp:230] Using isolation: posix/cpu,posix/mem,filesystem/posix,network/cni,environment_secret
W0609 05:27:34.714412  4830 backend.cpp:76] Failed to create 'aufs' backend: AufsBackend requires
root privileges
W0609 05:27:34.714547  4830 backend.cpp:76] Failed to create 'bind' backend: BindBackend requires
root privileges
I0609 05:27:34.714612  4830 provisioner.cpp:255] Using default backend 'copy'
I0609 05:27:34.718353  4870 slave.cpp:248] Mesos agent started on (756)@172.17.0.3:41084
I0609 05:27:34.718389  4870 slave.cpp:249] Flags at startup: --acls="" --appc_simple_discovery_uri_prefix="http://"
--appc_store_dir="/tmp/Endpoint_SlaveEndpointTest_AuthorizedRequest_2_kzSnV6/store/appc" --authenticate_http_readonly="true"
--authenticate_http_readwrite="true" --authenticatee="crammd5" --authentication_backoff_factor="1secs"
--authorizer="local" --cgroups_cpu_enable_pids_and_tids_count="false" --cgroups_enable_cfs="false"
--cgroups_hierarchy="/sys/fs/cgroup" --cgroups_limit_swap="false" --cgroups_root="mesos" --container_disk_watch_interval="15secs"
--containerizers="mesos" --credential="/tmp/Endpoint_SlaveEndpointTest_AuthorizedRequest_2_kzSnV6/credential"
--default_role="*" --disk_watch_interval="1mins" --docker="docker" --docker_kill_orphans="true"
--docker_registry="https://registry-1.docker.io" --docker_remove_delay="6hrs" --docker_socket="/var/run/docker.sock"
--docker_stop_timeout="0ns" --docker_store_dir="/tmp/Endpoint_SlaveEndpointTest_AuthorizedRequest_2_kzSnV6/store/docker"
--docker_volume_checkpoint_dir="/var/run/mesos/isolators/docker/volume" --enforce_container_disk_quota="false"
--executor_registration_timeout="1mins" --executor_reregistration_timeout="2secs" --executor_shutdown_grace_period="5secs"
--fetcher_cache_dir="/tmp/Endpoint_SlaveEndpointTest_AuthorizedRequest_2_kzSnV6/fetch" --fetcher_cache_size="2GB"
--frameworks_home="" --gc_delay="1weeks" --gc_disk_headroom="0.1" --hadoop_home="" --help="false"
--hostname_lookup="true" --http_command_executor="false" --http_credentials="/tmp/Endpoint_SlaveEndpointTest_AuthorizedRequest_2_kzSnV6/http_credentials"
--http_heartbeat_interval="30secs" --initialize_driver_logging="true" --isolation="posix/cpu,posix/mem"
--launcher="posix" --launcher_dir="/mesos/mesos-1.4.0/_build/src" --logbufsecs="0" --logging_level="INFO"
--max_completed_executors_per_framework="150" --oversubscribed_resources_interval="15secs"
--perf_duration="10secs" --perf_interval="1mins" --port="5051" --qos_correction_interval_min="0ns"
--quiet="false" --recover="reconnect" --recovery_timeout="15mins" --registration_backoff_factor="10ms"
--resources="cpus:2;gpus:0;mem:1024;disk:1024;ports:[31000-32000]" --revocable_cpu_low_priority="true"
--runtime_dir="/tmp/Endpoint_SlaveEndpointTest_AuthorizedRequest_2_kzSnV6" --sandbox_directory="/mnt/mesos/sandbox"
--strict="true" --switch_user="true" --systemd_enable_support="true" --systemd_runtime_directory="/run/systemd/system"
--version="false" --work_dir="/tmp/Endpoint_SlaveEndpointTest_AuthorizedRequest_2_kGhPDF"
I0609 05:27:34.718782  4870 credentials.hpp:86] Loading credential for authentication from
'/tmp/Endpoint_SlaveEndpointTest_AuthorizedRequest_2_kzSnV6/credential'
I0609 05:27:34.719007  4870 slave.cpp:281] Agent using credential for: test-principal
I0609 05:27:34.719027  4870 credentials.hpp:37] Loading credentials for authentication from
'/tmp/Endpoint_SlaveEndpointTest_AuthorizedRequest_2_kzSnV6/http_credentials'
I0609 05:27:34.719264  4870 http.cpp:975] Creating default 'basic' HTTP authenticator for
realm 'mesos-agent-readonly'
I0609 05:27:34.719450  4870 http.cpp:975] Creating default 'basic' HTTP authenticator for
realm 'mesos-agent-readwrite'
I0609 05:27:34.720806  4870 slave.cpp:552] Agent resources: cpus(*):2; mem(*):1024; disk(*):1024;
ports(*):[31000-32000]
I0609 05:27:34.720892  4870 slave.cpp:560] Agent attributes: [  ]
I0609 05:27:34.720906  4870 slave.cpp:565] Agent hostname: ee39bb6afecb
I0609 05:27:34.721092  4850 status_update_manager.cpp:177] Pausing sending status updates
I0609 05:27:34.722527  4871 state.cpp:62] Recovering state from '/tmp/Endpoint_SlaveEndpointTest_AuthorizedRequest_2_kGhPDF/meta'
I0609 05:27:34.722858  4855 status_update_manager.cpp:203] Recovering status update manager
I0609 05:27:34.723052  4863 containerizer.cpp:582] Recovering containerizer
I0609 05:27:34.724545  4865 provisioner.cpp:416] Provisioner recovery complete
I0609 05:27:34.724993  4860 slave.cpp:6127] Finished recovery
I0609 05:27:34.725622  4860 slave.cpp:6309] Querying resource estimator for oversubscribable
resources
I0609 05:27:34.725927  4851 slave.cpp:6323] Received oversubscribable resources {} from the
resource estimator
I0609 05:27:34.728718  4853 process.cpp:3778] Handling HTTP event for process 'slave(756)'
with path: '/slave(756)/containers'
I0609 05:27:34.730018  4866 http.cpp:1115] HTTP GET for /slave(756)/containers from 172.17.0.3:53860
I0609 05:27:34.730099  4866 http.cpp:936] Authorizing principal 'test-principal' to GET the
'/containers' endpoint
I0609 05:27:34.734074  4858 slave.cpp:817] Agent terminating
[       OK ] Endpoint/SlaveEndpointTest.AuthorizedRequest/2 (32 ms)
[ RUN      ] Endpoint/SlaveEndpointTest.UnauthorizedRequest/0
I0609 05:27:34.744338  4830 containerizer.cpp:230] Using isolation: posix/cpu,posix/mem,filesystem/posix,network/cni,environment_secret
W0609 05:27:34.744882  4830 backend.cpp:76] Failed to create 'aufs' backend: AufsBackend requires
root privileges
W0609 05:27:34.744995  4830 backend.cpp:76] Failed to create 'bind' backend: BindBackend requires
root privileges
I0609 05:27:34.745029  4830 provisioner.cpp:255] Using default backend 'copy'
I0609 05:27:34.749742  4865 slave.cpp:248] Mesos agent started on (757)@172.17.0.3:41084
I0609 05:27:34.749812  4865 slave.cpp:249] Flags at startup: --acls="" --appc_simple_discovery_uri_prefix="http://"
--appc_store_dir="/tmp/Endpoint_SlaveEndpointTest_UnauthorizedRequest_0_lPltjS/store/appc"
--authenticate_http_readonly="true" --authenticate_http_readwrite="true" --authenticatee="crammd5"
--authentication_backoff_factor="1secs" --authorizer="local" --cgroups_cpu_enable_pids_and_tids_count="false"
--cgroups_enable_cfs="false" --cgroups_hierarchy="/sys/fs/cgroup" --cgroups_limit_swap="false"
--cgroups_root="mesos" --container_disk_watch_interval="15secs" --containerizers="mesos" --credential="/tmp/Endpoint_SlaveEndpointTest_UnauthorizedRequest_0_lPltjS/credential"
--default_role="*" --disk_watch_interval="1mins" --docker="docker" --docker_kill_orphans="true"
--docker_registry="https://registry-1.docker.io" --docker_remove_delay="6hrs" --docker_socket="/var/run/docker.sock"
--docker_stop_timeout="0ns" --docker_store_dir="/tmp/Endpoint_SlaveEndpointTest_UnauthorizedRequest_0_lPltjS/store/docker"
--docker_volume_checkpoint_dir="/var/run/mesos/isolators/docker/volume" --enforce_container_disk_quota="false"
--executor_registration_timeout="1mins" --executor_reregistration_timeout="2secs" --executor_shutdown_grace_period="5secs"
--fetcher_cache_dir="/tmp/Endpoint_SlaveEndpointTest_UnauthorizedRequest_0_lPltjS/fetch" --fetcher_cache_size="2GB"
--frameworks_home="" --gc_delay="1weeks" --gc_disk_headroom="0.1" --hadoop_home="" --help="false"
--hostname_lookup="true" --http_command_executor="false" --http_credentials="/tmp/Endpoint_SlaveEndpointTest_UnauthorizedRequest_0_lPltjS/http_credentials"
--http_heartbeat_interval="30secs" --initialize_driver_logging="true" --isolation="posix/cpu,posix/mem"
--launcher="posix" --launcher_dir="/mesos/mesos-1.4.0/_build/src" --logbufsecs="0" --logging_level="INFO"
--max_completed_executors_per_framework="150" --oversubscribed_resources_interval="15secs"
--perf_duration="10secs" --perf_interval="1mins" --port="5051" --qos_correction_interval_min="0ns"
--quiet="false" --recover="reconnect" --recovery_timeout="15mins" --registration_backoff_factor="10ms"
--resources="cpus:2;gpus:0;mem:1024;disk:1024;ports:[31000-32000]" --revocable_cpu_low_priority="true"
--runtime_dir="/tmp/Endpoint_SlaveEndpointTest_UnauthorizedRequest_0_lPltjS" --sandbox_directory="/mnt/mesos/sandbox"
--strict="true" --switch_user="true" --systemd_enable_support="true" --systemd_runtime_directory="/run/systemd/system"
--version="false" --work_dir="/tmp/Endpoint_SlaveEndpointTest_UnauthorizedRequest_0_kaVfXq"
I0609 05:27:34.750306  4865 credentials.hpp:86] Loading credential for authentication from
'/tmp/Endpoint_SlaveEndpointTest_UnauthorizedRequest_0_lPltjS/credential'
I0609 05:27:34.750588  4865 slave.cpp:281] Agent using credential for: test-principal
I0609 05:27:34.750607  4865 credentials.hpp:37] Loading credentials for authentication from
'/tmp/Endpoint_SlaveEndpointTest_UnauthorizedRequest_0_lPltjS/http_credentials'
I0609 05:27:34.750855  4865 http.cpp:975] Creating default 'basic' HTTP authenticator for
realm 'mesos-agent-readonly'
I0609 05:27:34.751078  4865 http.cpp:975] Creating default 'basic' HTTP authenticator for
realm 'mesos-agent-readwrite'
I0609 05:27:34.752590  4865 slave.cpp:552] Agent resources: cpus(*):2; mem(*):1024; disk(*):1024;
ports(*):[31000-32000]
I0609 05:27:34.752682  4865 slave.cpp:560] Agent attributes: [  ]
I0609 05:27:34.752697  4865 slave.cpp:565] Agent hostname: ee39bb6afecb
I0609 05:27:34.752866  4852 status_update_manager.cpp:177] Pausing sending status updates
I0609 05:27:34.754611  4861 state.cpp:62] Recovering state from '/tmp/Endpoint_SlaveEndpointTest_UnauthorizedRequest_0_kaVfXq/meta'
I0609 05:27:34.755028  4861 status_update_manager.cpp:203] Recovering status update manager
I0609 05:27:34.755313  4855 containerizer.cpp:582] Recovering containerizer
I0609 05:27:34.757506  4855 provisioner.cpp:416] Provisioner recovery complete
I0609 05:27:34.758040  4855 slave.cpp:6127] Finished recovery
I0609 05:27:34.758612  4855 slave.cpp:6309] Querying resource estimator for oversubscribable
resources
I0609 05:27:34.759158  4858 slave.cpp:6323] Received oversubscribable resources {} from the
resource estimator
I0609 05:27:34.762382  4861 process.cpp:3778] Handling HTTP event for process 'slave(757)'
with path: '/slave(757)/monitor/statistics'
I0609 05:27:34.763862  4864 http.cpp:1115] HTTP GET for /slave(757)/monitor/statistics from
172.17.0.3:53862
I0609 05:27:34.763983  4864 http.cpp:936] Authorizing principal 'test-principal' to GET the
'/monitor/statistics' endpoint
I0609 05:27:34.766340  4858 slave.cpp:817] Agent terminating
[       OK ] Endpoint/SlaveEndpointTest.UnauthorizedRequest/0 (32 ms)
[ RUN      ] Endpoint/SlaveEndpointTest.UnauthorizedRequest/1
I0609 05:27:34.777417  4830 containerizer.cpp:230] Using isolation: posix/cpu,posix/mem,filesystem/posix,network/cni,environment_secret
W0609 05:27:34.777941  4830 backend.cpp:76] Failed to create 'aufs' backend: AufsBackend requires
root privileges
W0609 05:27:34.778060  4830 backend.cpp:76] Failed to create 'bind' backend: BindBackend requires
root privileges
I0609 05:27:34.778101  4830 provisioner.cpp:255] Using default backend 'copy'
I0609 05:27:34.781734  4854 slave.cpp:248] Mesos agent started on (758)@172.17.0.3:41084
I0609 05:27:34.781793  4854 slave.cpp:249] Flags at startup: --acls="" --appc_simple_discovery_uri_prefix="http://"
--appc_store_dir="/tmp/Endpoint_SlaveEndpointTest_UnauthorizedRequest_1_IZV90D/store/appc"
--authenticate_http_readonly="true" --authenticate_http_readwrite="true" --authenticatee="crammd5"
--authentication_backoff_factor="1secs" --authorizer="local" --cgroups_cpu_enable_pids_and_tids_count="false"
--cgroups_enable_cfs="false" --cgroups_hierarchy="/sys/fs/cgroup" --cgroups_limit_swap="false"
--cgroups_root="mesos" --container_disk_watch_interval="15secs" --containerizers="mesos" --credential="/tmp/Endpoint_SlaveEndpointTest_UnauthorizedRequest_1_IZV90D/credential"
--default_role="*" --disk_watch_interval="1mins" --docker="docker" --docker_kill_orphans="true"
--docker_registry="https://registry-1.docker.io" --docker_remove_delay="6hrs" --docker_socket="/var/run/docker.sock"
--docker_stop_timeout="0ns" --docker_store_dir="/tmp/Endpoint_SlaveEndpointTest_UnauthorizedRequest_1_IZV90D/store/docker"
--docker_volume_checkpoint_dir="/var/run/mesos/isolators/docker/volume" --enforce_container_disk_quota="false"
--executor_registration_timeout="1mins" --executor_reregistration_timeout="2secs" --executor_shutdown_grace_period="5secs"
--fetcher_cache_dir="/tmp/Endpoint_SlaveEndpointTest_UnauthorizedRequest_1_IZV90D/fetch" --fetcher_cache_size="2GB"
--frameworks_home="" --gc_delay="1weeks" --gc_disk_headroom="0.1" --hadoop_home="" --help="false"
--hostname_lookup="true" --http_command_executor="false" --http_credentials="/tmp/Endpoint_SlaveEndpointTest_UnauthorizedRequest_1_IZV90D/http_credentials"
--http_heartbeat_interval="30secs" --initialize_driver_logging="true" --isolation="posix/cpu,posix/mem"
--launcher="posix" --launcher_dir="/mesos/mesos-1.4.0/_build/src" --logbufsecs="0" --logging_level="INFO"
--max_completed_executors_per_framework="150" --oversubscribed_resources_interval="15secs"
--perf_duration="10secs" --perf_interval="1mins" --port="5051" --qos_correction_interval_min="0ns"
--quiet="false" --recover="reconnect" --recovery_timeout="15mins" --registration_backoff_factor="10ms"
--resources="cpus:2;gpus:0;mem:1024;disk:1024;ports:[31000-32000]" --revocable_cpu_low_priority="true"
--runtime_dir="/tmp/Endpoint_SlaveEndpointTest_UnauthorizedRequest_1_IZV90D" --sandbox_directory="/mnt/mesos/sandbox"
--strict="true" --switch_user="true" --systemd_enable_support="true" --systemd_runtime_directory="/run/systemd/system"
--version="false" --work_dir="/tmp/Endpoint_SlaveEndpointTest_UnauthorizedRequest_1_uKE1zc"
I0609 05:27:34.782304  4854 credentials.hpp:86] Loading credential for authentication from
'/tmp/Endpoint_SlaveEndpointTest_UnauthorizedRequest_1_IZV90D/credential'
I0609 05:27:34.782547  4854 slave.cpp:281] Agent using credential for: test-principal
I0609 05:27:34.782568  4854 credentials.hpp:37] Loading credentials for authentication from
'/tmp/Endpoint_SlaveEndpointTest_UnauthorizedRequest_1_IZV90D/http_credentials'
I0609 05:27:34.782814  4854 http.cpp:975] Creating default 'basic' HTTP authenticator for
realm 'mesos-agent-readonly'
I0609 05:27:34.783048  4854 http.cpp:975] Creating default 'basic' HTTP authenticator for
realm 'mesos-agent-readwrite'
I0609 05:27:34.784391  4854 slave.cpp:552] Agent resources: cpus(*):2; mem(*):1024; disk(*):1024;
ports(*):[31000-32000]
I0609 05:27:34.784471  4854 slave.cpp:560] Agent attributes: [  ]
I0609 05:27:34.784488  4854 slave.cpp:565] Agent hostname: ee39bb6afecb
I0609 05:27:34.784649  4869 status_update_manager.cpp:177] Pausing sending status updates
I0609 05:27:34.786211  4856 state.cpp:62] Recovering state from '/tmp/Endpoint_SlaveEndpointTest_UnauthorizedRequest_1_uKE1zc/meta'
I0609 05:27:34.786666  4871 status_update_manager.cpp:203] Recovering status update manager
I0609 05:27:34.786890  4870 containerizer.cpp:582] Recovering containerizer
I0609 05:27:34.789134  4864 provisioner.cpp:416] Provisioner recovery complete
I0609 05:27:34.789513  4864 slave.cpp:6127] Finished recovery
I0609 05:27:34.790549  4864 slave.cpp:6309] Querying resource estimator for oversubscribable
resources
I0609 05:27:34.791143  4854 slave.cpp:6323] Received oversubscribable resources {} from the
resource estimator
I0609 05:27:34.795197  4864 process.cpp:3778] Handling HTTP event for process 'slave(758)'
with path: '/slave(758)/monitor/statistics.json'
I0609 05:27:34.797310  4856 http.cpp:1115] HTTP GET for /slave(758)/monitor/statistics.json
from 172.17.0.3:53864
I0609 05:27:34.797734  4856 http.cpp:936] Authorizing principal 'test-principal' to GET the
'/monitor/statistics.json' endpoint
I0609 05:27:34.813187  4861 slave.cpp:817] Agent terminating
[       OK ] Endpoint/SlaveEndpointTest.UnauthorizedRequest/1 (46 ms)
[ RUN      ] Endpoint/SlaveEndpointTest.UnauthorizedRequest/2
I0609 05:27:34.825529  4830 containerizer.cpp:230] Using isolation: posix/cpu,posix/mem,filesystem/posix,network/cni,environment_secret
W0609 05:27:34.826472  4830 backend.cpp:76] Failed to create 'aufs' backend: AufsBackend requires
root privileges
W0609 05:27:34.826747  4830 backend.cpp:76] Failed to create 'bind' backend: BindBackend requires
root privileges
I0609 05:27:34.826970  4830 provisioner.cpp:255] Using default backend 'copy'
I0609 05:27:34.831535  4861 slave.cpp:248] Mesos agent started on (759)@172.17.0.3:41084
I0609 05:27:34.831562  4861 slave.cpp:249] Flags at startup: --acls="" --appc_simple_discovery_uri_prefix="http://"
--appc_store_dir="/tmp/Endpoint_SlaveEndpointTest_UnauthorizedRequest_2_u6QD8p/store/appc"
--authenticate_http_readonly="true" --authenticate_http_readwrite="true" --authenticatee="crammd5"
--authentication_backoff_factor="1secs" --authorizer="local" --cgroups_cpu_enable_pids_and_tids_count="false"
--cgroups_enable_cfs="false" --cgroups_hierarchy="/sys/fs/cgroup" --cgroups_limit_swap="false"
--cgroups_root="mesos" --container_disk_watch_interval="15secs" --containerizers="mesos" --credential="/tmp/Endpoint_SlaveEndpointTest_UnauthorizedRequest_2_u6QD8p/credential"
--default_role="*" --disk_watch_interval="1mins" --docker="docker" --docker_kill_orphans="true"
--docker_registry="https://registry-1.docker.io" --docker_remove_delay="6hrs" --docker_socket="/var/run/docker.sock"
--docker_stop_timeout="0ns" --docker_store_dir="/tmp/Endpoint_SlaveEndpointTest_UnauthorizedRequest_2_u6QD8p/store/docker"
--docker_volume_checkpoint_dir="/var/run/mesos/isolators/docker/volume" --enforce_container_disk_quota="false"
--executor_registration_timeout="1mins" --executor_reregistration_timeout="2secs" --executor_shutdown_grace_period="5secs"
--fetcher_cache_dir="/tmp/Endpoint_SlaveEndpointTest_UnauthorizedRequest_2_u6QD8p/fetch" --fetcher_cache_size="2GB"
--frameworks_home="" --gc_delay="1weeks" --gc_disk_headroom="0.1" --hadoop_home="" --help="false"
--hostname_lookup="true" --http_command_executor="false" --http_credentials="/tmp/Endpoint_SlaveEndpointTest_UnauthorizedRequest_2_u6QD8p/http_credentials"
--http_heartbeat_interval="30secs" --initialize_driver_logging="true" --isolation="posix/cpu,posix/mem"
--launcher="posix" --launcher_dir="/mesos/mesos-1.4.0/_build/src" --logbufsecs="0" --logging_level="INFO"
--max_completed_executors_per_framework="150" --oversubscribed_resources_interval="15secs"
--perf_duration="10secs" --perf_interval="1mins" --port="5051" --qos_correction_interval_min="0ns"
--quiet="false" --recover="reconnect" --recovery_timeout="15mins" --registration_backoff_factor="10ms"
--resources="cpus:2;gpus:0;mem:1024;disk:1024;ports:[31000-32000]" --revocable_cpu_low_priority="true"
--runtime_dir="/tmp/Endpoint_SlaveEndpointTest_UnauthorizedRequest_2_u6QD8p" --sandbox_directory="/mnt/mesos/sandbox"
--strict="true" --switch_user="true" --systemd_enable_support="true" --systemd_runtime_directory="/run/systemd/system"
--version="false" --work_dir="/tmp/Endpoint_SlaveEndpointTest_UnauthorizedRequest_2_ur4rAY"
I0609 05:27:34.832041  4861 credentials.hpp:86] Loading credential for authentication from
'/tmp/Endpoint_SlaveEndpointTest_UnauthorizedRequest_2_u6QD8p/credential'
I0609 05:27:34.832233  4861 slave.cpp:281] Agent using credential for: test-principal
I0609 05:27:34.832252  4861 credentials.hpp:37] Loading credentials for authentication from
'/tmp/Endpoint_SlaveEndpointTest_UnauthorizedRequest_2_u6QD8p/http_credentials'
I0609 05:27:34.832526  4861 http.cpp:975] Creating default 'basic' HTTP authenticator for
realm 'mesos-agent-readonly'
I0609 05:27:34.832690  4861 http.cpp:975] Creating default 'basic' HTTP authenticator for
realm 'mesos-agent-readwrite'
I0609 05:27:34.833946  4861 slave.cpp:552] Agent resources: cpus(*):2; mem(*):1024; disk(*):1024;
ports(*):[31000-32000]
I0609 05:27:34.834024  4861 slave.cpp:560] Agent attributes: [  ]
I0609 05:27:34.834067  4861 slave.cpp:565] Agent hostname: ee39bb6afecb
I0609 05:27:34.834283  4866 status_update_manager.cpp:177] Pausing sending status updates
I0609 05:27:34.835857  4849 state.cpp:62] Recovering state from '/tmp/Endpoint_SlaveEndpointTest_UnauthorizedRequest_2_ur4rAY/meta'
I0609 05:27:34.836310  4863 status_update_manager.cpp:203] Recovering status update manager
I0609 05:27:34.836551  4855 containerizer.cpp:582] Recovering containerizer
I0609 05:27:34.838317  4868 provisioner.cpp:416] Provisioner recovery complete
I0609 05:27:34.838861  4871 slave.cpp:6127] Finished recovery
I0609 05:27:34.839432  4871 slave.cpp:6309] Querying resource estimator for oversubscribable
resources
I0609 05:27:34.839737  4869 slave.cpp:6323] Received oversubscribable resources {} from the
resource estimator
I0609 05:27:34.842950  4867 process.cpp:3778] Handling HTTP event for process 'slave(759)'
with path: '/slave(759)/containers'
I0609 05:27:34.844707  4867 http.cpp:1115] HTTP GET for /slave(759)/containers from 172.17.0.3:53866
I0609 05:27:34.845049  4867 http.cpp:936] Authorizing principal 'test-principal' to GET the
'/containers' endpoint
I0609 05:27:34.848388  4871 slave.cpp:817] Agent terminating
[       OK ] Endpoint/SlaveEndpointTest.UnauthorizedRequest/2 (36 ms)
[ RUN      ] Endpoint/SlaveEndpointTest.NoAuthorizer/0
I0609 05:27:34.863768  4830 containerizer.cpp:230] Using isolation: posix/cpu,posix/mem,filesystem/posix,network/cni,environment_secret
W0609 05:27:34.865084  4830 backend.cpp:76] Failed to create 'aufs' backend: AufsBackend requires
root privileges
W0609 05:27:34.865496  4830 backend.cpp:76] Failed to create 'bind' backend: BindBackend requires
root privileges
I0609 05:27:34.865726  4830 provisioner.cpp:255] Using default backend 'copy'
I0609 05:27:34.868520  4830 cluster.cpp:448] Creating default 'local' authorizer
I0609 05:27:34.872179  4857 slave.cpp:248] Mesos agent started on (760)@172.17.0.3:41084
I0609 05:27:34.872597  4857 slave.cpp:249] Flags at startup: --acls="" --appc_simple_discovery_uri_prefix="http://"
--appc_store_dir="/tmp/Endpoint_SlaveEndpointTest_NoAuthorizer_0_HoD4Dc/store/appc" --authenticate_http_readonly="true"
--authenticate_http_readwrite="true" --authenticatee="crammd5" --authentication_backoff_factor="1secs"
--authorizer="local" --cgroups_cpu_enable_pids_and_tids_count="false" --cgroups_enable_cfs="false"
--cgroups_hierarchy="/sys/fs/cgroup" --cgroups_limit_swap="false" --cgroups_root="mesos" --container_disk_watch_interval="15secs"
--containerizers="mesos" --credential="/tmp/Endpoint_SlaveEndpointTest_NoAuthorizer_0_HoD4Dc/credential"
--default_role="*" --disk_watch_interval="1mins" --docker="docker" --docker_kill_orphans="true"
--docker_registry="https://registry-1.docker.io" --docker_remove_delay="6hrs" --docker_socket="/var/run/docker.sock"
--docker_stop_timeout="0ns" --docker_store_dir="/tmp/Endpoint_SlaveEndpointTest_NoAuthorizer_0_HoD4Dc/store/docker"
--docker_volume_checkpoint_dir="/var/run/mesos/isolators/docker/volume" --enforce_container_disk_quota="false"
--executor_registration_timeout="1mins" --executor_reregistration_timeout="2secs" --executor_shutdown_grace_period="5secs"
--fetcher_cache_dir="/tmp/Endpoint_SlaveEndpointTest_NoAuthorizer_0_HoD4Dc/fetch" --fetcher_cache_size="2GB"
--frameworks_home="" --gc_delay="1weeks" --gc_disk_headroom="0.1" --hadoop_home="" --help="false"
--hostname_lookup="true" --http_command_executor="false" --http_credentials="/tmp/Endpoint_SlaveEndpointTest_NoAuthorizer_0_HoD4Dc/http_credentials"
--http_heartbeat_interval="30secs" --initialize_driver_logging="true" --isolation="posix/cpu,posix/mem"
--launcher="posix" --launcher_dir="/mesos/mesos-1.4.0/_build/src" --logbufsecs="0" --logging_level="INFO"
--max_completed_executors_per_framework="150" --oversubscribed_resources_interval="15secs"
--perf_duration="10secs" --perf_interval="1mins" --port="5051" --qos_correction_interval_min="0ns"
--quiet="false" --recover="reconnect" --recovery_timeout="15mins" --registration_backoff_factor="10ms"
--resources="cpus:2;gpus:0;mem:1024;disk:1024;ports:[31000-32000]" --revocable_cpu_low_priority="true"
--runtime_dir="/tmp/Endpoint_SlaveEndpointTest_NoAuthorizer_0_HoD4Dc" --sandbox_directory="/mnt/mesos/sandbox"
--strict="true" --switch_user="true" --systemd_enable_support="true" --systemd_runtime_directory="/run/systemd/system"
--version="false" --work_dir="/tmp/Endpoint_SlaveEndpointTest_NoAuthorizer_0_yAHl0K"
I0609 05:27:34.873493  4857 credentials.hpp:86] Loading credential for authentication from
'/tmp/Endpoint_SlaveEndpointTest_NoAuthorizer_0_HoD4Dc/credential'
I0609 05:27:34.874101  4857 slave.cpp:281] Agent using credential for: test-principal
I0609 05:27:34.874434  4857 credentials.hpp:37] Loading credentials for authentication from
'/tmp/Endpoint_SlaveEndpointTest_NoAuthorizer_0_HoD4Dc/http_credentials'
I0609 05:27:34.875171  4857 http.cpp:975] Creating default 'basic' HTTP authenticator for
realm 'mesos-agent-readonly'
I0609 05:27:34.875658  4857 http.cpp:975] Creating default 'basic' HTTP authenticator for
realm 'mesos-agent-readwrite'
I0609 05:27:34.877377  4857 slave.cpp:552] Agent resources: cpus(*):2; mem(*):1024; disk(*):1024;
ports(*):[31000-32000]
I0609 05:27:34.877686  4857 slave.cpp:560] Agent attributes: [  ]
I0609 05:27:34.877904  4857 slave.cpp:565] Agent hostname: ee39bb6afecb
I0609 05:27:34.878248  4850 status_update_manager.cpp:177] Pausing sending status updates
I0609 05:27:34.880005  4864 state.cpp:62] Recovering state from '/tmp/Endpoint_SlaveEndpointTest_NoAuthorizer_0_yAHl0K/meta'
I0609 05:27:34.880642  4864 status_update_manager.cpp:203] Recovering status update manager
I0609 05:27:34.880822  4864 containerizer.cpp:582] Recovering containerizer
I0609 05:27:34.882817  4851 provisioner.cpp:416] Provisioner recovery complete
I0609 05:27:34.883208  4860 slave.cpp:6127] Finished recovery
I0609 05:27:34.883798  4860 slave.cpp:6309] Querying resource estimator for oversubscribable
resources
I0609 05:27:34.884243  4860 slave.cpp:6323] Received oversubscribable resources {} from the
resource estimator
I0609 05:27:34.887348  4871 process.cpp:3778] Handling HTTP event for process 'slave(760)'
with path: '/slave(760)/monitor/statistics'
I0609 05:27:34.888901  4869 http.cpp:1115] HTTP GET for /slave(760)/monitor/statistics from
172.17.0.3:53868
I0609 05:27:34.889003  4869 http.cpp:936] Authorizing principal 'test-principal' to GET the
'/monitor/statistics' endpoint
I0609 05:27:34.894492  4866 slave.cpp:817] Agent terminating
[       OK ] Endpoint/SlaveEndpointTest.NoAuthorizer/0 (49 ms)
[ RUN      ] Endpoint/SlaveEndpointTest.NoAuthorizer/1
I0609 05:27:34.914435  4830 containerizer.cpp:230] Using isolation: posix/cpu,posix/mem,filesystem/posix,network/cni,environment_secret
W0609 05:27:34.915669  4830 backend.cpp:76] Failed to create 'aufs' backend: AufsBackend requires
root privileges
W0609 05:27:34.916019  4830 backend.cpp:76] Failed to create 'bind' backend: BindBackend requires
root privileges
I0609 05:27:34.916340  4830 provisioner.cpp:255] Using default backend 'copy'
I0609 05:27:34.918654  4830 cluster.cpp:448] Creating default 'local' authorizer
I0609 05:27:34.921007  4850 slave.cpp:248] Mesos agent started on (761)@172.17.0.3:41084
I0609 05:27:34.921044  4850 slave.cpp:249] Flags at startup: --acls="" --appc_simple_discovery_uri_prefix="http://"
--appc_store_dir="/tmp/Endpoint_SlaveEndpointTest_NoAuthorizer_1_edHvCZ/store/appc" --authenticate_http_readonly="true"
--authenticate_http_readwrite="true" --authenticatee="crammd5" --authentication_backoff_factor="1secs"
--authorizer="local" --cgroups_cpu_enable_pids_and_tids_count="false" --cgroups_enable_cfs="false"
--cgroups_hierarchy="/sys/fs/cgroup" --cgroups_limit_swap="false" --cgroups_root="mesos" --container_disk_watch_interval="15secs"
--containerizers="mesos" --credential="/tmp/Endpoint_SlaveEndpointTest_NoAuthorizer_1_edHvCZ/credential"
--default_role="*" --disk_watch_interval="1mins" --docker="docker" --docker_kill_orphans="true"
--docker_registry="https://registry-1.docker.io" --docker_remove_delay="6hrs" --docker_socket="/var/run/docker.sock"
--docker_stop_timeout="0ns" --docker_store_dir="/tmp/Endpoint_SlaveEndpointTest_NoAuthorizer_1_edHvCZ/store/docker"
--docker_volume_checkpoint_dir="/var/run/mesos/isolators/docker/volume" --enforce_container_disk_quota="false"
--executor_registration_timeout="1mins" --executor_reregistration_timeout="2secs" --executor_shutdown_grace_period="5secs"
--fetcher_cache_dir="/tmp/Endpoint_SlaveEndpointTest_NoAuthorizer_1_edHvCZ/fetch" --fetcher_cache_size="2GB"
--frameworks_home="" --gc_delay="1weeks" --gc_disk_headroom="0.1" --hadoop_home="" --help="false"
--hostname_lookup="true" --http_command_executor="false" --http_credentials="/tmp/Endpoint_SlaveEndpointTest_NoAuthorizer_1_edHvCZ/http_credentials"
--http_heartbeat_interval="30secs" --initialize_driver_logging="true" --isolation="posix/cpu,posix/mem"
--launcher="posix" --launcher_dir="/mesos/mesos-1.4.0/_build/src" --logbufsecs="0" --logging_level="INFO"
--max_completed_executors_per_framework="150" --oversubscribed_resources_interval="15secs"
--perf_duration="10secs" --perf_interval="1mins" --port="5051" --qos_correction_interval_min="0ns"
--quiet="false" --recover="reconnect" --recovery_timeout="15mins" --registration_backoff_factor="10ms"
--resources="cpus:2;gpus:0;mem:1024;disk:1024;ports:[31000-32000]" --revocable_cpu_low_priority="true"
--runtime_dir="/tmp/Endpoint_SlaveEndpointTest_NoAuthorizer_1_edHvCZ" --sandbox_directory="/mnt/mesos/sandbox"
--strict="true" --switch_user="true" --systemd_enable_support="true" --systemd_runtime_directory="/run/systemd/system"
--version="false" --work_dir="/tmp/Endpoint_SlaveEndpointTest_NoAuthorizer_1_yhjjRx"
I0609 05:27:34.921555  4850 credentials.hpp:86] Loading credential for authentication from
'/tmp/Endpoint_SlaveEndpointTest_NoAuthorizer_1_edHvCZ/credential'
I0609 05:27:34.921818  4850 slave.cpp:281] Agent using credential for: test-principal
I0609 05:27:34.921838  4850 credentials.hpp:37] Loading credentials for authentication from
'/tmp/Endpoint_SlaveEndpointTest_NoAuthorizer_1_edHvCZ/http_credentials'
I0609 05:27:34.922070  4850 http.cpp:975] Creating default 'basic' HTTP authenticator for
realm 'mesos-agent-readonly'
I0609 05:27:34.922257  4850 http.cpp:975] Creating default 'basic' HTTP authenticator for
realm 'mesos-agent-readwrite'
I0609 05:27:34.923722  4850 slave.cpp:552] Agent resources: cpus(*):2; mem(*):1024; disk(*):1024;
ports(*):[31000-32000]
I0609 05:27:34.923804  4850 slave.cpp:560] Agent attributes: [  ]
I0609 05:27:34.923816  4850 slave.cpp:565] Agent hostname: ee39bb6afecb
I0609 05:27:34.923984  4854 status_update_manager.cpp:177] Pausing sending status updates
I0609 05:27:34.925611  4865 state.cpp:62] Recovering state from '/tmp/Endpoint_SlaveEndpointTest_NoAuthorizer_1_yhjjRx/meta'
I0609 05:27:34.926146  4866 status_update_manager.cpp:203] Recovering status update manager
I0609 05:27:34.926404  4870 containerizer.cpp:582] Recovering containerizer
I0609 05:27:34.928310  4850 provisioner.cpp:416] Provisioner recovery complete
I0609 05:27:34.928664  4862 slave.cpp:6127] Finished recovery
I0609 05:27:34.929353  4862 slave.cpp:6309] Querying resource estimator for oversubscribable
resources
I0609 05:27:34.929811  4868 slave.cpp:6323] Received oversubscribable resources {} from the
resource estimator
I0609 05:27:34.932745  4868 process.cpp:3778] Handling HTTP event for process 'slave(761)'
with path: '/slave(761)/monitor/statistics.json'
I0609 05:27:34.934468  4870 http.cpp:1115] HTTP GET for /slave(761)/monitor/statistics.json
from 172.17.0.3:53870
I0609 05:27:34.934752  4870 http.cpp:936] Authorizing principal 'test-principal' to GET the
'/monitor/statistics.json' endpoint
I0609 05:27:34.938729  4857 slave.cpp:817] Agent terminating
[       OK ] Endpoint/SlaveEndpointTest.NoAuthorizer/1 (38 ms)
[ RUN      ] Endpoint/SlaveEndpointTest.NoAuthorizer/2
I0609 05:27:34.949798  4830 containerizer.cpp:230] Using isolation: posix/cpu,posix/mem,filesystem/posix,network/cni,environment_secret
W0609 05:27:34.950359  4830 backend.cpp:76] Failed to create 'aufs' backend: AufsBackend requires
root privileges
W0609 05:27:34.950470  4830 backend.cpp:76] Failed to create 'bind' backend: BindBackend requires
root privileges
I0609 05:27:34.950511  4830 provisioner.cpp:255] Using default backend 'copy'
I0609 05:27:34.952518  4830 cluster.cpp:448] Creating default 'local' authorizer
I0609 05:27:34.954217  4850 slave.cpp:248] Mesos agent started on (762)@172.17.0.3:41084
I0609 05:27:34.954313  4850 slave.cpp:249] Flags at startup: --acls="" --appc_simple_discovery_uri_prefix="http://"
--appc_store_dir="/tmp/Endpoint_SlaveEndpointTest_NoAuthorizer_2_5astYM/store/appc" --authenticate_http_readonly="true"
--authenticate_http_readwrite="true" --authenticatee="crammd5" --authentication_backoff_factor="1secs"
--authorizer="local" --cgroups_cpu_enable_pids_and_tids_count="false" --cgroups_enable_cfs="false"
--cgroups_hierarchy="/sys/fs/cgroup" --cgroups_limit_swap="false" --cgroups_root="mesos" --container_disk_watch_interval="15secs"
--containerizers="mesos" --credential="/tmp/Endpoint_SlaveEndpointTest_NoAuthorizer_2_5astYM/credential"
--default_role="*" --disk_watch_interval="1mins" --docker="docker" --docker_kill_orphans="true"
--docker_registry="https://registry-1.docker.io" --docker_remove_delay="6hrs" --docker_socket="/var/run/docker.sock"
--docker_stop_timeout="0ns" --docker_store_dir="/tmp/Endpoint_SlaveEndpointTest_NoAuthorizer_2_5astYM/store/docker"
--docker_volume_checkpoint_dir="/var/run/mesos/isolators/docker/volume" --enforce_container_disk_quota="false"
--executor_registration_timeout="1mins" --executor_reregistration_timeout="2secs" --executor_shutdown_grace_period="5secs"
--fetcher_cache_dir="/tmp/Endpoint_SlaveEndpointTest_NoAuthorizer_2_5astYM/fetch" --fetcher_cache_size="2GB"
--frameworks_home="" --gc_delay="1weeks" --gc_disk_headroom="0.1" --hadoop_home="" --help="false"
--hostname_lookup="true" --http_command_executor="false" --http_credentials="/tmp/Endpoint_SlaveEndpointTest_NoAuthorizer_2_5astYM/http_credentials"
--http_heartbeat_interval="30secs" --initialize_driver_logging="true" --isolation="posix/cpu,posix/mem"
--launcher="posix" --launcher_dir="/mesos/mesos-1.4.0/_build/src" --logbufsecs="0" --logging_level="INFO"
--max_completed_executors_per_framework="150" --oversubscribed_resources_interval="15secs"
--perf_duration="10secs" --perf_interval="1mins" --port="5051" --qos_correction_interval_min="0ns"
--quiet="false" --recover="reconnect" --recovery_timeout="15mins" --registration_backoff_factor="10ms"
--resources="cpus:2;gpus:0;mem:1024;disk:1024;ports:[31000-32000]" --revocable_cpu_low_priority="true"
--runtime_dir="/tmp/Endpoint_SlaveEndpointTest_NoAuthorizer_2_5astYM" --sandbox_directory="/mnt/mesos/sandbox"
--strict="true" --switch_user="true" --systemd_enable_support="true" --systemd_runtime_directory="/run/systemd/system"
--version="false" --work_dir="/tmp/Endpoint_SlaveEndpointTest_NoAuthorizer_2_GiEJ7k"
I0609 05:27:34.954797  4850 credentials.hpp:86] Loading credential for authentication from
'/tmp/Endpoint_SlaveEndpointTest_NoAuthorizer_2_5astYM/credential'
I0609 05:27:34.955063  4850 slave.cpp:281] Agent using credential for: test-principal
I0609 05:27:34.955088  4850 credentials.hpp:37] Loading credentials for authentication from
'/tmp/Endpoint_SlaveEndpointTest_NoAuthorizer_2_5astYM/http_credentials'
I0609 05:27:34.955374  4850 http.cpp:975] Creating default 'basic' HTTP authenticator for
realm 'mesos-agent-readonly'
I0609 05:27:34.955577  4850 http.cpp:975] Creating default 'basic' HTTP authenticator for
realm 'mesos-agent-readwrite'
I0609 05:27:34.956867  4850 slave.cpp:552] Agent resources: cpus(*):2; mem(*):1024; disk(*):1024;
ports(*):[31000-32000]
I0609 05:27:34.956945  4850 slave.cpp:560] Agent attributes: [  ]
I0609 05:27:34.956967  4850 slave.cpp:565] Agent hostname: ee39bb6afecb
I0609 05:27:34.957164  4859 status_update_manager.cpp:177] Pausing sending status updates
I0609 05:27:34.958813  4862 state.cpp:62] Recovering state from '/tmp/Endpoint_SlaveEndpointTest_NoAuthorizer_2_GiEJ7k/meta'
I0609 05:27:34.959234  4858 status_update_manager.cpp:203] Recovering status update manager
I0609 05:27:34.959460  4862 containerizer.cpp:582] Recovering containerizer
I0609 05:27:34.961289  4850 provisioner.cpp:416] Provisioner recovery complete
I0609 05:27:34.961722  4865 slave.cpp:6127] Finished recovery
I0609 05:27:34.962349  4865 slave.cpp:6309] Querying resource estimator for oversubscribable
resources
I0609 05:27:34.962658  4856 slave.cpp:6323] Received oversubscribable resources {} from the
resource estimator
I0609 05:27:34.965930  4864 process.cpp:3778] Handling HTTP event for process 'slave(762)'
with path: '/slave(762)/containers'
I0609 05:27:34.967434  4863 http.cpp:1115] HTTP GET for /slave(762)/containers from 172.17.0.3:53872
I0609 05:27:34.967568  4863 http.cpp:936] Authorizing principal 'test-principal' to GET the
'/containers' endpoint
I0609 05:27:34.971885  4865 slave.cpp:817] Agent terminating
[       OK ] Endpoint/SlaveEndpointTest.NoAuthorizer/2 (39 ms)
[----------] 9 tests from Endpoint/SlaveEndpointTest (372 ms total)

[----------] Global test environment tear-down
[==========] 1589 tests from 176 test cases ran. (497971 ms total)
[  PASSED  ] 1588 tests.
[  FAILED  ] 1 test, listed below:
[  FAILED  ] PersistentVolumeEndpointsTest.ReserveAndSlaveRemoval

 1 FAILED TEST
  YOU HAVE 22 DISABLED TESTS

E0609 05:27:35.060451  4873 process.cpp:968] Failed to accept socket: future discarded
make[4]: *** [check-local] Error 1
make[4]: Leaving directory `/mesos/mesos-1.4.0/_build/src'
make[3]: *** [check-am] Error 2
make[3]: Leaving directory `/mesos/mesos-1.4.0/_build/src'
make[2]: *** [check] Error 2
make[2]: Leaving directory `/mesos/mesos-1.4.0/_build/src'
make[1]: *** [check-recursive] Error 1
make[1]: Leaving directory `/mesos/mesos-1.4.0/_build'
make: *** [distcheck] Error 1
+ docker rmi mesos-1496982748-3283
Untagged: mesos-1496982748-3283:latest
Deleted: sha256:121a9dde674f0a26bf749446668a2c008c32828b3049a5fc02faeba1cf5b7e31
Deleted: sha256:548786d97c45658cac1acae732a6cdf86d783ca36c10999377f565160887589c
Deleted: sha256:7eb3b5374d0176097cc90566b7f61530149512c2cc1cf59dbd4dac6ae7305a11
Deleted: sha256:29bafcd2d0d4ac14cccd3e7ea650e8b263756559b602a3352df57e311ec3655f
Deleted: sha256:d6d50398762622dc5615420e33e02f8c3469c037b83c528fd52e4ff0854a2157
Deleted: sha256:4f9ccefceadb356a4b1979bb8525084e3b755e94de03469e6b988ff81f706195
Deleted: sha256:5144cd2003585a79a49bed38e84beb721b8038e25183b47cdbe014f308623c22
Deleted: sha256:08353d8cca942aea88af79c08553b2afb4001fe3644f557051a30aa755cb8531
Deleted: sha256:5d45eafa94b64f403f49a9edccf43135e4d1d4fe83ffb05f825262fc35711e5a
Deleted: sha256:7be25449777a52cff37d00da1e0a096a4b75fde80f8bde51456f5cbff3d19f9f
Deleted: sha256:2656f16cfa16945614c01f57ea737594e9fb52e50d6ca8b995069de71992136e
Deleted: sha256:bd226030241a1acc5c36e160ab407be28532fa6f5d1944d224fefce8cfc9122e
Deleted: sha256:da69aaf11a533785916dadc06452aac1b6e0bb307c0d46f83772cd307b4ec86c
Deleted: sha256:3b7e44dd91962bace1aa9ed20f839bf857a067375bade5689ff75eb55f3f69a5
Deleted: sha256:a54aad57d0c6c2caa09b6a928ea281095e2a5f0b367109e78a99b6cbb56914ea
Deleted: sha256:dc6a4499bbb544c99800fc6b390f5d3deaa7eae9a4178bc2008b983662e7f6bc
Deleted: sha256:c094417e4da5eb568c568ffe3f4d74c78e5a8d49d971bc0ec64779bda86dcaf4
Deleted: sha256:a467a37f154d04944470abe2ec7b857ba76c270886c213c0ade9bb19019b9550
Deleted: sha256:7f44ee866448d2ab13f38484ed6f9e5fd017524b390107e22be076a528684ffb
Deleted: sha256:82fc3a474bc2ddc47b88700e8c32d4fd60a9e05236cc2c180eca87fa91f630a7
Deleted: sha256:21a9cd4579b7f5e2f8bad128b460421d6828b395ceb7314fad77f3a979211838
Deleted: sha256:75fdf140570116b36cf4a72ee7bc61bfb23399e2a2a9f151dbd71d8d7a173af3
Deleted: sha256:6a176ec3ecf317d7b78bf818ed7e758b1cb22c4642dcf62264c9b1eba7da2958
Deleted: sha256:8e5bc8ec84ae4d51abf0aa6046947bcd645a3ca915635eaa49f061da9b0718d5
Build step 'Execute shell' marked build as failure

Mime
View raw message