mesos-builds mailing list archives

Site index · List index
Message view « Date » · « Thread »
Top « Date » · « Thread »
From Apache Jenkins Server <jenk...@builds.apache.org>
Subject Build failed in Jenkins: Mesos-Buildbot » autotools,gcc,--verbose --enable-libevent --enable-ssl,GLOG_v=1 MESOS_VERBOSE=1,ubuntu:14.04,(ubuntu)&&(!ubuntu-us1)&&(!ubuntu-eu2) #3798
Date Wed, 14 Jun 2017 14:40:35 GMT
See <https://builds.apache.org/job/Mesos-Buildbot/BUILDTOOL=autotools,COMPILER=gcc,CONFIGURATION=--verbose%20--enable-libevent%20--enable-ssl,ENVIRONMENT=GLOG_v=1%20MESOS_VERBOSE=1,OS=ubuntu%3A14.04,label_exp=(ubuntu)&&(!ubuntu-us1)&&(!ubuntu-eu2)/3798/display/redirect>

------------------------------------------
[...truncated 2.72 MB...]
[ RUN      ] Scheme/HTTPTest.Delete/0
I0614 14:40:02.078241  1802 openssl.cpp:419] CA file path is unspecified! NOTE: Set CA file
path with LIBPROCESS_SSL_CA_FILE=<filepath>
I0614 14:40:02.078280  1802 openssl.cpp:424] CA directory path unspecified! NOTE: Set CA directory
path with LIBPROCESS_SSL_CA_DIR=<dirpath>
I0614 14:40:02.078294  1802 openssl.cpp:429] Will not verify peer certificate!
NOTE: Set LIBPROCESS_SSL_VERIFY_CERT=1 to enable peer certificate verification
I0614 14:40:02.078305  1802 openssl.cpp:435] Will only verify peer certificate if presented!
NOTE: Set LIBPROCESS_SSL_REQUIRE_CERT=1 to require peer certificate verification
E0614 14:40:02.079193  2490 process.cpp:968] Failed to accept socket: future discarded
I0614 14:40:02.082265  1802 process.cpp:1282] libprocess is initialized on 172.17.0.2:32953
with 8 worker threads
I0614 14:40:02.094671  2495 process.cpp:3778] Handling HTTP event for process '(90)' with
path: '/(90)/delete'
[       OK ] Scheme/HTTPTest.Delete/0 (836 ms)
[ RUN      ] Scheme/HTTPTest.Delete/1
I0614 14:40:02.111171  1802 process.cpp:1282] libprocess is initialized on 172.17.0.2:33533
with 8 worker threads
I0614 14:40:02.114862  2505 process.cpp:3778] Handling HTTP event for process '(91)' with
path: '/(91)/delete'
[       OK ] Scheme/HTTPTest.Delete/1 (11 ms)
[ RUN      ] Scheme/HTTPTest.Request/0
I0614 14:40:02.750434  1802 openssl.cpp:419] CA file path is unspecified! NOTE: Set CA file
path with LIBPROCESS_SSL_CA_FILE=<filepath>
I0614 14:40:02.750624  1802 openssl.cpp:424] CA directory path unspecified! NOTE: Set CA directory
path with LIBPROCESS_SSL_CA_DIR=<dirpath>
I0614 14:40:02.750699  1802 openssl.cpp:429] Will not verify peer certificate!
NOTE: Set LIBPROCESS_SSL_VERIFY_CERT=1 to enable peer certificate verification
I0614 14:40:02.750728  1802 openssl.cpp:435] Will only verify peer certificate if presented!
NOTE: Set LIBPROCESS_SSL_REQUIRE_CERT=1 to require peer certificate verification
E0614 14:40:02.752243  2508 process.cpp:968] Failed to accept socket: future discarded
I0614 14:40:02.754956  1802 process.cpp:1282] libprocess is initialized on 172.17.0.2:33281
with 8 worker threads
I0614 14:40:02.767354  2511 process.cpp:3778] Handling HTTP event for process '(92)' with
path: '/(92)/request'
[       OK ] Scheme/HTTPTest.Request/0 (662 ms)
[ RUN      ] Scheme/HTTPTest.Request/1
I0614 14:40:02.784082  1802 process.cpp:1282] libprocess is initialized on 172.17.0.2:40649
with 8 worker threads
I0614 14:40:02.796350  2518 process.cpp:3778] Handling HTTP event for process '(93)' with
path: '/(93)/request'
[       OK ] Scheme/HTTPTest.Request/1 (52 ms)
[ RUN      ] Scheme/HTTPTest.QueryEncodeDecode/0
I0614 14:40:03.724480  1802 openssl.cpp:419] CA file path is unspecified! NOTE: Set CA file
path with LIBPROCESS_SSL_CA_FILE=<filepath>
I0614 14:40:03.724927  1802 openssl.cpp:424] CA directory path unspecified! NOTE: Set CA directory
path with LIBPROCESS_SSL_CA_DIR=<dirpath>
I0614 14:40:03.724990  1802 openssl.cpp:429] Will not verify peer certificate!
NOTE: Set LIBPROCESS_SSL_VERIFY_CERT=1 to enable peer certificate verification
I0614 14:40:03.725096  1802 openssl.cpp:435] Will only verify peer certificate if presented!
NOTE: Set LIBPROCESS_SSL_REQUIRE_CERT=1 to require peer certificate verification
E0614 14:40:03.739751  2526 process.cpp:968] Failed to accept socket: future discarded
I0614 14:40:03.745961  1802 process.cpp:1282] libprocess is initialized on 172.17.0.2:43571
with 8 worker threads
[       OK ] Scheme/HTTPTest.QueryEncodeDecode/0 (914 ms)
[ RUN      ] Scheme/HTTPTest.QueryEncodeDecode/1
I0614 14:40:03.749758  1802 process.cpp:1282] libprocess is initialized on 172.17.0.2:46313
with 8 worker threads
[       OK ] Scheme/HTTPTest.QueryEncodeDecode/1 (4 ms)
[ RUN      ] Scheme/HTTPTest.Headers/0
I0614 14:40:04.679489  1802 openssl.cpp:419] CA file path is unspecified! NOTE: Set CA file
path with LIBPROCESS_SSL_CA_FILE=<filepath>
I0614 14:40:04.679528  1802 openssl.cpp:424] CA directory path unspecified! NOTE: Set CA directory
path with LIBPROCESS_SSL_CA_DIR=<dirpath>
I0614 14:40:04.679541  1802 openssl.cpp:429] Will not verify peer certificate!
NOTE: Set LIBPROCESS_SSL_VERIFY_CERT=1 to enable peer certificate verification
I0614 14:40:04.679553  1802 openssl.cpp:435] Will only verify peer certificate if presented!
NOTE: Set LIBPROCESS_SSL_REQUIRE_CERT=1 to require peer certificate verification
E0614 14:40:04.680510  2544 process.cpp:968] Failed to accept socket: future discarded
I0614 14:40:04.683367  1802 process.cpp:1282] libprocess is initialized on 172.17.0.2:43751
with 8 worker threads
[       OK ] Scheme/HTTPTest.Headers/0 (934 ms)
[ RUN      ] Scheme/HTTPTest.Headers/1
I0614 14:40:04.687338  1802 process.cpp:1282] libprocess is initialized on 172.17.0.2:38523
with 8 worker threads
[       OK ] Scheme/HTTPTest.Headers/1 (3 ms)
[ RUN      ] Scheme/HTTPTest.CaseInsensitiveHeaders/0
I0614 14:40:05.376276  1802 openssl.cpp:419] CA file path is unspecified! NOTE: Set CA file
path with LIBPROCESS_SSL_CA_FILE=<filepath>
I0614 14:40:05.376312  1802 openssl.cpp:424] CA directory path unspecified! NOTE: Set CA directory
path with LIBPROCESS_SSL_CA_DIR=<dirpath>
I0614 14:40:05.376323  1802 openssl.cpp:429] Will not verify peer certificate!
NOTE: Set LIBPROCESS_SSL_VERIFY_CERT=1 to enable peer certificate verification
I0614 14:40:05.376337  1802 openssl.cpp:435] Will only verify peer certificate if presented!
NOTE: Set LIBPROCESS_SSL_REQUIRE_CERT=1 to require peer certificate verification
E0614 14:40:05.377735  2562 process.cpp:968] Failed to accept socket: future discarded
I0614 14:40:05.379616  1802 process.cpp:1282] libprocess is initialized on 172.17.0.2:40253
with 8 worker threads
[       OK ] Scheme/HTTPTest.CaseInsensitiveHeaders/0 (693 ms)
[ RUN      ] Scheme/HTTPTest.CaseInsensitiveHeaders/1
I0614 14:40:05.383500  1802 process.cpp:1282] libprocess is initialized on 172.17.0.2:36077
with 8 worker threads
[       OK ] Scheme/HTTPTest.CaseInsensitiveHeaders/1 (3 ms)
[ RUN      ] Scheme/HTTPTest.WWWAuthenticateHeader/0
I0614 14:40:05.834342  1802 openssl.cpp:419] CA file path is unspecified! NOTE: Set CA file
path with LIBPROCESS_SSL_CA_FILE=<filepath>
I0614 14:40:05.834377  1802 openssl.cpp:424] CA directory path unspecified! NOTE: Set CA directory
path with LIBPROCESS_SSL_CA_DIR=<dirpath>
I0614 14:40:05.834388  1802 openssl.cpp:429] Will not verify peer certificate!
NOTE: Set LIBPROCESS_SSL_VERIFY_CERT=1 to enable peer certificate verification
I0614 14:40:05.834400  1802 openssl.cpp:435] Will only verify peer certificate if presented!
NOTE: Set LIBPROCESS_SSL_REQUIRE_CERT=1 to require peer certificate verification
E0614 14:40:05.836226  2580 process.cpp:968] Failed to accept socket: future discarded
I0614 14:40:05.838382  1802 process.cpp:1282] libprocess is initialized on 172.17.0.2:40479
with 8 worker threads
[       OK ] Scheme/HTTPTest.WWWAuthenticateHeader/0 (456 ms)
[ RUN      ] Scheme/HTTPTest.WWWAuthenticateHeader/1
I0614 14:40:05.842774  1802 process.cpp:1282] libprocess is initialized on 172.17.0.2:41677
with 8 worker threads
[       OK ] Scheme/HTTPTest.WWWAuthenticateHeader/1 (4 ms)
[ RUN      ] Scheme/HTTPTest.Accepts/0
I0614 14:40:06.328225  1802 openssl.cpp:419] CA file path is unspecified! NOTE: Set CA file
path with LIBPROCESS_SSL_CA_FILE=<filepath>
I0614 14:40:06.328335  1802 openssl.cpp:424] CA directory path unspecified! NOTE: Set CA directory
path with LIBPROCESS_SSL_CA_DIR=<dirpath>
I0614 14:40:06.328363  1802 openssl.cpp:429] Will not verify peer certificate!
NOTE: Set LIBPROCESS_SSL_VERIFY_CERT=1 to enable peer certificate verification
I0614 14:40:06.328403  1802 openssl.cpp:435] Will only verify peer certificate if presented!
NOTE: Set LIBPROCESS_SSL_REQUIRE_CERT=1 to require peer certificate verification
E0614 14:40:06.330569  2598 process.cpp:968] Failed to accept socket: future discarded
I0614 14:40:06.332792  1802 process.cpp:1282] libprocess is initialized on 172.17.0.2:34849
with 8 worker threads
[       OK ] Scheme/HTTPTest.Accepts/0 (492 ms)
[ RUN      ] Scheme/HTTPTest.Accepts/1
I0614 14:40:06.338557  1802 process.cpp:1282] libprocess is initialized on 172.17.0.2:37833
with 8 worker threads
[       OK ] Scheme/HTTPTest.Accepts/1 (5 ms)
E0614 14:40:06.342430  2616 process.cpp:968] Failed to accept socket: future discarded
I0614 14:40:06.344343  1802 process.cpp:1282] libprocess is initialized on 172.17.0.2:46429
with 8 worker threads
[----------] 42 tests from Scheme/HTTPTest (14290 ms total)

[----------] 4 tests from Encryption/NetSocketTest
[ RUN      ] Encryption/NetSocketTest.EOFBeforeRecv/0
I0614 14:40:06.836335  1802 openssl.cpp:419] CA file path is unspecified! NOTE: Set CA file
path with LIBPROCESS_SSL_CA_FILE=<filepath>
I0614 14:40:06.836446  1802 openssl.cpp:424] CA directory path unspecified! NOTE: Set CA directory
path with LIBPROCESS_SSL_CA_DIR=<dirpath>
I0614 14:40:06.836475  1802 openssl.cpp:429] Will not verify peer certificate!
NOTE: Set LIBPROCESS_SSL_VERIFY_CERT=1 to enable peer certificate verification
I0614 14:40:06.836516  1802 openssl.cpp:435] Will only verify peer certificate if presented!
NOTE: Set LIBPROCESS_SSL_REQUIRE_CERT=1 to require peer certificate verification
E0614 14:40:06.838575  2625 process.cpp:968] Failed to accept socket: future discarded
I0614 14:40:06.840718  1802 process.cpp:1282] libprocess is initialized on 172.17.0.2:37999
with 8 worker threads
../../../3rdparty/libprocess/src/tests/socket_tests.cpp:196: Failure
Failed to wait 15secs for client->recv()
[  FAILED  ] Encryption/NetSocketTest.EOFBeforeRecv/0, where GetParam() = "SSL" (15555 ms)
[ RUN      ] Encryption/NetSocketTest.EOFBeforeRecv/1
I0614 14:40:21.904862  1802 process.cpp:1282] libprocess is initialized on 172.17.0.2:42973
with 8 worker threads
[       OK ] Encryption/NetSocketTest.EOFBeforeRecv/1 (14 ms)
[ RUN      ] Encryption/NetSocketTest.EOFAfterRecv/0
I0614 14:40:22.746409  1802 openssl.cpp:419] CA file path is unspecified! NOTE: Set CA file
path with LIBPROCESS_SSL_CA_FILE=<filepath>
I0614 14:40:22.746517  1802 openssl.cpp:424] CA directory path unspecified! NOTE: Set CA directory
path with LIBPROCESS_SSL_CA_DIR=<dirpath>
I0614 14:40:22.746616  1802 openssl.cpp:429] Will not verify peer certificate!
NOTE: Set LIBPROCESS_SSL_VERIFY_CERT=1 to enable peer certificate verification
I0614 14:40:22.746646  1802 openssl.cpp:435] Will only verify peer certificate if presented!
NOTE: Set LIBPROCESS_SSL_REQUIRE_CERT=1 to require peer certificate verification
E0614 14:40:22.747918  2643 process.cpp:968] Failed to accept socket: future discarded
I0614 14:40:22.751516  1802 process.cpp:1282] libprocess is initialized on 172.17.0.2:43383
with 8 worker threads
[       OK ] Encryption/NetSocketTest.EOFAfterRecv/0 (900 ms)
[ RUN      ] Encryption/NetSocketTest.EOFAfterRecv/1
I0614 14:40:22.819104  1802 process.cpp:1282] libprocess is initialized on 172.17.0.2:40873
with 8 worker threads
[       OK ] Encryption/NetSocketTest.EOFAfterRecv/1 (39 ms)
E0614 14:40:22.856909  2661 process.cpp:968] Failed to accept socket: future discarded
I0614 14:40:22.858777  1802 process.cpp:1282] libprocess is initialized on 172.17.0.2:44723
with 8 worker threads
[----------] 4 tests from Encryption/NetSocketTest (16509 ms total)

[----------] 6 tests from SSLVerifyIPAdd/SSLTest
[ RUN      ] SSLVerifyIPAdd/SSLTest.BasicSameProcess/0
I0614 14:40:23.941674  1802 openssl.cpp:429] Will not verify peer certificate!
NOTE: Set LIBPROCESS_SSL_VERIFY_CERT=1 to enable peer certificate verification
I0614 14:40:23.941702  1802 openssl.cpp:449] LIBPROCESS_SSL_REQUIRE_CERT implies peer certificate
verification.
LIBPROCESS_SSL_VERIFY_CERT set to true
I0614 14:40:23.941975  1802 openssl.cpp:478] Using CA file: /tmp/4H97yL/cert.pem
I0614 14:40:23.941993  1802 openssl.cpp:481] Using CA dir: /tmp/4H97yL
[       OK ] SSLVerifyIPAdd/SSLTest.BasicSameProcess/0 (1110 ms)
[ RUN      ] SSLVerifyIPAdd/SSLTest.BasicSameProcess/1
I0614 14:40:24.450958  1802 openssl.cpp:429] Will not verify peer certificate!
NOTE: Set LIBPROCESS_SSL_VERIFY_CERT=1 to enable peer certificate verification
I0614 14:40:24.450994  1802 openssl.cpp:441] Will use IP address verification in subject alternative
name certificate extension.
I0614 14:40:24.451006  1802 openssl.cpp:449] LIBPROCESS_SSL_REQUIRE_CERT implies peer certificate
verification.
LIBPROCESS_SSL_VERIFY_CERT set to true
I0614 14:40:24.451308  1802 openssl.cpp:478] Using CA file: /tmp/O4JYJf/cert.pem
I0614 14:40:24.451329  1802 openssl.cpp:481] Using CA dir: /tmp/O4JYJf
[       OK ] SSLVerifyIPAdd/SSLTest.BasicSameProcess/1 (535 ms)
[ RUN      ] SSLVerifyIPAdd/SSLTest.BasicSameProcessUnix/0
I0614 14:40:25.323943  1802 openssl.cpp:429] Will not verify peer certificate!
NOTE: Set LIBPROCESS_SSL_VERIFY_CERT=1 to enable peer certificate verification
I0614 14:40:25.323971  1802 openssl.cpp:435] Will only verify peer certificate if presented!
NOTE: Set LIBPROCESS_SSL_REQUIRE_CERT=1 to require peer certificate verification
[       OK ] SSLVerifyIPAdd/SSLTest.BasicSameProcessUnix/0 (862 ms)
[ RUN      ] SSLVerifyIPAdd/SSLTest.BasicSameProcessUnix/1
I0614 14:40:26.002306  1802 openssl.cpp:429] Will not verify peer certificate!
NOTE: Set LIBPROCESS_SSL_VERIFY_CERT=1 to enable peer certificate verification
I0614 14:40:26.002336  1802 openssl.cpp:435] Will only verify peer certificate if presented!
NOTE: Set LIBPROCESS_SSL_REQUIRE_CERT=1 to require peer certificate verification
I0614 14:40:26.002348  1802 openssl.cpp:441] Will use IP address verification in subject alternative
name certificate extension.
[       OK ] SSLVerifyIPAdd/SSLTest.BasicSameProcessUnix/1 (659 ms)
[ RUN      ] SSLVerifyIPAdd/SSLTest.RequireCertificate/0
I0614 14:40:26.430958  1802 openssl.cpp:424] CA directory path unspecified! NOTE: Set CA directory
path with LIBPROCESS_SSL_CA_DIR=<dirpath>
I0614 14:40:26.430986  1802 openssl.cpp:429] Will not verify peer certificate!
NOTE: Set LIBPROCESS_SSL_VERIFY_CERT=1 to enable peer certificate verification
I0614 14:40:26.430999  1802 openssl.cpp:449] LIBPROCESS_SSL_REQUIRE_CERT implies peer certificate
verification.
LIBPROCESS_SSL_VERIFY_CERT set to true
I0614 14:40:26.431263  1802 openssl.cpp:478] Using CA file: /tmp/QuAOGS/cert.pem
WARNING: Logging before InitGoogleLogging() is written to STDERR
I0614 14:40:26.441166  2671 openssl.cpp:424] CA directory path unspecified! NOTE: Set CA directory
path with LIBPROCESS_SSL_CA_DIR=<dirpath>
I0614 14:40:26.441298  2671 openssl.cpp:429] Will not verify peer certificate!
NOTE: Set LIBPROCESS_SSL_VERIFY_CERT=1 to enable peer certificate verification
I0614 14:40:26.441313  2671 openssl.cpp:449] LIBPROCESS_SSL_REQUIRE_CERT implies peer certificate
verification.
LIBPROCESS_SSL_VERIFY_CERT set to true
I0614 14:40:26.441498  2671 openssl.cpp:478] Using CA file: /tmp/QuAOGS/cert.pem
[       OK ] SSLVerifyIPAdd/SSLTest.RequireCertificate/0 (467 ms)
[ RUN      ] SSLVerifyIPAdd/SSLTest.RequireCertificate/1
I0614 14:40:27.096161  1802 openssl.cpp:424] CA directory path unspecified! NOTE: Set CA directory
path with LIBPROCESS_SSL_CA_DIR=<dirpath>
I0614 14:40:27.096200  1802 openssl.cpp:429] Will not verify peer certificate!
NOTE: Set LIBPROCESS_SSL_VERIFY_CERT=1 to enable peer certificate verification
I0614 14:40:27.096213  1802 openssl.cpp:441] Will use IP address verification in subject alternative
name certificate extension.
I0614 14:40:27.096225  1802 openssl.cpp:449] LIBPROCESS_SSL_REQUIRE_CERT implies peer certificate
verification.
LIBPROCESS_SSL_VERIFY_CERT set to true
I0614 14:40:27.096554  1802 openssl.cpp:478] Using CA file: /tmp/I9jsst/cert.pem
WARNING: Logging before InitGoogleLogging() is written to STDERR
I0614 14:40:27.106693  2681 openssl.cpp:424] CA directory path unspecified! NOTE: Set CA directory
path with LIBPROCESS_SSL_CA_DIR=<dirpath>
I0614 14:40:27.106837  2681 openssl.cpp:429] Will not verify peer certificate!
NOTE: Set LIBPROCESS_SSL_VERIFY_CERT=1 to enable peer certificate verification
I0614 14:40:27.106849  2681 openssl.cpp:441] Will use IP address verification in subject alternative
name certificate extension.
I0614 14:40:27.106861  2681 openssl.cpp:449] LIBPROCESS_SSL_REQUIRE_CERT implies peer certificate
verification.
LIBPROCESS_SSL_VERIFY_CERT set to true
I0614 14:40:27.107066  2681 openssl.cpp:478] Using CA file: /tmp/I9jsst/cert.pem
[       OK ] SSLVerifyIPAdd/SSLTest.RequireCertificate/1 (704 ms)
[----------] 6 tests from SSLVerifyIPAdd/SSLTest (4337 ms total)

[----------] Global test environment tear-down
[==========] 242 tests from 37 test cases ran. (67370 ms total)
[  PASSED  ] 241 tests.
[  FAILED  ] 1 test, listed below:
[  FAILED  ] Encryption/NetSocketTest.EOFBeforeRecv/0, where GetParam() = "SSL"

 1 FAILED TEST
  YOU HAVE 2 DISABLED TESTS

E0614 14:40:27.217713  2670 process.cpp:968] Failed to accept socket: future discarded
make[7]: *** [check-local] Error 1
make[7]: Leaving directory `/mesos/mesos-1.4.0/_build/3rdparty/libprocess'
make[6]: *** [check-am] Error 2
make[6]: Leaving directory `/mesos/mesos-1.4.0/_build/3rdparty/libprocess'
make[5]: *** [check-recursive] Error 1
make[5]: Leaving directory `/mesos/mesos-1.4.0/_build/3rdparty/libprocess'
make[4]: *** [check] Error 2
make[4]: Leaving directory `/mesos/mesos-1.4.0/_build/3rdparty/libprocess'
make[3]: *** [check-recursive] Error 1
make[3]: Leaving directory `/mesos/mesos-1.4.0/_build/3rdparty'
make[2]: *** [check] Error 2
make[2]: Leaving directory `/mesos/mesos-1.4.0/_build/3rdparty'
make[1]: *** [check-recursive] Error 1
make[1]: Leaving directory `/mesos/mesos-1.4.0/_build'
make: *** [distcheck] Error 1
+ docker rmi mesos-1497447791-5486
Untagged: mesos-1497447791-5486:latest
Deleted: sha256:45cd20c42596949691716432d78fe07ed60306494d6885f7bbb1b5acf7f4874a
Deleted: sha256:31f7b7344648dd31cc5fecae25391310d6f710495b2a94d997e302b24b1e0b55
Deleted: sha256:136e7ff78e36205e844140d878d1dbf54f5808f843f9c3cb072c9dff47e82d32
Deleted: sha256:188d84627ecdf0ad3043394672b7e0ddabdb112e61289a7bab7a7722d74b2faa
Deleted: sha256:8ec66346414a24f8bdd258706e75ed3583f7d37c6e2ab955f1a891e1f44dbdfb
Deleted: sha256:641e2781cb93a668c89903058c590dace6d92476421838ccb66030463352f7e3
Deleted: sha256:cfe51f1660c62f4823c0f1d7a7fab6218c51227288632f08bdf95dd4b7bd6072
Deleted: sha256:b1e90cdb56f0feeb09920a280cff6efd4111e27879cd6bd399e0e3c2ef8dd8e8
Deleted: sha256:243a4107b9df516e01b6ed1ba73ba69c1f0d55210bac30c34cafc6c84b299ab9
Deleted: sha256:297c71ceb07fa71089f9dd595949bb01133f7d091ce465468dea96c409a19e14
Deleted: sha256:93c089dcced0638d2d82fa690d34d0fe1f368ae42e0caea0d1438a0989a62c53
Deleted: sha256:edd3c90fe8a2668436ec0a3cf04f7e4e6ebc1d404e9d81f391ec4a05a0f0059d
Deleted: sha256:d61c0944cc63ae81b8514251d1f562b47a7563863d51cd9d54fba97976ed058c
Deleted: sha256:7510d806bde245f66cabe4f0103e1ab6c0e474d8f6c14ecf8a4b0942da7d6250
Deleted: sha256:a0fed5ed51fc1413eb6f08a5eaf4181f60a9989c5cb872a74d83634a9796f336
Deleted: sha256:84b53561988065ff5d3227cc48bae9d51581145ca31f050cc0f91ba44d7ebc28
Deleted: sha256:984864aeb200b2b57810705b4f2e5c753bf8e1648a104aedabcada4c03ae4a45
Deleted: sha256:d64248d5f65460813166254e0efec2a43185d014aeb7f147d8f38754be2da000
Deleted: sha256:7e4bd71798f34daa347f3b664a231fbc0464f890e6d28c2bae213b90b193d80c
Deleted: sha256:a3822dc7bcfef7143025a5f103d30c1829fa3819ac5f62ba58ef69cf24fefc73
Deleted: sha256:46910d44d9c082b663f4704d3f6d299954c615315657a192fce5eb77dca63fcb
Deleted: sha256:f3615541cc9c921593ee7d42ed92ff73d31ac28bf48c6ced3f8dcc9560132583
Deleted: sha256:178e125f6e35f9e983af6f947a0d9e17e85b0c7c71f0b12253489f540fd78948
Deleted: sha256:3498754954e327e7e861b00e184dc754787f14a2cd8fc90ec70e1dcde032c05f
Build step 'Execute shell' marked build as failure

Mime
View raw message