mesos-builds mailing list archives

Site index · List index
Message view « Date » · « Thread »
Top « Date » · « Thread »
From Apache Jenkins Server <jenk...@builds.apache.org>
Subject Build failed in Jenkins: Mesos-Buildbot » autotools,clang,--verbose,GLOG_v=1 MESOS_VERBOSE=1,ubuntu:14.04,(ubuntu)&&(!ubuntu-us1)&&(!ubuntu-eu2) #3770
Date Tue, 06 Jun 2017 20:22:03 GMT
See <https://builds.apache.org/job/Mesos-Buildbot/BUILDTOOL=autotools,COMPILER=clang,CONFIGURATION=--verbose,ENVIRONMENT=GLOG_v=1%20MESOS_VERBOSE=1,OS=ubuntu%3A14.04,label_exp=(ubuntu)&&(!ubuntu-us1)&&(!ubuntu-eu2)/3770/display/redirect?page=changes>

Changes:

[xujyan] Cleaned up use of 'this' pointers in dispatched callback.

------------------------------------------
[...truncated 27.98 MB...]
[ RUN      ] Endpoint/SlaveEndpointTest.AuthorizedRequest/2
I0606 20:21:52.721135  2958 containerizer.cpp:230] Using isolation: posix/cpu,posix/mem,filesystem/posix,network/cni,environment_secret
W0606 20:21:52.721689  2958 backend.cpp:76] Failed to create 'aufs' backend: AufsBackend requires
root privileges
W0606 20:21:52.721835  2958 backend.cpp:76] Failed to create 'bind' backend: BindBackend requires
root privileges
I0606 20:21:52.721884  2958 provisioner.cpp:255] Using default backend 'copy'
I0606 20:21:52.726948  2984 slave.cpp:248] Mesos agent started on (756)@172.17.0.2:52124
I0606 20:21:52.727025  2984 slave.cpp:249] Flags at startup: --acls="" --appc_simple_discovery_uri_prefix="http://"
--appc_store_dir="/tmp/Endpoint_SlaveEndpointTest_AuthorizedRequest_2_10q0fL/store/appc" --authenticate_http_readonly="true"
--authenticate_http_readwrite="true" --authenticatee="crammd5" --authentication_backoff_factor="1secs"
--authorizer="local" --cgroups_cpu_enable_pids_and_tids_count="false" --cgroups_enable_cfs="false"
--cgroups_hierarchy="/sys/fs/cgroup" --cgroups_limit_swap="false" --cgroups_root="mesos" --container_disk_watch_interval="15secs"
--containerizers="mesos" --credential="/tmp/Endpoint_SlaveEndpointTest_AuthorizedRequest_2_10q0fL/credential"
--default_role="*" --disk_watch_interval="1mins" --docker="docker" --docker_kill_orphans="true"
--docker_registry="https://registry-1.docker.io" --docker_remove_delay="6hrs" --docker_socket="/var/run/docker.sock"
--docker_stop_timeout="0ns" --docker_store_dir="/tmp/Endpoint_SlaveEndpointTest_AuthorizedRequest_2_10q0fL/store/docker"
--docker_volume_checkpoint_dir="/var/run/mesos/isolators/docker/volume" --enforce_container_disk_quota="false"
--executor_registration_timeout="1mins" --executor_reregistration_timeout="2secs" --executor_shutdown_grace_period="5secs"
--fetcher_cache_dir="/tmp/Endpoint_SlaveEndpointTest_AuthorizedRequest_2_10q0fL/fetch" --fetcher_cache_size="2GB"
--frameworks_home="" --gc_delay="1weeks" --gc_disk_headroom="0.1" --hadoop_home="" --help="false"
--hostname_lookup="true" --http_command_executor="false" --http_credentials="/tmp/Endpoint_SlaveEndpointTest_AuthorizedRequest_2_10q0fL/http_credentials"
--http_heartbeat_interval="30secs" --initialize_driver_logging="true" --isolation="posix/cpu,posix/mem"
--launcher="posix" --launcher_dir="/mesos/mesos-1.4.0/_build/src" --logbufsecs="0" --logging_level="INFO"
--max_completed_executors_per_framework="150" --oversubscribed_resources_interval="15secs"
--perf_duration="10secs" --perf_interval="1mins" --port="5051" --qos_correction_interval_min="0ns"
--quiet="false" --recover="reconnect" --recovery_timeout="15mins" --registration_backoff_factor="10ms"
--resources="cpus:2;gpus:0;mem:1024;disk:1024;ports:[31000-32000]" --revocable_cpu_low_priority="true"
--runtime_dir="/tmp/Endpoint_SlaveEndpointTest_AuthorizedRequest_2_10q0fL" --sandbox_directory="/mnt/mesos/sandbox"
--strict="true" --switch_user="true" --systemd_enable_support="true" --systemd_runtime_directory="/run/systemd/system"
--version="false" --work_dir="/tmp/Endpoint_SlaveEndpointTest_AuthorizedRequest_2_FpQwnf"
I0606 20:21:52.727720  2984 credentials.hpp:86] Loading credential for authentication from
'/tmp/Endpoint_SlaveEndpointTest_AuthorizedRequest_2_10q0fL/credential'
I0606 20:21:52.728201  2984 slave.cpp:281] Agent using credential for: test-principal
I0606 20:21:52.728227  2984 credentials.hpp:37] Loading credentials for authentication from
'/tmp/Endpoint_SlaveEndpointTest_AuthorizedRequest_2_10q0fL/http_credentials'
I0606 20:21:52.728566  2984 http.cpp:975] Creating default 'basic' HTTP authenticator for
realm 'mesos-agent-readonly'
I0606 20:21:52.728780  2984 http.cpp:975] Creating default 'basic' HTTP authenticator for
realm 'mesos-agent-readwrite'
I0606 20:21:52.730060  2984 slave.cpp:552] Agent resources: cpus(*):2; mem(*):1024; disk(*):1024;
ports(*):[31000-32000]
I0606 20:21:52.730134  2984 slave.cpp:560] Agent attributes: [  ]
I0606 20:21:52.730159  2984 slave.cpp:565] Agent hostname: b5f0dc175ea8
I0606 20:21:52.730378  2986 status_update_manager.cpp:177] Pausing sending status updates
I0606 20:21:52.732050  2987 state.cpp:62] Recovering state from '/tmp/Endpoint_SlaveEndpointTest_AuthorizedRequest_2_FpQwnf/meta'
I0606 20:21:52.732551  2987 status_update_manager.cpp:203] Recovering status update manager
I0606 20:21:52.732753  2987 containerizer.cpp:582] Recovering containerizer
I0606 20:21:52.734302  2987 provisioner.cpp:416] Provisioner recovery complete
I0606 20:21:52.734728  2987 slave.cpp:6127] Finished recovery
I0606 20:21:52.735235  2987 slave.cpp:6309] Querying resource estimator for oversubscribable
resources
I0606 20:21:52.735788  2987 slave.cpp:6323] Received oversubscribable resources {} from the
resource estimator
I0606 20:21:52.739835  2989 process.cpp:3778] Handling HTTP event for process 'slave(756)'
with path: '/slave(756)/containers'
I0606 20:21:52.741739  2989 http.cpp:1115] HTTP GET for /slave(756)/containers from 172.17.0.2:52841
I0606 20:21:52.741819  2989 http.cpp:936] Authorizing principal 'test-principal' to GET the
'/containers' endpoint
I0606 20:21:52.746536  2958 slave.cpp:817] Agent terminating
[       OK ] Endpoint/SlaveEndpointTest.AuthorizedRequest/2 (38 ms)
[ RUN      ] Endpoint/SlaveEndpointTest.UnauthorizedRequest/0
I0606 20:21:52.759938  2958 containerizer.cpp:230] Using isolation: posix/cpu,posix/mem,filesystem/posix,network/cni,environment_secret
W0606 20:21:52.760692  2958 backend.cpp:76] Failed to create 'aufs' backend: AufsBackend requires
root privileges
W0606 20:21:52.760831  2958 backend.cpp:76] Failed to create 'bind' backend: BindBackend requires
root privileges
I0606 20:21:52.760877  2958 provisioner.cpp:255] Using default backend 'copy'
I0606 20:21:52.767431  2980 slave.cpp:248] Mesos agent started on (757)@172.17.0.2:52124
I0606 20:21:52.767678  2980 slave.cpp:249] Flags at startup: --acls="" --appc_simple_discovery_uri_prefix="http://"
--appc_store_dir="/tmp/Endpoint_SlaveEndpointTest_UnauthorizedRequest_0_L9y66O/store/appc"
--authenticate_http_readonly="true" --authenticate_http_readwrite="true" --authenticatee="crammd5"
--authentication_backoff_factor="1secs" --authorizer="local" --cgroups_cpu_enable_pids_and_tids_count="false"
--cgroups_enable_cfs="false" --cgroups_hierarchy="/sys/fs/cgroup" --cgroups_limit_swap="false"
--cgroups_root="mesos" --container_disk_watch_interval="15secs" --containerizers="mesos" --credential="/tmp/Endpoint_SlaveEndpointTest_UnauthorizedRequest_0_L9y66O/credential"
--default_role="*" --disk_watch_interval="1mins" --docker="docker" --docker_kill_orphans="true"
--docker_registry="https://registry-1.docker.io" --docker_remove_delay="6hrs" --docker_socket="/var/run/docker.sock"
--docker_stop_timeout="0ns" --docker_store_dir="/tmp/Endpoint_SlaveEndpointTest_UnauthorizedRequest_0_L9y66O/store/docker"
--docker_volume_checkpoint_dir="/var/run/mesos/isolators/docker/volume" --enforce_container_disk_quota="false"
--executor_registration_timeout="1mins" --executor_reregistration_timeout="2secs" --executor_shutdown_grace_period="5secs"
--fetcher_cache_dir="/tmp/Endpoint_SlaveEndpointTest_UnauthorizedRequest_0_L9y66O/fetch" --fetcher_cache_size="2GB"
--frameworks_home="" --gc_delay="1weeks" --gc_disk_headroom="0.1" --hadoop_home="" --help="false"
--hostname_lookup="true" --http_command_executor="false" --http_credentials="/tmp/Endpoint_SlaveEndpointTest_UnauthorizedRequest_0_L9y66O/http_credentials"
--http_heartbeat_interval="30secs" --initialize_driver_logging="true" --isolation="posix/cpu,posix/mem"
--launcher="posix" --launcher_dir="/mesos/mesos-1.4.0/_build/src" --logbufsecs="0" --logging_level="INFO"
--max_completed_executors_per_framework="150" --oversubscribed_resources_interval="15secs"
--perf_duration="10secs" --perf_interval="1mins" --port="5051" --qos_correction_interval_min="0ns"
--quiet="false" --recover="reconnect" --recovery_timeout="15mins" --registration_backoff_factor="10ms"
--resources="cpus:2;gpus:0;mem:1024;disk:1024;ports:[31000-32000]" --revocable_cpu_low_priority="true"
--runtime_dir="/tmp/Endpoint_SlaveEndpointTest_UnauthorizedRequest_0_L9y66O" --sandbox_directory="/mnt/mesos/sandbox"
--strict="true" --switch_user="true" --systemd_enable_support="true" --systemd_runtime_directory="/run/systemd/system"
--version="false" --work_dir="/tmp/Endpoint_SlaveEndpointTest_UnauthorizedRequest_0_Xv2k8i"
I0606 20:21:52.768333  2980 credentials.hpp:86] Loading credential for authentication from
'/tmp/Endpoint_SlaveEndpointTest_UnauthorizedRequest_0_L9y66O/credential'
I0606 20:21:52.768632  2980 slave.cpp:281] Agent using credential for: test-principal
I0606 20:21:52.768678  2980 credentials.hpp:37] Loading credentials for authentication from
'/tmp/Endpoint_SlaveEndpointTest_UnauthorizedRequest_0_L9y66O/http_credentials'
I0606 20:21:52.768991  2980 http.cpp:975] Creating default 'basic' HTTP authenticator for
realm 'mesos-agent-readonly'
I0606 20:21:52.769234  2980 http.cpp:975] Creating default 'basic' HTTP authenticator for
realm 'mesos-agent-readwrite'
I0606 20:21:52.770898  2980 slave.cpp:552] Agent resources: cpus(*):2; mem(*):1024; disk(*):1024;
ports(*):[31000-32000]
I0606 20:21:52.771111  2980 slave.cpp:560] Agent attributes: [  ]
I0606 20:21:52.771210  2980 slave.cpp:565] Agent hostname: b5f0dc175ea8
I0606 20:21:52.771520  2982 status_update_manager.cpp:177] Pausing sending status updates
I0606 20:21:52.773200  2990 state.cpp:62] Recovering state from '/tmp/Endpoint_SlaveEndpointTest_UnauthorizedRequest_0_Xv2k8i/meta'
I0606 20:21:52.773545  2985 status_update_manager.cpp:203] Recovering status update manager
I0606 20:21:52.773744  2985 containerizer.cpp:582] Recovering containerizer
I0606 20:21:52.775563  2985 provisioner.cpp:416] Provisioner recovery complete
I0606 20:21:52.776116  2986 slave.cpp:6127] Finished recovery
I0606 20:21:52.776785  2986 slave.cpp:6309] Querying resource estimator for oversubscribable
resources
I0606 20:21:52.777091  2982 slave.cpp:6323] Received oversubscribable resources {} from the
resource estimator
I0606 20:21:52.781034  2989 process.cpp:3778] Handling HTTP event for process 'slave(757)'
with path: '/slave(757)/monitor/statistics'
I0606 20:21:52.782910  2989 http.cpp:1115] HTTP GET for /slave(757)/monitor/statistics from
172.17.0.2:52842
I0606 20:21:52.782992  2989 http.cpp:936] Authorizing principal 'test-principal' to GET the
'/monitor/statistics' endpoint
I0606 20:21:52.785665  2987 slave.cpp:817] Agent terminating
[       OK ] Endpoint/SlaveEndpointTest.UnauthorizedRequest/0 (36 ms)
[ RUN      ] Endpoint/SlaveEndpointTest.UnauthorizedRequest/1
I0606 20:21:52.795513  2958 containerizer.cpp:230] Using isolation: posix/cpu,posix/mem,filesystem/posix,network/cni,environment_secret
W0606 20:21:52.796015  2958 backend.cpp:76] Failed to create 'aufs' backend: AufsBackend requires
root privileges
W0606 20:21:52.796123  2958 backend.cpp:76] Failed to create 'bind' backend: BindBackend requires
root privileges
I0606 20:21:52.796169  2958 provisioner.cpp:255] Using default backend 'copy'
I0606 20:21:52.799051  2978 slave.cpp:248] Mesos agent started on (758)@172.17.0.2:52124
I0606 20:21:52.799111  2978 slave.cpp:249] Flags at startup: --acls="" --appc_simple_discovery_uri_prefix="http://"
--appc_store_dir="/tmp/Endpoint_SlaveEndpointTest_UnauthorizedRequest_1_DfyJmT/store/appc"
--authenticate_http_readonly="true" --authenticate_http_readwrite="true" --authenticatee="crammd5"
--authentication_backoff_factor="1secs" --authorizer="local" --cgroups_cpu_enable_pids_and_tids_count="false"
--cgroups_enable_cfs="false" --cgroups_hierarchy="/sys/fs/cgroup" --cgroups_limit_swap="false"
--cgroups_root="mesos" --container_disk_watch_interval="15secs" --containerizers="mesos" --credential="/tmp/Endpoint_SlaveEndpointTest_UnauthorizedRequest_1_DfyJmT/credential"
--default_role="*" --disk_watch_interval="1mins" --docker="docker" --docker_kill_orphans="true"
--docker_registry="https://registry-1.docker.io" --docker_remove_delay="6hrs" --docker_socket="/var/run/docker.sock"
--docker_stop_timeout="0ns" --docker_store_dir="/tmp/Endpoint_SlaveEndpointTest_UnauthorizedRequest_1_DfyJmT/store/docker"
--docker_volume_checkpoint_dir="/var/run/mesos/isolators/docker/volume" --enforce_container_disk_quota="false"
--executor_registration_timeout="1mins" --executor_reregistration_timeout="2secs" --executor_shutdown_grace_period="5secs"
--fetcher_cache_dir="/tmp/Endpoint_SlaveEndpointTest_UnauthorizedRequest_1_DfyJmT/fetch" --fetcher_cache_size="2GB"
--frameworks_home="" --gc_delay="1weeks" --gc_disk_headroom="0.1" --hadoop_home="" --help="false"
--hostname_lookup="true" --http_command_executor="false" --http_credentials="/tmp/Endpoint_SlaveEndpointTest_UnauthorizedRequest_1_DfyJmT/http_credentials"
--http_heartbeat_interval="30secs" --initialize_driver_logging="true" --isolation="posix/cpu,posix/mem"
--launcher="posix" --launcher_dir="/mesos/mesos-1.4.0/_build/src" --logbufsecs="0" --logging_level="INFO"
--max_completed_executors_per_framework="150" --oversubscribed_resources_interval="15secs"
--perf_duration="10secs" --perf_interval="1mins" --port="5051" --qos_correction_interval_min="0ns"
--quiet="false" --recover="reconnect" --recovery_timeout="15mins" --registration_backoff_factor="10ms"
--resources="cpus:2;gpus:0;mem:1024;disk:1024;ports:[31000-32000]" --revocable_cpu_low_priority="true"
--runtime_dir="/tmp/Endpoint_SlaveEndpointTest_UnauthorizedRequest_1_DfyJmT" --sandbox_directory="/mnt/mesos/sandbox"
--strict="true" --switch_user="true" --systemd_enable_support="true" --systemd_runtime_directory="/run/systemd/system"
--version="false" --work_dir="/tmp/Endpoint_SlaveEndpointTest_UnauthorizedRequest_1_Dsr4hn"
I0606 20:21:52.799520  2978 credentials.hpp:86] Loading credential for authentication from
'/tmp/Endpoint_SlaveEndpointTest_UnauthorizedRequest_1_DfyJmT/credential'
I0606 20:21:52.799718  2978 slave.cpp:281] Agent using credential for: test-principal
I0606 20:21:52.799747  2978 credentials.hpp:37] Loading credentials for authentication from
'/tmp/Endpoint_SlaveEndpointTest_UnauthorizedRequest_1_DfyJmT/http_credentials'
I0606 20:21:52.800055  2978 http.cpp:975] Creating default 'basic' HTTP authenticator for
realm 'mesos-agent-readonly'
I0606 20:21:52.800262  2978 http.cpp:975] Creating default 'basic' HTTP authenticator for
realm 'mesos-agent-readwrite'
I0606 20:21:52.801535  2978 slave.cpp:552] Agent resources: cpus(*):2; mem(*):1024; disk(*):1024;
ports(*):[31000-32000]
I0606 20:21:52.801606  2978 slave.cpp:560] Agent attributes: [  ]
I0606 20:21:52.801626  2978 slave.cpp:565] Agent hostname: b5f0dc175ea8
I0606 20:21:52.801753  2986 status_update_manager.cpp:177] Pausing sending status updates
I0606 20:21:52.803210  2989 state.cpp:62] Recovering state from '/tmp/Endpoint_SlaveEndpointTest_UnauthorizedRequest_1_Dsr4hn/meta'
I0606 20:21:52.803447  2984 status_update_manager.cpp:203] Recovering status update manager
I0606 20:21:52.803791  2988 containerizer.cpp:582] Recovering containerizer
I0606 20:21:52.805117  2976 provisioner.cpp:416] Provisioner recovery complete
I0606 20:21:52.805464  2979 slave.cpp:6127] Finished recovery
I0606 20:21:52.805925  2979 slave.cpp:6309] Querying resource estimator for oversubscribable
resources
I0606 20:21:52.806161  2988 slave.cpp:6323] Received oversubscribable resources {} from the
resource estimator
I0606 20:21:52.808428  2989 process.cpp:3778] Handling HTTP event for process 'slave(758)'
with path: '/slave(758)/monitor/statistics.json'
I0606 20:21:52.809582  2979 http.cpp:1115] HTTP GET for /slave(758)/monitor/statistics.json
from 172.17.0.2:52843
I0606 20:21:52.809655  2979 http.cpp:936] Authorizing principal 'test-principal' to GET the
'/monitor/statistics.json' endpoint
I0606 20:21:52.811594  2982 slave.cpp:817] Agent terminating
[       OK ] Endpoint/SlaveEndpointTest.UnauthorizedRequest/1 (25 ms)
[ RUN      ] Endpoint/SlaveEndpointTest.UnauthorizedRequest/2
I0606 20:21:52.821647  2958 containerizer.cpp:230] Using isolation: posix/cpu,posix/mem,filesystem/posix,network/cni,environment_secret
W0606 20:21:52.822139  2958 backend.cpp:76] Failed to create 'aufs' backend: AufsBackend requires
root privileges
W0606 20:21:52.822263  2958 backend.cpp:76] Failed to create 'bind' backend: BindBackend requires
root privileges
I0606 20:21:52.822314  2958 provisioner.cpp:255] Using default backend 'copy'
I0606 20:21:52.825673  2988 slave.cpp:248] Mesos agent started on (759)@172.17.0.2:52124
I0606 20:21:52.825716  2988 slave.cpp:249] Flags at startup: --acls="" --appc_simple_discovery_uri_prefix="http://"
--appc_store_dir="/tmp/Endpoint_SlaveEndpointTest_UnauthorizedRequest_2_D1mLTX/store/appc"
--authenticate_http_readonly="true" --authenticate_http_readwrite="true" --authenticatee="crammd5"
--authentication_backoff_factor="1secs" --authorizer="local" --cgroups_cpu_enable_pids_and_tids_count="false"
--cgroups_enable_cfs="false" --cgroups_hierarchy="/sys/fs/cgroup" --cgroups_limit_swap="false"
--cgroups_root="mesos" --container_disk_watch_interval="15secs" --containerizers="mesos" --credential="/tmp/Endpoint_SlaveEndpointTest_UnauthorizedRequest_2_D1mLTX/credential"
--default_role="*" --disk_watch_interval="1mins" --docker="docker" --docker_kill_orphans="true"
--docker_registry="https://registry-1.docker.io" --docker_remove_delay="6hrs" --docker_socket="/var/run/docker.sock"
--docker_stop_timeout="0ns" --docker_store_dir="/tmp/Endpoint_SlaveEndpointTest_UnauthorizedRequest_2_D1mLTX/store/docker"
--docker_volume_checkpoint_dir="/var/run/mesos/isolators/docker/volume" --enforce_container_disk_quota="false"
--executor_registration_timeout="1mins" --executor_reregistration_timeout="2secs" --executor_shutdown_grace_period="5secs"
--fetcher_cache_dir="/tmp/Endpoint_SlaveEndpointTest_UnauthorizedRequest_2_D1mLTX/fetch" --fetcher_cache_size="2GB"
--frameworks_home="" --gc_delay="1weeks" --gc_disk_headroom="0.1" --hadoop_home="" --help="false"
--hostname_lookup="true" --http_command_executor="false" --http_credentials="/tmp/Endpoint_SlaveEndpointTest_UnauthorizedRequest_2_D1mLTX/http_credentials"
--http_heartbeat_interval="30secs" --initialize_driver_logging="true" --isolation="posix/cpu,posix/mem"
--launcher="posix" --launcher_dir="/mesos/mesos-1.4.0/_build/src" --logbufsecs="0" --logging_level="INFO"
--max_completed_executors_per_framework="150" --oversubscribed_resources_interval="15secs"
--perf_duration="10secs" --perf_interval="1mins" --port="5051" --qos_correction_interval_min="0ns"
--quiet="false" --recover="reconnect" --recovery_timeout="15mins" --registration_backoff_factor="10ms"
--resources="cpus:2;gpus:0;mem:1024;disk:1024;ports:[31000-32000]" --revocable_cpu_low_priority="true"
--runtime_dir="/tmp/Endpoint_SlaveEndpointTest_UnauthorizedRequest_2_D1mLTX" --sandbox_directory="/mnt/mesos/sandbox"
--strict="true" --switch_user="true" --systemd_enable_support="true" --systemd_runtime_directory="/run/systemd/system"
--version="false" --work_dir="/tmp/Endpoint_SlaveEndpointTest_UnauthorizedRequest_2_1tBSKr"
I0606 20:21:52.826143  2988 credentials.hpp:86] Loading credential for authentication from
'/tmp/Endpoint_SlaveEndpointTest_UnauthorizedRequest_2_D1mLTX/credential'
I0606 20:21:52.826311  2988 slave.cpp:281] Agent using credential for: test-principal
I0606 20:21:52.826344  2988 credentials.hpp:37] Loading credentials for authentication from
'/tmp/Endpoint_SlaveEndpointTest_UnauthorizedRequest_2_D1mLTX/http_credentials'
I0606 20:21:52.826606  2988 http.cpp:975] Creating default 'basic' HTTP authenticator for
realm 'mesos-agent-readonly'
I0606 20:21:52.826771  2988 http.cpp:975] Creating default 'basic' HTTP authenticator for
realm 'mesos-agent-readwrite'
I0606 20:21:52.828189  2988 slave.cpp:552] Agent resources: cpus(*):2; mem(*):1024; disk(*):1024;
ports(*):[31000-32000]
I0606 20:21:52.828266  2988 slave.cpp:560] Agent attributes: [  ]
I0606 20:21:52.828281  2988 slave.cpp:565] Agent hostname: b5f0dc175ea8
I0606 20:21:52.828418  2982 status_update_manager.cpp:177] Pausing sending status updates
I0606 20:21:52.829740  2977 state.cpp:62] Recovering state from '/tmp/Endpoint_SlaveEndpointTest_UnauthorizedRequest_2_1tBSKr/meta'
I0606 20:21:52.830021  2985 status_update_manager.cpp:203] Recovering status update manager
I0606 20:21:52.830298  2981 containerizer.cpp:582] Recovering containerizer
I0606 20:21:52.831701  2979 provisioner.cpp:416] Provisioner recovery complete
I0606 20:21:52.832206  2988 slave.cpp:6127] Finished recovery
I0606 20:21:52.832707  2988 slave.cpp:6309] Querying resource estimator for oversubscribable
resources
I0606 20:21:52.832957  2976 slave.cpp:6323] Received oversubscribable resources {} from the
resource estimator
I0606 20:21:52.835331  2991 process.cpp:3778] Handling HTTP event for process 'slave(759)'
with path: '/slave(759)/containers'
I0606 20:21:52.836778  2980 http.cpp:1115] HTTP GET for /slave(759)/containers from 172.17.0.2:52844
I0606 20:21:52.836889  2980 http.cpp:936] Authorizing principal 'test-principal' to GET the
'/containers' endpoint
I0606 20:21:52.839126  2985 slave.cpp:817] Agent terminating
[       OK ] Endpoint/SlaveEndpointTest.UnauthorizedRequest/2 (27 ms)
[ RUN      ] Endpoint/SlaveEndpointTest.NoAuthorizer/0
I0606 20:21:52.849092  2958 containerizer.cpp:230] Using isolation: posix/cpu,posix/mem,filesystem/posix,network/cni,environment_secret
W0606 20:21:52.849546  2958 backend.cpp:76] Failed to create 'aufs' backend: AufsBackend requires
root privileges
W0606 20:21:52.849653  2958 backend.cpp:76] Failed to create 'bind' backend: BindBackend requires
root privileges
I0606 20:21:52.849687  2958 provisioner.cpp:255] Using default backend 'copy'
I0606 20:21:52.851438  2958 cluster.cpp:448] Creating default 'local' authorizer
I0606 20:21:52.853427  2989 slave.cpp:248] Mesos agent started on (760)@172.17.0.2:52124
I0606 20:21:52.853480  2989 slave.cpp:249] Flags at startup: --acls="" --appc_simple_discovery_uri_prefix="http://"
--appc_store_dir="/tmp/Endpoint_SlaveEndpointTest_NoAuthorizer_0_r2uuI2/store/appc" --authenticate_http_readonly="true"
--authenticate_http_readwrite="true" --authenticatee="crammd5" --authentication_backoff_factor="1secs"
--authorizer="local" --cgroups_cpu_enable_pids_and_tids_count="false" --cgroups_enable_cfs="false"
--cgroups_hierarchy="/sys/fs/cgroup" --cgroups_limit_swap="false" --cgroups_root="mesos" --container_disk_watch_interval="15secs"
--containerizers="mesos" --credential="/tmp/Endpoint_SlaveEndpointTest_NoAuthorizer_0_r2uuI2/credential"
--default_role="*" --disk_watch_interval="1mins" --docker="docker" --docker_kill_orphans="true"
--docker_registry="https://registry-1.docker.io" --docker_remove_delay="6hrs" --docker_socket="/var/run/docker.sock"
--docker_stop_timeout="0ns" --docker_store_dir="/tmp/Endpoint_SlaveEndpointTest_NoAuthorizer_0_r2uuI2/store/docker"
--docker_volume_checkpoint_dir="/var/run/mesos/isolators/docker/volume" --enforce_container_disk_quota="false"
--executor_registration_timeout="1mins" --executor_reregistration_timeout="2secs" --executor_shutdown_grace_period="5secs"
--fetcher_cache_dir="/tmp/Endpoint_SlaveEndpointTest_NoAuthorizer_0_r2uuI2/fetch" --fetcher_cache_size="2GB"
--frameworks_home="" --gc_delay="1weeks" --gc_disk_headroom="0.1" --hadoop_home="" --help="false"
--hostname_lookup="true" --http_command_executor="false" --http_credentials="/tmp/Endpoint_SlaveEndpointTest_NoAuthorizer_0_r2uuI2/http_credentials"
--http_heartbeat_interval="30secs" --initialize_driver_logging="true" --isolation="posix/cpu,posix/mem"
--launcher="posix" --launcher_dir="/mesos/mesos-1.4.0/_build/src" --logbufsecs="0" --logging_level="INFO"
--max_completed_executors_per_framework="150" --oversubscribed_resources_interval="15secs"
--perf_duration="10secs" --perf_interval="1mins" --port="5051" --qos_correction_interval_min="0ns"
--quiet="false" --recover="reconnect" --recovery_timeout="15mins" --registration_backoff_factor="10ms"
--resources="cpus:2;gpus:0;mem:1024;disk:1024;ports:[31000-32000]" --revocable_cpu_low_priority="true"
--runtime_dir="/tmp/Endpoint_SlaveEndpointTest_NoAuthorizer_0_r2uuI2" --sandbox_directory="/mnt/mesos/sandbox"
--strict="true" --switch_user="true" --systemd_enable_support="true" --systemd_runtime_directory="/run/systemd/system"
--version="false" --work_dir="/tmp/Endpoint_SlaveEndpointTest_NoAuthorizer_0_DXbavw"
I0606 20:21:52.853935  2989 credentials.hpp:86] Loading credential for authentication from
'/tmp/Endpoint_SlaveEndpointTest_NoAuthorizer_0_r2uuI2/credential'
I0606 20:21:52.854141  2989 slave.cpp:281] Agent using credential for: test-principal
I0606 20:21:52.854176  2989 credentials.hpp:37] Loading credentials for authentication from
'/tmp/Endpoint_SlaveEndpointTest_NoAuthorizer_0_r2uuI2/http_credentials'
I0606 20:21:52.854416  2989 http.cpp:975] Creating default 'basic' HTTP authenticator for
realm 'mesos-agent-readonly'
I0606 20:21:52.854643  2989 http.cpp:975] Creating default 'basic' HTTP authenticator for
realm 'mesos-agent-readwrite'
I0606 20:21:52.855857  2989 slave.cpp:552] Agent resources: cpus(*):2; mem(*):1024; disk(*):1024;
ports(*):[31000-32000]
I0606 20:21:52.856073  2989 slave.cpp:560] Agent attributes: [  ]
I0606 20:21:52.856088  2989 slave.cpp:565] Agent hostname: b5f0dc175ea8
I0606 20:21:52.856221  2982 status_update_manager.cpp:177] Pausing sending status updates
I0606 20:21:52.857542  2987 state.cpp:62] Recovering state from '/tmp/Endpoint_SlaveEndpointTest_NoAuthorizer_0_DXbavw/meta'
I0606 20:21:52.857851  2976 status_update_manager.cpp:203] Recovering status update manager
I0606 20:21:52.858085  2988 containerizer.cpp:582] Recovering containerizer
I0606 20:21:52.859403  2979 provisioner.cpp:416] Provisioner recovery complete
I0606 20:21:52.859838  2983 slave.cpp:6127] Finished recovery
I0606 20:21:52.860460  2983 slave.cpp:6309] Querying resource estimator for oversubscribable
resources
I0606 20:21:52.860714  2988 slave.cpp:6323] Received oversubscribable resources {} from the
resource estimator
I0606 20:21:52.863275  2976 process.cpp:3778] Handling HTTP event for process 'slave(760)'
with path: '/slave(760)/monitor/statistics'
I0606 20:21:52.865267  2976 http.cpp:1115] HTTP GET for /slave(760)/monitor/statistics from
172.17.0.2:52845
I0606 20:21:52.865355  2976 http.cpp:936] Authorizing principal 'test-principal' to GET the
'/monitor/statistics' endpoint
I0606 20:21:52.870280  2958 slave.cpp:817] Agent terminating
[       OK ] Endpoint/SlaveEndpointTest.NoAuthorizer/0 (33 ms)
[ RUN      ] Endpoint/SlaveEndpointTest.NoAuthorizer/1
I0606 20:21:52.884351  2958 containerizer.cpp:230] Using isolation: posix/cpu,posix/mem,filesystem/posix,network/cni,environment_secret
W0606 20:21:52.885118  2958 backend.cpp:76] Failed to create 'aufs' backend: AufsBackend requires
root privileges
W0606 20:21:52.885375  2958 backend.cpp:76] Failed to create 'bind' backend: BindBackend requires
root privileges
I0606 20:21:52.885542  2958 provisioner.cpp:255] Using default backend 'copy'
I0606 20:21:52.887606  2958 cluster.cpp:448] Creating default 'local' authorizer
I0606 20:21:52.889441  2981 slave.cpp:248] Mesos agent started on (761)@172.17.0.2:52124
I0606 20:21:52.889493  2981 slave.cpp:249] Flags at startup: --acls="" --appc_simple_discovery_uri_prefix="http://"
--appc_store_dir="/tmp/Endpoint_SlaveEndpointTest_NoAuthorizer_1_VyGoS7/store/appc" --authenticate_http_readonly="true"
--authenticate_http_readwrite="true" --authenticatee="crammd5" --authentication_backoff_factor="1secs"
--authorizer="local" --cgroups_cpu_enable_pids_and_tids_count="false" --cgroups_enable_cfs="false"
--cgroups_hierarchy="/sys/fs/cgroup" --cgroups_limit_swap="false" --cgroups_root="mesos" --container_disk_watch_interval="15secs"
--containerizers="mesos" --credential="/tmp/Endpoint_SlaveEndpointTest_NoAuthorizer_1_VyGoS7/credential"
--default_role="*" --disk_watch_interval="1mins" --docker="docker" --docker_kill_orphans="true"
--docker_registry="https://registry-1.docker.io" --docker_remove_delay="6hrs" --docker_socket="/var/run/docker.sock"
--docker_stop_timeout="0ns" --docker_store_dir="/tmp/Endpoint_SlaveEndpointTest_NoAuthorizer_1_VyGoS7/store/docker"
--docker_volume_checkpoint_dir="/var/run/mesos/isolators/docker/volume" --enforce_container_disk_quota="false"
--executor_registration_timeout="1mins" --executor_reregistration_timeout="2secs" --executor_shutdown_grace_period="5secs"
--fetcher_cache_dir="/tmp/Endpoint_SlaveEndpointTest_NoAuthorizer_1_VyGoS7/fetch" --fetcher_cache_size="2GB"
--frameworks_home="" --gc_delay="1weeks" --gc_disk_headroom="0.1" --hadoop_home="" --help="false"
--hostname_lookup="true" --http_command_executor="false" --http_credentials="/tmp/Endpoint_SlaveEndpointTest_NoAuthorizer_1_VyGoS7/http_credentials"
--http_heartbeat_interval="30secs" --initialize_driver_logging="true" --isolation="posix/cpu,posix/mem"
--launcher="posix" --launcher_dir="/mesos/mesos-1.4.0/_build/src" --logbufsecs="0" --logging_level="INFO"
--max_completed_executors_per_framework="150" --oversubscribed_resources_interval="15secs"
--perf_duration="10secs" --perf_interval="1mins" --port="5051" --qos_correction_interval_min="0ns"
--quiet="false" --recover="reconnect" --recovery_timeout="15mins" --registration_backoff_factor="10ms"
--resources="cpus:2;gpus:0;mem:1024;disk:1024;ports:[31000-32000]" --revocable_cpu_low_priority="true"
--runtime_dir="/tmp/Endpoint_SlaveEndpointTest_NoAuthorizer_1_VyGoS7" --sandbox_directory="/mnt/mesos/sandbox"
--strict="true" --switch_user="true" --systemd_enable_support="true" --systemd_runtime_directory="/run/systemd/system"
--version="false" --work_dir="/tmp/Endpoint_SlaveEndpointTest_NoAuthorizer_1_7J0szB"
I0606 20:21:52.889982  2981 credentials.hpp:86] Loading credential for authentication from
'/tmp/Endpoint_SlaveEndpointTest_NoAuthorizer_1_VyGoS7/credential'
I0606 20:21:52.890202  2981 slave.cpp:281] Agent using credential for: test-principal
I0606 20:21:52.890228  2981 credentials.hpp:37] Loading credentials for authentication from
'/tmp/Endpoint_SlaveEndpointTest_NoAuthorizer_1_VyGoS7/http_credentials'
I0606 20:21:52.890547  2981 http.cpp:975] Creating default 'basic' HTTP authenticator for
realm 'mesos-agent-readonly'
I0606 20:21:52.890736  2981 http.cpp:975] Creating default 'basic' HTTP authenticator for
realm 'mesos-agent-readwrite'
I0606 20:21:52.892182  2981 slave.cpp:552] Agent resources: cpus(*):2; mem(*):1024; disk(*):1024;
ports(*):[31000-32000]
I0606 20:21:52.892279  2981 slave.cpp:560] Agent attributes: [  ]
I0606 20:21:52.892292  2981 slave.cpp:565] Agent hostname: b5f0dc175ea8
I0606 20:21:52.892477  2980 status_update_manager.cpp:177] Pausing sending status updates
I0606 20:21:52.893766  2985 state.cpp:62] Recovering state from '/tmp/Endpoint_SlaveEndpointTest_NoAuthorizer_1_7J0szB/meta'
I0606 20:21:52.894119  2986 status_update_manager.cpp:203] Recovering status update manager
I0606 20:21:52.894330  2979 containerizer.cpp:582] Recovering containerizer
I0606 20:21:52.895813  2980 provisioner.cpp:416] Provisioner recovery complete
I0606 20:21:52.896169  2991 slave.cpp:6127] Finished recovery
I0606 20:21:52.896672  2991 slave.cpp:6309] Querying resource estimator for oversubscribable
resources
I0606 20:21:52.896924  2987 slave.cpp:6323] Received oversubscribable resources {} from the
resource estimator
I0606 20:21:52.899986  2989 process.cpp:3778] Handling HTTP event for process 'slave(761)'
with path: '/slave(761)/monitor/statistics.json'
I0606 20:21:52.902681  2989 http.cpp:1115] HTTP GET for /slave(761)/monitor/statistics.json
from 172.17.0.2:52846
I0606 20:21:52.903040  2989 http.cpp:936] Authorizing principal 'test-principal' to GET the
'/monitor/statistics.json' endpoint
I0606 20:21:52.915839  2979 slave.cpp:817] Agent terminating
[       OK ] Endpoint/SlaveEndpointTest.NoAuthorizer/1 (44 ms)
[ RUN      ] Endpoint/SlaveEndpointTest.NoAuthorizer/2
I0606 20:21:52.927599  2958 containerizer.cpp:230] Using isolation: posix/cpu,posix/mem,filesystem/posix,network/cni,environment_secret
W0606 20:21:52.928184  2958 backend.cpp:76] Failed to create 'aufs' backend: AufsBackend requires
root privileges
W0606 20:21:52.928314  2958 backend.cpp:76] Failed to create 'bind' backend: BindBackend requires
root privileges
I0606 20:21:52.928359  2958 provisioner.cpp:255] Using default backend 'copy'
I0606 20:21:52.930047  2958 cluster.cpp:448] Creating default 'local' authorizer
I0606 20:21:52.931440  2983 slave.cpp:248] Mesos agent started on (762)@172.17.0.2:52124
I0606 20:21:52.931480  2983 slave.cpp:249] Flags at startup: --acls="" --appc_simple_discovery_uri_prefix="http://"
--appc_store_dir="/tmp/Endpoint_SlaveEndpointTest_NoAuthorizer_2_9unGtd/store/appc" --authenticate_http_readonly="true"
--authenticate_http_readwrite="true" --authenticatee="crammd5" --authentication_backoff_factor="1secs"
--authorizer="local" --cgroups_cpu_enable_pids_and_tids_count="false" --cgroups_enable_cfs="false"
--cgroups_hierarchy="/sys/fs/cgroup" --cgroups_limit_swap="false" --cgroups_root="mesos" --container_disk_watch_interval="15secs"
--containerizers="mesos" --credential="/tmp/Endpoint_SlaveEndpointTest_NoAuthorizer_2_9unGtd/credential"
--default_role="*" --disk_watch_interval="1mins" --docker="docker" --docker_kill_orphans="true"
--docker_registry="https://registry-1.docker.io" --docker_remove_delay="6hrs" --docker_socket="/var/run/docker.sock"
--docker_stop_timeout="0ns" --docker_store_dir="/tmp/Endpoint_SlaveEndpointTest_NoAuthorizer_2_9unGtd/store/docker"
--docker_volume_checkpoint_dir="/var/run/mesos/isolators/docker/volume" --enforce_container_disk_quota="false"
--executor_registration_timeout="1mins" --executor_reregistration_timeout="2secs" --executor_shutdown_grace_period="5secs"
--fetcher_cache_dir="/tmp/Endpoint_SlaveEndpointTest_NoAuthorizer_2_9unGtd/fetch" --fetcher_cache_size="2GB"
--frameworks_home="" --gc_delay="1weeks" --gc_disk_headroom="0.1" --hadoop_home="" --help="false"
--hostname_lookup="true" --http_command_executor="false" --http_credentials="/tmp/Endpoint_SlaveEndpointTest_NoAuthorizer_2_9unGtd/http_credentials"
--http_heartbeat_interval="30secs" --initialize_driver_logging="true" --isolation="posix/cpu,posix/mem"
--launcher="posix" --launcher_dir="/mesos/mesos-1.4.0/_build/src" --logbufsecs="0" --logging_level="INFO"
--max_completed_executors_per_framework="150" --oversubscribed_resources_interval="15secs"
--perf_duration="10secs" --perf_interval="1mins" --port="5051" --qos_correction_interval_min="0ns"
--quiet="false" --recover="reconnect" --recovery_timeout="15mins" --registration_backoff_factor="10ms"
--resources="cpus:2;gpus:0;mem:1024;disk:1024;ports:[31000-32000]" --revocable_cpu_low_priority="true"
--runtime_dir="/tmp/Endpoint_SlaveEndpointTest_NoAuthorizer_2_9unGtd" --sandbox_directory="/mnt/mesos/sandbox"
--strict="true" --switch_user="true" --systemd_enable_support="true" --systemd_runtime_directory="/run/systemd/system"
--version="false" --work_dir="/tmp/Endpoint_SlaveEndpointTest_NoAuthorizer_2_7DKC3G"
I0606 20:21:52.931957  2983 credentials.hpp:86] Loading credential for authentication from
'/tmp/Endpoint_SlaveEndpointTest_NoAuthorizer_2_9unGtd/credential'
I0606 20:21:52.932126  2983 slave.cpp:281] Agent using credential for: test-principal
I0606 20:21:52.932147  2983 credentials.hpp:37] Loading credentials for authentication from
'/tmp/Endpoint_SlaveEndpointTest_NoAuthorizer_2_9unGtd/http_credentials'
I0606 20:21:52.932363  2983 http.cpp:975] Creating default 'basic' HTTP authenticator for
realm 'mesos-agent-readonly'
I0606 20:21:52.932569  2983 http.cpp:975] Creating default 'basic' HTTP authenticator for
realm 'mesos-agent-readwrite'
I0606 20:21:52.933748  2983 slave.cpp:552] Agent resources: cpus(*):2; mem(*):1024; disk(*):1024;
ports(*):[31000-32000]
I0606 20:21:52.933815  2983 slave.cpp:560] Agent attributes: [  ]
I0606 20:21:52.933830  2983 slave.cpp:565] Agent hostname: b5f0dc175ea8
I0606 20:21:52.933977  2978 status_update_manager.cpp:177] Pausing sending status updates
I0606 20:21:52.935211  2990 state.cpp:62] Recovering state from '/tmp/Endpoint_SlaveEndpointTest_NoAuthorizer_2_7DKC3G/meta'
I0606 20:21:52.935535  2989 status_update_manager.cpp:203] Recovering status update manager
I0606 20:21:52.935717  2977 containerizer.cpp:582] Recovering containerizer
I0606 20:21:52.937145  2977 provisioner.cpp:416] Provisioner recovery complete
I0606 20:21:52.937598  2979 slave.cpp:6127] Finished recovery
I0606 20:21:52.938112  2979 slave.cpp:6309] Querying resource estimator for oversubscribable
resources
I0606 20:21:52.938376  2984 slave.cpp:6323] Received oversubscribable resources {} from the
resource estimator
I0606 20:21:52.941126  2983 process.cpp:3778] Handling HTTP event for process 'slave(762)'
with path: '/slave(762)/containers'
I0606 20:21:52.942370  2979 http.cpp:1115] HTTP GET for /slave(762)/containers from 172.17.0.2:52847
I0606 20:21:52.942445  2979 http.cpp:936] Authorizing principal 'test-principal' to GET the
'/containers' endpoint
I0606 20:21:52.946523  2984 slave.cpp:817] Agent terminating
[       OK ] Endpoint/SlaveEndpointTest.NoAuthorizer/2 (30 ms)
[----------] 9 tests from Endpoint/SlaveEndpointTest (297 ms total)

[----------] Global test environment tear-down
[==========] 1588 tests from 176 test cases ran. (500109 ms total)
[  PASSED  ] 1587 tests.
[  FAILED  ] 1 test, listed below:
[  FAILED  ] DiskQuotaTest.SlaveRecovery

 1 FAILED TEST
  YOU HAVE 22 DISABLED TESTS

E0606 20:21:53.009490  2992 process.cpp:968] Failed to accept socket: future discarded
make[4]: *** [check-local] Error 1
make[4]: Leaving directory `/mesos/mesos-1.4.0/_build/src'
make[3]: *** [check-am] Error 2
make[3]: Leaving directory `/mesos/mesos-1.4.0/_build/src'
make[2]: *** [check] Error 2
make[2]: Leaving directory `/mesos/mesos-1.4.0/_build/src'
make[1]: *** [check-recursive] Error 1
make[1]: Leaving directory `/mesos/mesos-1.4.0/_build'
make: *** [distcheck] Error 1
+ docker rmi mesos-1496777433-17224
Untagged: mesos-1496777433-17224:latest
Deleted: sha256:0e8ab5f97ae22b3b2565eef03869d87b853d991a3eb72b6c3b29c34ed191ae58
Deleted: sha256:f59a2a9c192c4ab54bade450abc66afcc98d5de00a339b63ad6898c4156128e3
Deleted: sha256:3a14d88ba53a52e5a2e6677401877485d35fd6ba9d24881a8a9a8ba895ab2925
Deleted: sha256:85559c86efcdb31a6d9c4b538d35358349574eccd5c1920fd6dfd8969ee43da4
Deleted: sha256:bc140e82fa2aadf3b57f76ce63ed376c15ea17ee9ccd0e1d9eb3966702b07142
Deleted: sha256:fdf9b79ffe99360c01e0e1f4ea26ec6f0bddc340088a75276a50dd01b8d5eb35
Deleted: sha256:7f98ed0781e35cf8a73f97130c490e4cab319f9d8a8bf89662300ac6263ef8ec
Deleted: sha256:607949dba921e9a086cefc6dcba33ec46680ea48a6d46fb929b4edf686b933b5
Deleted: sha256:3f7486814d99fd01e460d1cea89a51ea7e6f2e0e1a7933839dbd4132b4a53514
Deleted: sha256:20e9c1c1ab58b83d96fd9dd9769e39aaa1b9fb8965e648105a45728d52f47f9d
Deleted: sha256:67c190aba55b1e00d5c0fa23b22c4f011872d26ca359d345f488551be4aa4455
Deleted: sha256:2929348dc2122c69d59bdd8d1c03fb736d4b5138065d7001b0a94224ad779d09
Deleted: sha256:0e20703ae26358db20e25e8f3bf936baf50763ed4e29cb3fcce2520b4200183b
Deleted: sha256:3939570462617516d72e83801ccd1dc21f2967917adae15f5fb6fdb4aaf7ba40
Deleted: sha256:8c93fcf393e14a00b2b038d7f62d88da1a47a7d8080899b9bffa380413012d6b
Deleted: sha256:99d0e75bc53161b140de20b95725c688f116841b9654dcdf229fc5e57501d701
Deleted: sha256:75090c972645fd114b5c64af621f330912655e2747a125b7ea42071972b279be
Deleted: sha256:343584da64a6b0bd2b87308dac7bd4a19159e3c2e4c4d2302dc0435812d04e57
Deleted: sha256:74d07439d83713644366f83f675afceb3212f8ea232d11fc95deae8c38101f37
Deleted: sha256:ed1872acdb244e31dc12b6416c538eb86797224b4d54f72d3c23cdb56d27ab11
Deleted: sha256:35692378560436ca1739fcce24283b6c2552c8589dd2dbd69afa3e00e41ea8b6
Deleted: sha256:b4c0cf0cbbef2756e86b86867974f793ecf68a74bbafbed67e2c2ab5e29c8bd4
Deleted: sha256:e3beec6c6242a9c4173e73a038ebf386c963ad08ee05ac3ae093ea5779f00b60
Deleted: sha256:87dae27de51ccf1d610ef77d1841d50c1139930e133cc39a521d9cb4c14a0ee4
Build step 'Execute shell' marked build as failure
Not sending mail to unregistered user xujyan@apple.com
Not sending mail to unregistered user neil.conway@gmail.com

Mime
View raw message