mesos-builds mailing list archives

Site index · List index
Message view « Date » · « Thread »
Top « Date » · « Thread »
From Apache Jenkins Server <jenk...@builds.apache.org>
Subject Build failed in Jenkins: Mesos-Reviewbot #18406
Date Sun, 18 Jun 2017 23:14:16 GMT
See <https://builds.apache.org/job/Mesos-Reviewbot/18406/display/redirect?page=changes>

Changes:

[neil.conway] Used `Bytes` rather than `Megabytes` in two places.

------------------------------------------
[...truncated 28.54 MB...]
W0618 23:14:08.143000  4597 backend.cpp:76] Failed to create 'overlay' backend: OverlayBackend
requires root privileges
W0618 23:14:08.143201  4597 backend.cpp:76] Failed to create 'bind' backend: BindBackend requires
root privileges
I0618 23:14:08.143247  4597 provisioner.cpp:255] Using default backend 'copy'
I0618 23:14:08.148447  4621 slave.cpp:249] Mesos agent started on (764)@172.17.0.5:37083
I0618 23:14:08.148530  4621 slave.cpp:250] Flags at startup: --acls="" --appc_simple_discovery_uri_prefix="http://"
--appc_store_dir="/tmp/Endpoint_SlaveEndpointTest_AuthorizedRequest_2_jWFhLz/store/appc" --authenticate_http_readonly="true"
--authenticate_http_readwrite="true" --authenticatee="crammd5" --authentication_backoff_factor="1secs"
--authorizer="local" --cgroups_cpu_enable_pids_and_tids_count="false" --cgroups_enable_cfs="false"
--cgroups_hierarchy="/sys/fs/cgroup" --cgroups_limit_swap="false" --cgroups_root="mesos" --container_disk_watch_interval="15secs"
--containerizers="mesos" --credential="/tmp/Endpoint_SlaveEndpointTest_AuthorizedRequest_2_jWFhLz/credential"
--default_role="*" --disk_watch_interval="1mins" --docker="docker" --docker_kill_orphans="true"
--docker_registry="https://registry-1.docker.io" --docker_remove_delay="6hrs" --docker_socket="/var/run/docker.sock"
--docker_stop_timeout="0ns" --docker_store_dir="/tmp/Endpoint_SlaveEndpointTest_AuthorizedRequest_2_jWFhLz/store/docker"
--docker_volume_checkpoint_dir="/var/run/mesos/isolators/docker/volume" --enforce_container_disk_quota="false"
--executor_registration_timeout="1mins" --executor_reregistration_timeout="2secs" --executor_shutdown_grace_period="5secs"
--fetcher_cache_dir="/tmp/Endpoint_SlaveEndpointTest_AuthorizedRequest_2_jWFhLz/fetch" --fetcher_cache_size="2GB"
--frameworks_home="" --gc_delay="1weeks" --gc_disk_headroom="0.1" --hadoop_home="" --help="false"
--hostname_lookup="true" --http_command_executor="false" --http_credentials="/tmp/Endpoint_SlaveEndpointTest_AuthorizedRequest_2_jWFhLz/http_credentials"
--http_heartbeat_interval="30secs" --initialize_driver_logging="true" --isolation="posix/cpu,posix/mem"
--launcher="posix" --launcher_dir="/mesos/mesos-1.4.0/_build/src" --logbufsecs="0" --logging_level="INFO"
--max_completed_executors_per_framework="150" --oversubscribed_resources_interval="15secs"
--perf_duration="10secs" --perf_interval="1mins" --port="5051" --qos_correction_interval_min="0ns"
--quiet="false" --recover="reconnect" --recovery_timeout="15mins" --registration_backoff_factor="10ms"
--resources="cpus:2;gpus:0;mem:1024;disk:1024;ports:[31000-32000]" --revocable_cpu_low_priority="true"
--runtime_dir="/tmp/Endpoint_SlaveEndpointTest_AuthorizedRequest_2_jWFhLz" --sandbox_directory="/mnt/mesos/sandbox"
--strict="true" --switch_user="true" --systemd_enable_support="true" --systemd_runtime_directory="/run/systemd/system"
--version="false" --work_dir="/tmp/Endpoint_SlaveEndpointTest_AuthorizedRequest_2_K8rEXl"
I0618 23:14:08.149463  4621 credentials.hpp:86] Loading credential for authentication from
'/tmp/Endpoint_SlaveEndpointTest_AuthorizedRequest_2_jWFhLz/credential'
I0618 23:14:08.149929  4621 slave.cpp:282] Agent using credential for: test-principal
I0618 23:14:08.150037  4621 credentials.hpp:37] Loading credentials for authentication from
'/tmp/Endpoint_SlaveEndpointTest_AuthorizedRequest_2_jWFhLz/http_credentials'
I0618 23:14:08.150487  4621 http.cpp:975] Creating default 'basic' HTTP authenticator for
realm 'mesos-agent-readonly'
I0618 23:14:08.150921  4621 http.cpp:975] Creating default 'basic' HTTP authenticator for
realm 'mesos-agent-readwrite'
I0618 23:14:08.154942  4621 slave.cpp:553] Agent resources: cpus(*):2; mem(*):1024; disk(*):1024;
ports(*):[31000-32000]
I0618 23:14:08.155140  4621 slave.cpp:561] Agent attributes: [  ]
I0618 23:14:08.155382  4621 slave.cpp:566] Agent hostname: 47e1d16fd305
I0618 23:14:08.156020  4619 status_update_manager.cpp:177] Pausing sending status updates
I0618 23:14:08.159035  4621 state.cpp:62] Recovering state from '/tmp/Endpoint_SlaveEndpointTest_AuthorizedRequest_2_K8rEXl/meta'
I0618 23:14:08.160043  4619 status_update_manager.cpp:203] Recovering status update manager
I0618 23:14:08.160615  4622 containerizer.cpp:582] Recovering containerizer
I0618 23:14:08.164693  4619 provisioner.cpp:416] Provisioner recovery complete
I0618 23:14:08.166596  4622 slave.cpp:6128] Finished recovery
I0618 23:14:08.167421  4622 slave.cpp:6310] Querying resource estimator for oversubscribable
resources
I0618 23:14:08.167964  4617 slave.cpp:6324] Received oversubscribable resources {} from the
resource estimator
I0618 23:14:08.180745  4617 process.cpp:3779] Handling HTTP event for process 'slave(764)'
with path: '/slave(764)/containers'
I0618 23:14:08.183442  4616 http.cpp:1115] HTTP GET for /slave(764)/containers from 172.17.0.5:47346
I0618 23:14:08.183568  4616 http.cpp:936] Authorizing principal 'test-principal' to GET the
'/containers' endpoint
I0618 23:14:08.194555  4617 slave.cpp:818] Agent terminating
[       OK ] Endpoint/SlaveEndpointTest.AuthorizedRequest/2 (68 ms)
[ RUN      ] Endpoint/SlaveEndpointTest.UnauthorizedRequest/0
I0618 23:14:08.210646  4597 containerizer.cpp:230] Using isolation: posix/cpu,posix/mem,filesystem/posix,network/cni,environment_secret
W0618 23:14:08.211496  4597 backend.cpp:76] Failed to create 'overlay' backend: OverlayBackend
requires root privileges
W0618 23:14:08.211680  4597 backend.cpp:76] Failed to create 'bind' backend: BindBackend requires
root privileges
I0618 23:14:08.211725  4597 provisioner.cpp:255] Using default backend 'copy'
I0618 23:14:08.225333  4623 slave.cpp:249] Mesos agent started on (765)@172.17.0.5:37083
I0618 23:14:08.225381  4623 slave.cpp:250] Flags at startup: --acls="" --appc_simple_discovery_uri_prefix="http://"
--appc_store_dir="/tmp/Endpoint_SlaveEndpointTest_UnauthorizedRequest_0_dlrqzt/store/appc"
--authenticate_http_readonly="true" --authenticate_http_readwrite="true" --authenticatee="crammd5"
--authentication_backoff_factor="1secs" --authorizer="local" --cgroups_cpu_enable_pids_and_tids_count="false"
--cgroups_enable_cfs="false" --cgroups_hierarchy="/sys/fs/cgroup" --cgroups_limit_swap="false"
--cgroups_root="mesos" --container_disk_watch_interval="15secs" --containerizers="mesos" --credential="/tmp/Endpoint_SlaveEndpointTest_UnauthorizedRequest_0_dlrqzt/credential"
--default_role="*" --disk_watch_interval="1mins" --docker="docker" --docker_kill_orphans="true"
--docker_registry="https://registry-1.docker.io" --docker_remove_delay="6hrs" --docker_socket="/var/run/docker.sock"
--docker_stop_timeout="0ns" --docker_store_dir="/tmp/Endpoint_SlaveEndpointTest_UnauthorizedRequest_0_dlrqzt/store/docker"
--docker_volume_checkpoint_dir="/var/run/mesos/isolators/docker/volume" --enforce_container_disk_quota="false"
--executor_registration_timeout="1mins" --executor_reregistration_timeout="2secs" --executor_shutdown_grace_period="5secs"
--fetcher_cache_dir="/tmp/Endpoint_SlaveEndpointTest_UnauthorizedRequest_0_dlrqzt/fetch" --fetcher_cache_size="2GB"
--frameworks_home="" --gc_delay="1weeks" --gc_disk_headroom="0.1" --hadoop_home="" --help="false"
--hostname_lookup="true" --http_command_executor="false" --http_credentials="/tmp/Endpoint_SlaveEndpointTest_UnauthorizedRequest_0_dlrqzt/http_credentials"
--http_heartbeat_interval="30secs" --initialize_driver_logging="true" --isolation="posix/cpu,posix/mem"
--launcher="posix" --launcher_dir="/mesos/mesos-1.4.0/_build/src" --logbufsecs="0" --logging_level="INFO"
--max_completed_executors_per_framework="150" --oversubscribed_resources_interval="15secs"
--perf_duration="10secs" --perf_interval="1mins" --port="5051" --qos_correction_interval_min="0ns"
--quiet="false" --recover="reconnect" --recovery_timeout="15mins" --registration_backoff_factor="10ms"
--resources="cpus:2;gpus:0;mem:1024;disk:1024;ports:[31000-32000]" --revocable_cpu_low_priority="true"
--runtime_dir="/tmp/Endpoint_SlaveEndpointTest_UnauthorizedRequest_0_dlrqzt" --sandbox_directory="/mnt/mesos/sandbox"
--strict="true" --switch_user="true" --systemd_enable_support="true" --systemd_runtime_directory="/run/systemd/system"
--version="false" --work_dir="/tmp/Endpoint_SlaveEndpointTest_UnauthorizedRequest_0_qIsFAf"
I0618 23:14:08.226588  4623 credentials.hpp:86] Loading credential for authentication from
'/tmp/Endpoint_SlaveEndpointTest_UnauthorizedRequest_0_dlrqzt/credential'
I0618 23:14:08.227097  4623 slave.cpp:282] Agent using credential for: test-principal
I0618 23:14:08.227136  4623 credentials.hpp:37] Loading credentials for authentication from
'/tmp/Endpoint_SlaveEndpointTest_UnauthorizedRequest_0_dlrqzt/http_credentials'
I0618 23:14:08.227736  4623 http.cpp:975] Creating default 'basic' HTTP authenticator for
realm 'mesos-agent-readonly'
I0618 23:14:08.228263  4623 http.cpp:975] Creating default 'basic' HTTP authenticator for
realm 'mesos-agent-readwrite'
I0618 23:14:08.230947  4623 slave.cpp:553] Agent resources: cpus(*):2; mem(*):1024; disk(*):1024;
ports(*):[31000-32000]
I0618 23:14:08.231103  4623 slave.cpp:561] Agent attributes: [  ]
I0618 23:14:08.231124  4623 slave.cpp:566] Agent hostname: 47e1d16fd305
I0618 23:14:08.231856  4617 status_update_manager.cpp:177] Pausing sending status updates
I0618 23:14:08.234195  4619 state.cpp:62] Recovering state from '/tmp/Endpoint_SlaveEndpointTest_UnauthorizedRequest_0_qIsFAf/meta'
I0618 23:14:08.234936  4616 status_update_manager.cpp:203] Recovering status update manager
I0618 23:14:08.235357  4619 containerizer.cpp:582] Recovering containerizer
I0618 23:14:08.237952  4617 provisioner.cpp:416] Provisioner recovery complete
I0618 23:14:08.239154  4617 slave.cpp:6128] Finished recovery
I0618 23:14:08.240571  4617 slave.cpp:6310] Querying resource estimator for oversubscribable
resources
I0618 23:14:08.241583  4617 slave.cpp:6324] Received oversubscribable resources {} from the
resource estimator
I0618 23:14:08.256239  4622 process.cpp:3779] Handling HTTP event for process 'slave(765)'
with path: '/slave(765)/monitor/statistics'
I0618 23:14:08.258805  4623 http.cpp:1115] HTTP GET for /slave(765)/monitor/statistics from
172.17.0.5:47348
I0618 23:14:08.258958  4623 http.cpp:936] Authorizing principal 'test-principal' to GET the
'/monitor/statistics' endpoint
I0618 23:14:08.269779  4597 slave.cpp:818] Agent terminating
[       OK ] Endpoint/SlaveEndpointTest.UnauthorizedRequest/0 (73 ms)
[ RUN      ] Endpoint/SlaveEndpointTest.UnauthorizedRequest/1
I0618 23:14:08.284759  4597 containerizer.cpp:230] Using isolation: posix/cpu,posix/mem,filesystem/posix,network/cni,environment_secret
W0618 23:14:08.285554  4597 backend.cpp:76] Failed to create 'overlay' backend: OverlayBackend
requires root privileges
W0618 23:14:08.285737  4597 backend.cpp:76] Failed to create 'bind' backend: BindBackend requires
root privileges
I0618 23:14:08.285779  4597 provisioner.cpp:255] Using default backend 'copy'
I0618 23:14:08.290585  4618 slave.cpp:249] Mesos agent started on (766)@172.17.0.5:37083
I0618 23:14:08.290627  4618 slave.cpp:250] Flags at startup: --acls="" --appc_simple_discovery_uri_prefix="http://"
--appc_store_dir="/tmp/Endpoint_SlaveEndpointTest_UnauthorizedRequest_1_b4vk9n/store/appc"
--authenticate_http_readonly="true" --authenticate_http_readwrite="true" --authenticatee="crammd5"
--authentication_backoff_factor="1secs" --authorizer="local" --cgroups_cpu_enable_pids_and_tids_count="false"
--cgroups_enable_cfs="false" --cgroups_hierarchy="/sys/fs/cgroup" --cgroups_limit_swap="false"
--cgroups_root="mesos" --container_disk_watch_interval="15secs" --containerizers="mesos" --credential="/tmp/Endpoint_SlaveEndpointTest_UnauthorizedRequest_1_b4vk9n/credential"
--default_role="*" --disk_watch_interval="1mins" --docker="docker" --docker_kill_orphans="true"
--docker_registry="https://registry-1.docker.io" --docker_remove_delay="6hrs" --docker_socket="/var/run/docker.sock"
--docker_stop_timeout="0ns" --docker_store_dir="/tmp/Endpoint_SlaveEndpointTest_UnauthorizedRequest_1_b4vk9n/store/docker"
--docker_volume_checkpoint_dir="/var/run/mesos/isolators/docker/volume" --enforce_container_disk_quota="false"
--executor_registration_timeout="1mins" --executor_reregistration_timeout="2secs" --executor_shutdown_grace_period="5secs"
--fetcher_cache_dir="/tmp/Endpoint_SlaveEndpointTest_UnauthorizedRequest_1_b4vk9n/fetch" --fetcher_cache_size="2GB"
--frameworks_home="" --gc_delay="1weeks" --gc_disk_headroom="0.1" --hadoop_home="" --help="false"
--hostname_lookup="true" --http_command_executor="false" --http_credentials="/tmp/Endpoint_SlaveEndpointTest_UnauthorizedRequest_1_b4vk9n/http_credentials"
--http_heartbeat_interval="30secs" --initialize_driver_logging="true" --isolation="posix/cpu,posix/mem"
--launcher="posix" --launcher_dir="/mesos/mesos-1.4.0/_build/src" --logbufsecs="0" --logging_level="INFO"
--max_completed_executors_per_framework="150" --oversubscribed_resources_interval="15secs"
--perf_duration="10secs" --perf_interval="1mins" --port="5051" --qos_correction_interval_min="0ns"
--quiet="false" --recover="reconnect" --recovery_timeout="15mins" --registration_backoff_factor="10ms"
--resources="cpus:2;gpus:0;mem:1024;disk:1024;ports:[31000-32000]" --revocable_cpu_low_priority="true"
--runtime_dir="/tmp/Endpoint_SlaveEndpointTest_UnauthorizedRequest_1_b4vk9n" --sandbox_directory="/mnt/mesos/sandbox"
--strict="true" --switch_user="true" --systemd_enable_support="true" --systemd_runtime_directory="/run/systemd/system"
--version="false" --work_dir="/tmp/Endpoint_SlaveEndpointTest_UnauthorizedRequest_1_aYHAY9"
I0618 23:14:08.291326  4618 credentials.hpp:86] Loading credential for authentication from
'/tmp/Endpoint_SlaveEndpointTest_UnauthorizedRequest_1_b4vk9n/credential'
I0618 23:14:08.291581  4618 slave.cpp:282] Agent using credential for: test-principal
I0618 23:14:08.291604  4618 credentials.hpp:37] Loading credentials for authentication from
'/tmp/Endpoint_SlaveEndpointTest_UnauthorizedRequest_1_b4vk9n/http_credentials'
I0618 23:14:08.291949  4618 http.cpp:975] Creating default 'basic' HTTP authenticator for
realm 'mesos-agent-readonly'
I0618 23:14:08.292166  4618 http.cpp:975] Creating default 'basic' HTTP authenticator for
realm 'mesos-agent-readwrite'
I0618 23:14:08.294275  4618 slave.cpp:553] Agent resources: cpus(*):2; mem(*):1024; disk(*):1024;
ports(*):[31000-32000]
I0618 23:14:08.294425  4618 slave.cpp:561] Agent attributes: [  ]
I0618 23:14:08.294445  4618 slave.cpp:566] Agent hostname: 47e1d16fd305
I0618 23:14:08.294724  4622 status_update_manager.cpp:177] Pausing sending status updates
I0618 23:14:08.296465  4617 state.cpp:62] Recovering state from '/tmp/Endpoint_SlaveEndpointTest_UnauthorizedRequest_1_aYHAY9/meta'
I0618 23:14:08.296988  4622 status_update_manager.cpp:203] Recovering status update manager
I0618 23:14:08.297606  4619 containerizer.cpp:582] Recovering containerizer
I0618 23:14:08.300117  4618 provisioner.cpp:416] Provisioner recovery complete
I0618 23:14:08.300911  4618 slave.cpp:6128] Finished recovery
I0618 23:14:08.301508  4618 slave.cpp:6310] Querying resource estimator for oversubscribable
resources
I0618 23:14:08.301908  4618 slave.cpp:6324] Received oversubscribable resources {} from the
resource estimator
I0618 23:14:08.306915  4618 process.cpp:3779] Handling HTTP event for process 'slave(766)'
with path: '/slave(766)/monitor/statistics.json'
I0618 23:14:08.308750  4619 http.cpp:1115] HTTP GET for /slave(766)/monitor/statistics.json
from 172.17.0.5:47350
I0618 23:14:08.309026  4619 http.cpp:936] Authorizing principal 'test-principal' to GET the
'/monitor/statistics.json' endpoint
I0618 23:14:08.316054  4617 slave.cpp:818] Agent terminating
[       OK ] Endpoint/SlaveEndpointTest.UnauthorizedRequest/1 (45 ms)
[ RUN      ] Endpoint/SlaveEndpointTest.UnauthorizedRequest/2
I0618 23:14:08.331266  4597 containerizer.cpp:230] Using isolation: posix/cpu,posix/mem,filesystem/posix,network/cni,environment_secret
W0618 23:14:08.332065  4597 backend.cpp:76] Failed to create 'overlay' backend: OverlayBackend
requires root privileges
W0618 23:14:08.332247  4597 backend.cpp:76] Failed to create 'bind' backend: BindBackend requires
root privileges
I0618 23:14:08.332289  4597 provisioner.cpp:255] Using default backend 'copy'
I0618 23:14:08.337863  4616 slave.cpp:249] Mesos agent started on (767)@172.17.0.5:37083
I0618 23:14:08.337908  4616 slave.cpp:250] Flags at startup: --acls="" --appc_simple_discovery_uri_prefix="http://"
--appc_store_dir="/tmp/Endpoint_SlaveEndpointTest_UnauthorizedRequest_2_DmFEfj/store/appc"
--authenticate_http_readonly="true" --authenticate_http_readwrite="true" --authenticatee="crammd5"
--authentication_backoff_factor="1secs" --authorizer="local" --cgroups_cpu_enable_pids_and_tids_count="false"
--cgroups_enable_cfs="false" --cgroups_hierarchy="/sys/fs/cgroup" --cgroups_limit_swap="false"
--cgroups_root="mesos" --container_disk_watch_interval="15secs" --containerizers="mesos" --credential="/tmp/Endpoint_SlaveEndpointTest_UnauthorizedRequest_2_DmFEfj/credential"
--default_role="*" --disk_watch_interval="1mins" --docker="docker" --docker_kill_orphans="true"
--docker_registry="https://registry-1.docker.io" --docker_remove_delay="6hrs" --docker_socket="/var/run/docker.sock"
--docker_stop_timeout="0ns" --docker_store_dir="/tmp/Endpoint_SlaveEndpointTest_UnauthorizedRequest_2_DmFEfj/store/docker"
--docker_volume_checkpoint_dir="/var/run/mesos/isolators/docker/volume" --enforce_container_disk_quota="false"
--executor_registration_timeout="1mins" --executor_reregistration_timeout="2secs" --executor_shutdown_grace_period="5secs"
--fetcher_cache_dir="/tmp/Endpoint_SlaveEndpointTest_UnauthorizedRequest_2_DmFEfj/fetch" --fetcher_cache_size="2GB"
--frameworks_home="" --gc_delay="1weeks" --gc_disk_headroom="0.1" --hadoop_home="" --help="false"
--hostname_lookup="true" --http_command_executor="false" --http_credentials="/tmp/Endpoint_SlaveEndpointTest_UnauthorizedRequest_2_DmFEfj/http_credentials"
--http_heartbeat_interval="30secs" --initialize_driver_logging="true" --isolation="posix/cpu,posix/mem"
--launcher="posix" --launcher_dir="/mesos/mesos-1.4.0/_build/src" --logbufsecs="0" --logging_level="INFO"
--max_completed_executors_per_framework="150" --oversubscribed_resources_interval="15secs"
--perf_duration="10secs" --perf_interval="1mins" --port="5051" --qos_correction_interval_min="0ns"
--quiet="false" --recover="reconnect" --recovery_timeout="15mins" --registration_backoff_factor="10ms"
--resources="cpus:2;gpus:0;mem:1024;disk:1024;ports:[31000-32000]" --revocable_cpu_low_priority="true"
--runtime_dir="/tmp/Endpoint_SlaveEndpointTest_UnauthorizedRequest_2_DmFEfj" --sandbox_directory="/mnt/mesos/sandbox"
--strict="true" --switch_user="true" --systemd_enable_support="true" --systemd_runtime_directory="/run/systemd/system"
--version="false" --work_dir="/tmp/Endpoint_SlaveEndpointTest_UnauthorizedRequest_2_ETqpX4"
I0618 23:14:08.338862  4616 credentials.hpp:86] Loading credential for authentication from
'/tmp/Endpoint_SlaveEndpointTest_UnauthorizedRequest_2_DmFEfj/credential'
I0618 23:14:08.339457  4616 slave.cpp:282] Agent using credential for: test-principal
I0618 23:14:08.339496  4616 credentials.hpp:37] Loading credentials for authentication from
'/tmp/Endpoint_SlaveEndpointTest_UnauthorizedRequest_2_DmFEfj/http_credentials'
I0618 23:14:08.340155  4616 http.cpp:975] Creating default 'basic' HTTP authenticator for
realm 'mesos-agent-readonly'
I0618 23:14:08.340653  4616 http.cpp:975] Creating default 'basic' HTTP authenticator for
realm 'mesos-agent-readwrite'
I0618 23:14:08.343137  4616 slave.cpp:553] Agent resources: cpus(*):2; mem(*):1024; disk(*):1024;
ports(*):[31000-32000]
I0618 23:14:08.343288  4616 slave.cpp:561] Agent attributes: [  ]
I0618 23:14:08.343308  4616 slave.cpp:566] Agent hostname: 47e1d16fd305
I0618 23:14:08.343881  4619 status_update_manager.cpp:177] Pausing sending status updates
I0618 23:14:08.346289  4616 state.cpp:62] Recovering state from '/tmp/Endpoint_SlaveEndpointTest_UnauthorizedRequest_2_ETqpX4/meta'
I0618 23:14:08.347208  4621 status_update_manager.cpp:203] Recovering status update manager
I0618 23:14:08.347723  4621 containerizer.cpp:582] Recovering containerizer
I0618 23:14:08.349773  4622 provisioner.cpp:416] Provisioner recovery complete
I0618 23:14:08.350597  4620 slave.cpp:6128] Finished recovery
I0618 23:14:08.351850  4620 slave.cpp:6310] Querying resource estimator for oversubscribable
resources
I0618 23:14:08.352646  4623 slave.cpp:6324] Received oversubscribable resources {} from the
resource estimator
I0618 23:14:08.357420  4621 process.cpp:3779] Handling HTTP event for process 'slave(767)'
with path: '/slave(767)/containers'
I0618 23:14:08.359732  4620 http.cpp:1115] HTTP GET for /slave(767)/containers from 172.17.0.5:47352
I0618 23:14:08.360220  4620 http.cpp:936] Authorizing principal 'test-principal' to GET the
'/containers' endpoint
I0618 23:14:08.364719  4619 slave.cpp:818] Agent terminating
[       OK ] Endpoint/SlaveEndpointTest.UnauthorizedRequest/2 (49 ms)
[ RUN      ] Endpoint/SlaveEndpointTest.NoAuthorizer/0
I0618 23:14:08.380564  4597 containerizer.cpp:230] Using isolation: posix/cpu,posix/mem,filesystem/posix,network/cni,environment_secret
W0618 23:14:08.381359  4597 backend.cpp:76] Failed to create 'overlay' backend: OverlayBackend
requires root privileges
W0618 23:14:08.381541  4597 backend.cpp:76] Failed to create 'bind' backend: BindBackend requires
root privileges
I0618 23:14:08.381584  4597 provisioner.cpp:255] Using default backend 'copy'
I0618 23:14:08.384331  4597 cluster.cpp:448] Creating default 'local' authorizer
I0618 23:14:08.387080  4618 slave.cpp:249] Mesos agent started on (768)@172.17.0.5:37083
I0618 23:14:08.387125  4618 slave.cpp:250] Flags at startup: --acls="" --appc_simple_discovery_uri_prefix="http://"
--appc_store_dir="/tmp/Endpoint_SlaveEndpointTest_NoAuthorizer_0_t99WRe/store/appc" --authenticate_http_readonly="true"
--authenticate_http_readwrite="true" --authenticatee="crammd5" --authentication_backoff_factor="1secs"
--authorizer="local" --cgroups_cpu_enable_pids_and_tids_count="false" --cgroups_enable_cfs="false"
--cgroups_hierarchy="/sys/fs/cgroup" --cgroups_limit_swap="false" --cgroups_root="mesos" --container_disk_watch_interval="15secs"
--containerizers="mesos" --credential="/tmp/Endpoint_SlaveEndpointTest_NoAuthorizer_0_t99WRe/credential"
--default_role="*" --disk_watch_interval="1mins" --docker="docker" --docker_kill_orphans="true"
--docker_registry="https://registry-1.docker.io" --docker_remove_delay="6hrs" --docker_socket="/var/run/docker.sock"
--docker_stop_timeout="0ns" --docker_store_dir="/tmp/Endpoint_SlaveEndpointTest_NoAuthorizer_0_t99WRe/store/docker"
--docker_volume_checkpoint_dir="/var/run/mesos/isolators/docker/volume" --enforce_container_disk_quota="false"
--executor_registration_timeout="1mins" --executor_reregistration_timeout="2secs" --executor_shutdown_grace_period="5secs"
--fetcher_cache_dir="/tmp/Endpoint_SlaveEndpointTest_NoAuthorizer_0_t99WRe/fetch" --fetcher_cache_size="2GB"
--frameworks_home="" --gc_delay="1weeks" --gc_disk_headroom="0.1" --hadoop_home="" --help="false"
--hostname_lookup="true" --http_command_executor="false" --http_credentials="/tmp/Endpoint_SlaveEndpointTest_NoAuthorizer_0_t99WRe/http_credentials"
--http_heartbeat_interval="30secs" --initialize_driver_logging="true" --isolation="posix/cpu,posix/mem"
--launcher="posix" --launcher_dir="/mesos/mesos-1.4.0/_build/src" --logbufsecs="0" --logging_level="INFO"
--max_completed_executors_per_framework="150" --oversubscribed_resources_interval="15secs"
--perf_duration="10secs" --perf_interval="1mins" --port="5051" --qos_correction_interval_min="0ns"
--quiet="false" --recover="reconnect" --recovery_timeout="15mins" --registration_backoff_factor="10ms"
--resources="cpus:2;gpus:0;mem:1024;disk:1024;ports:[31000-32000]" --revocable_cpu_low_priority="true"
--runtime_dir="/tmp/Endpoint_SlaveEndpointTest_NoAuthorizer_0_t99WRe" --sandbox_directory="/mnt/mesos/sandbox"
--strict="true" --switch_user="true" --systemd_enable_support="true" --systemd_runtime_directory="/run/systemd/system"
--version="false" --work_dir="/tmp/Endpoint_SlaveEndpointTest_NoAuthorizer_0_U1jLr0"
I0618 23:14:08.387861  4618 credentials.hpp:86] Loading credential for authentication from
'/tmp/Endpoint_SlaveEndpointTest_NoAuthorizer_0_t99WRe/credential'
I0618 23:14:08.388149  4618 slave.cpp:282] Agent using credential for: test-principal
I0618 23:14:08.388185  4618 credentials.hpp:37] Loading credentials for authentication from
'/tmp/Endpoint_SlaveEndpointTest_NoAuthorizer_0_t99WRe/http_credentials'
I0618 23:14:08.388599  4618 http.cpp:975] Creating default 'basic' HTTP authenticator for
realm 'mesos-agent-readonly'
I0618 23:14:08.388864  4618 http.cpp:975] Creating default 'basic' HTTP authenticator for
realm 'mesos-agent-readwrite'
I0618 23:14:08.391218  4618 slave.cpp:553] Agent resources: cpus(*):2; mem(*):1024; disk(*):1024;
ports(*):[31000-32000]
I0618 23:14:08.391377  4618 slave.cpp:561] Agent attributes: [  ]
I0618 23:14:08.391400  4618 slave.cpp:566] Agent hostname: 47e1d16fd305
I0618 23:14:08.391765  4622 status_update_manager.cpp:177] Pausing sending status updates
I0618 23:14:08.393652  4619 state.cpp:62] Recovering state from '/tmp/Endpoint_SlaveEndpointTest_NoAuthorizer_0_U1jLr0/meta'
I0618 23:14:08.394278  4623 status_update_manager.cpp:203] Recovering status update manager
I0618 23:14:08.394901  4620 containerizer.cpp:582] Recovering containerizer
I0618 23:14:08.397255  4618 provisioner.cpp:416] Provisioner recovery complete
I0618 23:14:08.398128  4622 slave.cpp:6128] Finished recovery
I0618 23:14:08.398988  4622 slave.cpp:6310] Querying resource estimator for oversubscribable
resources
I0618 23:14:08.399557  4617 slave.cpp:6324] Received oversubscribable resources {} from the
resource estimator
I0618 23:14:08.403995  4620 process.cpp:3779] Handling HTTP event for process 'slave(768)'
with path: '/slave(768)/monitor/statistics'
I0618 23:14:08.406900  4620 http.cpp:1115] HTTP GET for /slave(768)/monitor/statistics from
172.17.0.5:47354
I0618 23:14:08.407019  4620 http.cpp:936] Authorizing principal 'test-principal' to GET the
'/monitor/statistics' endpoint
I0618 23:14:08.414151  4617 slave.cpp:818] Agent terminating
[       OK ] Endpoint/SlaveEndpointTest.NoAuthorizer/0 (49 ms)
[ RUN      ] Endpoint/SlaveEndpointTest.NoAuthorizer/1
I0618 23:14:08.430809  4597 containerizer.cpp:230] Using isolation: posix/cpu,posix/mem,filesystem/posix,network/cni,environment_secret
W0618 23:14:08.431614  4597 backend.cpp:76] Failed to create 'overlay' backend: OverlayBackend
requires root privileges
W0618 23:14:08.431797  4597 backend.cpp:76] Failed to create 'bind' backend: BindBackend requires
root privileges
I0618 23:14:08.431840  4597 provisioner.cpp:255] Using default backend 'copy'
I0618 23:14:08.434430  4597 cluster.cpp:448] Creating default 'local' authorizer
I0618 23:14:08.437122  4622 slave.cpp:249] Mesos agent started on (769)@172.17.0.5:37083
I0618 23:14:08.437163  4622 slave.cpp:250] Flags at startup: --acls="" --appc_simple_discovery_uri_prefix="http://"
--appc_store_dir="/tmp/Endpoint_SlaveEndpointTest_NoAuthorizer_1_9AKMZa/store/appc" --authenticate_http_readonly="true"
--authenticate_http_readwrite="true" --authenticatee="crammd5" --authentication_backoff_factor="1secs"
--authorizer="local" --cgroups_cpu_enable_pids_and_tids_count="false" --cgroups_enable_cfs="false"
--cgroups_hierarchy="/sys/fs/cgroup" --cgroups_limit_swap="false" --cgroups_root="mesos" --container_disk_watch_interval="15secs"
--containerizers="mesos" --credential="/tmp/Endpoint_SlaveEndpointTest_NoAuthorizer_1_9AKMZa/credential"
--default_role="*" --disk_watch_interval="1mins" --docker="docker" --docker_kill_orphans="true"
--docker_registry="https://registry-1.docker.io" --docker_remove_delay="6hrs" --docker_socket="/var/run/docker.sock"
--docker_stop_timeout="0ns" --docker_store_dir="/tmp/Endpoint_SlaveEndpointTest_NoAuthorizer_1_9AKMZa/store/docker"
--docker_volume_checkpoint_dir="/var/run/mesos/isolators/docker/volume" --enforce_container_disk_quota="false"
--executor_registration_timeout="1mins" --executor_reregistration_timeout="2secs" --executor_shutdown_grace_period="5secs"
--fetcher_cache_dir="/tmp/Endpoint_SlaveEndpointTest_NoAuthorizer_1_9AKMZa/fetch" --fetcher_cache_size="2GB"
--frameworks_home="" --gc_delay="1weeks" --gc_disk_headroom="0.1" --hadoop_home="" --help="false"
--hostname_lookup="true" --http_command_executor="false" --http_credentials="/tmp/Endpoint_SlaveEndpointTest_NoAuthorizer_1_9AKMZa/http_credentials"
--http_heartbeat_interval="30secs" --initialize_driver_logging="true" --isolation="posix/cpu,posix/mem"
--launcher="posix" --launcher_dir="/mesos/mesos-1.4.0/_build/src" --logbufsecs="0" --logging_level="INFO"
--max_completed_executors_per_framework="150" --oversubscribed_resources_interval="15secs"
--perf_duration="10secs" --perf_interval="1mins" --port="5051" --qos_correction_interval_min="0ns"
--quiet="false" --recover="reconnect" --recovery_timeout="15mins" --registration_backoff_factor="10ms"
--resources="cpus:2;gpus:0;mem:1024;disk:1024;ports:[31000-32000]" --revocable_cpu_low_priority="true"
--runtime_dir="/tmp/Endpoint_SlaveEndpointTest_NoAuthorizer_1_9AKMZa" --sandbox_directory="/mnt/mesos/sandbox"
--strict="true" --switch_user="true" --systemd_enable_support="true" --systemd_runtime_directory="/run/systemd/system"
--version="false" --work_dir="/tmp/Endpoint_SlaveEndpointTest_NoAuthorizer_1_e4GDrW"
I0618 23:14:08.438273  4622 credentials.hpp:86] Loading credential for authentication from
'/tmp/Endpoint_SlaveEndpointTest_NoAuthorizer_1_9AKMZa/credential'
I0618 23:14:08.438868  4622 slave.cpp:282] Agent using credential for: test-principal
I0618 23:14:08.438957  4622 credentials.hpp:37] Loading credentials for authentication from
'/tmp/Endpoint_SlaveEndpointTest_NoAuthorizer_1_9AKMZa/http_credentials'
I0618 23:14:08.439587  4622 http.cpp:975] Creating default 'basic' HTTP authenticator for
realm 'mesos-agent-readonly'
I0618 23:14:08.439990  4622 http.cpp:975] Creating default 'basic' HTTP authenticator for
realm 'mesos-agent-readwrite'
I0618 23:14:08.443054  4622 slave.cpp:553] Agent resources: cpus(*):2; mem(*):1024; disk(*):1024;
ports(*):[31000-32000]
I0618 23:14:08.443207  4622 slave.cpp:561] Agent attributes: [  ]
I0618 23:14:08.443291  4622 slave.cpp:566] Agent hostname: 47e1d16fd305
I0618 23:14:08.444205  4616 status_update_manager.cpp:177] Pausing sending status updates
I0618 23:14:08.446259  4623 state.cpp:62] Recovering state from '/tmp/Endpoint_SlaveEndpointTest_NoAuthorizer_1_e4GDrW/meta'
I0618 23:14:08.447083  4621 status_update_manager.cpp:203] Recovering status update manager
I0618 23:14:08.447587  4617 containerizer.cpp:582] Recovering containerizer
I0618 23:14:08.449975  4616 provisioner.cpp:416] Provisioner recovery complete
I0618 23:14:08.450577  4621 slave.cpp:6128] Finished recovery
I0618 23:14:08.451177  4621 slave.cpp:6310] Querying resource estimator for oversubscribable
resources
I0618 23:14:08.451680  4622 slave.cpp:6324] Received oversubscribable resources {} from the
resource estimator
I0618 23:14:08.457321  4620 process.cpp:3779] Handling HTTP event for process 'slave(769)'
with path: '/slave(769)/monitor/statistics.json'
I0618 23:14:08.459722  4623 http.cpp:1115] HTTP GET for /slave(769)/monitor/statistics.json
from 172.17.0.5:47356
I0618 23:14:08.460140  4623 http.cpp:936] Authorizing principal 'test-principal' to GET the
'/monitor/statistics.json' endpoint
I0618 23:14:08.466069  4623 slave.cpp:818] Agent terminating
[       OK ] Endpoint/SlaveEndpointTest.NoAuthorizer/1 (51 ms)
[ RUN      ] Endpoint/SlaveEndpointTest.NoAuthorizer/2
I0618 23:14:08.481426  4597 containerizer.cpp:230] Using isolation: posix/cpu,posix/mem,filesystem/posix,network/cni,environment_secret
W0618 23:14:08.482214  4597 backend.cpp:76] Failed to create 'overlay' backend: OverlayBackend
requires root privileges
W0618 23:14:08.482398  4597 backend.cpp:76] Failed to create 'bind' backend: BindBackend requires
root privileges
I0618 23:14:08.482440  4597 provisioner.cpp:255] Using default backend 'copy'
I0618 23:14:08.485092  4597 cluster.cpp:448] Creating default 'local' authorizer
I0618 23:14:08.487901  4622 slave.cpp:249] Mesos agent started on (770)@172.17.0.5:37083
I0618 23:14:08.487944  4622 slave.cpp:250] Flags at startup: --acls="" --appc_simple_discovery_uri_prefix="http://"
--appc_store_dir="/tmp/Endpoint_SlaveEndpointTest_NoAuthorizer_2_TIVaF7/store/appc" --authenticate_http_readonly="true"
--authenticate_http_readwrite="true" --authenticatee="crammd5" --authentication_backoff_factor="1secs"
--authorizer="local" --cgroups_cpu_enable_pids_and_tids_count="false" --cgroups_enable_cfs="false"
--cgroups_hierarchy="/sys/fs/cgroup" --cgroups_limit_swap="false" --cgroups_root="mesos" --container_disk_watch_interval="15secs"
--containerizers="mesos" --credential="/tmp/Endpoint_SlaveEndpointTest_NoAuthorizer_2_TIVaF7/credential"
--default_role="*" --disk_watch_interval="1mins" --docker="docker" --docker_kill_orphans="true"
--docker_registry="https://registry-1.docker.io" --docker_remove_delay="6hrs" --docker_socket="/var/run/docker.sock"
--docker_stop_timeout="0ns" --docker_store_dir="/tmp/Endpoint_SlaveEndpointTest_NoAuthorizer_2_TIVaF7/store/docker"
--docker_volume_checkpoint_dir="/var/run/mesos/isolators/docker/volume" --enforce_container_disk_quota="false"
--executor_registration_timeout="1mins" --executor_reregistration_timeout="2secs" --executor_shutdown_grace_period="5secs"
--fetcher_cache_dir="/tmp/Endpoint_SlaveEndpointTest_NoAuthorizer_2_TIVaF7/fetch" --fetcher_cache_size="2GB"
--frameworks_home="" --gc_delay="1weeks" --gc_disk_headroom="0.1" --hadoop_home="" --help="false"
--hostname_lookup="true" --http_command_executor="false" --http_credentials="/tmp/Endpoint_SlaveEndpointTest_NoAuthorizer_2_TIVaF7/http_credentials"
--http_heartbeat_interval="30secs" --initialize_driver_logging="true" --isolation="posix/cpu,posix/mem"
--launcher="posix" --launcher_dir="/mesos/mesos-1.4.0/_build/src" --logbufsecs="0" --logging_level="INFO"
--max_completed_executors_per_framework="150" --oversubscribed_resources_interval="15secs"
--perf_duration="10secs" --perf_interval="1mins" --port="5051" --qos_correction_interval_min="0ns"
--quiet="false" --recover="reconnect" --recovery_timeout="15mins" --registration_backoff_factor="10ms"
--resources="cpus:2;gpus:0;mem:1024;disk:1024;ports:[31000-32000]" --revocable_cpu_low_priority="true"
--runtime_dir="/tmp/Endpoint_SlaveEndpointTest_NoAuthorizer_2_TIVaF7" --sandbox_directory="/mnt/mesos/sandbox"
--strict="true" --switch_user="true" --systemd_enable_support="true" --systemd_runtime_directory="/run/systemd/system"
--version="false" --work_dir="/tmp/Endpoint_SlaveEndpointTest_NoAuthorizer_2_wFcFYS"
I0618 23:14:08.488948  4622 credentials.hpp:86] Loading credential for authentication from
'/tmp/Endpoint_SlaveEndpointTest_NoAuthorizer_2_TIVaF7/credential'
I0618 23:14:08.489431  4622 slave.cpp:282] Agent using credential for: test-principal
I0618 23:14:08.489513  4622 credentials.hpp:37] Loading credentials for authentication from
'/tmp/Endpoint_SlaveEndpointTest_NoAuthorizer_2_TIVaF7/http_credentials'
I0618 23:14:08.490159  4622 http.cpp:975] Creating default 'basic' HTTP authenticator for
realm 'mesos-agent-readonly'
I0618 23:14:08.490566  4622 http.cpp:975] Creating default 'basic' HTTP authenticator for
realm 'mesos-agent-readwrite'
I0618 23:14:08.493296  4622 slave.cpp:553] Agent resources: cpus(*):2; mem(*):1024; disk(*):1024;
ports(*):[31000-32000]
I0618 23:14:08.493532  4622 slave.cpp:561] Agent attributes: [  ]
I0618 23:14:08.493615  4622 slave.cpp:566] Agent hostname: 47e1d16fd305
I0618 23:14:08.494278  4623 status_update_manager.cpp:177] Pausing sending status updates
I0618 23:14:08.496623  4620 state.cpp:62] Recovering state from '/tmp/Endpoint_SlaveEndpointTest_NoAuthorizer_2_wFcFYS/meta'
I0618 23:14:08.497547  4619 status_update_manager.cpp:203] Recovering status update manager
I0618 23:14:08.497944  4619 containerizer.cpp:582] Recovering containerizer
I0618 23:14:08.500305  4620 provisioner.cpp:416] Provisioner recovery complete
I0618 23:14:08.501619  4621 slave.cpp:6128] Finished recovery
I0618 23:14:08.502231  4621 slave.cpp:6310] Querying resource estimator for oversubscribable
resources
I0618 23:14:08.502717  4616 slave.cpp:6324] Received oversubscribable resources {} from the
resource estimator
I0618 23:14:08.508080  4622 process.cpp:3779] Handling HTTP event for process 'slave(770)'
with path: '/slave(770)/containers'
I0618 23:14:08.510540  4619 http.cpp:1115] HTTP GET for /slave(770)/containers from 172.17.0.5:47358
I0618 23:14:08.510789  4619 http.cpp:936] Authorizing principal 'test-principal' to GET the
'/containers' endpoint
I0618 23:14:08.526682  4597 slave.cpp:818] Agent terminating
[       OK ] Endpoint/SlaveEndpointTest.NoAuthorizer/2 (60 ms)
[----------] 9 tests from Endpoint/SlaveEndpointTest (515 ms total)

[----------] Global test environment tear-down
[==========] 1610 tests from 176 test cases ran. (763379 ms total)
[  PASSED  ] 1605 tests.
[  FAILED  ] 5 tests, listed below:
[  FAILED  ] DefaultExecutorCheckTest.CommandCheckDeliveredAndReconciled
[  FAILED  ] DefaultExecutorCheckTest.CommandCheckStatusChange
[  FAILED  ] DefaultExecutorCheckTest.CommandCheckSeesParentsEnv
[  FAILED  ] DefaultExecutorCheckTest.CommandCheckSharesWorkDirWithTask
[  FAILED  ] MasterTest.IgnoreOldAgentReregistration

 5 FAILED TESTS
  YOU HAVE 20 DISABLED TESTS

E0618 23:14:08.670078  4624 process.cpp:968] Failed to accept socket: future discarded
make[4]: *** [check-local] Error 1
make[4]: Leaving directory `/mesos/mesos-1.4.0/_build/src'
make[3]: *** [check-am] Error 2
make[3]: Leaving directory `/mesos/mesos-1.4.0/_build/src'
make[2]: *** [check] Error 2
make[2]: Leaving directory `/mesos/mesos-1.4.0/_build/src'
make[1]: *** [check-recursive] Error 1
make[1]: Leaving directory `/mesos/mesos-1.4.0/_build'
make: *** [distcheck] Error 1
+ docker rmi mesos-1497820744-656
Untagged: mesos-1497820744-656:latest
Deleted: sha256:4f416689a8384f9eb1a2a7984994f4f88051669a630e358ebc396bc5951d8839
Deleted: sha256:162baa1b731cf58319be20ca61f341241bc7581c2d5201983f9ab70d2713bf38
Deleted: sha256:f435a4f18967b6cd1da918b43dbb9702040ced01014ecd43c957066d1b52dba6
Deleted: sha256:99f91544c32598119436a4d9b5412a96e08d1af5f68712237140528e748fe9ce
Deleted: sha256:1950c3e2df0de96c18f118ab9e2ba9e9cd98a9c02dd0084186f30f3d5f667e2f
Deleted: sha256:bb8cbf82f99acbc5dde731e7b6937c8ce2743cdcec9a9cb2e9c74e12bd5d89db
Deleted: sha256:1e7bd39ecb9807d43125bf02da34bd6d9d6c85e7c877295c01d373eb479f9590
Deleted: sha256:7e0a65c183abc9050e0ec172b6326ff8c77066b662658aa72ec6e5774be28074
Deleted: sha256:66e77f14be7c316387125a1998d26f6ff26178f2eae2d070759d6deb2c17432b
Deleted: sha256:7b8f79286e9b9dd4d2cf4e9d00d29d6347d4befd4da387b2a4fc639b29c26439
Deleted: sha256:10e4a5368e0cb5637a8552e6e088db3ea35962b6de081d79d7f94d7cc0ea7de3
Deleted: sha256:d8ab91dda549e99b91fb40b87a8f7287111787197fc9bd209232738af7d5e74e
Deleted: sha256:bac334424705db89676f1aa482d06e52810487fa7c78a92a5d9a9e73f9d74972
Deleted: sha256:127932131b9487761d4b4dff7129e44e21c63a800f105f137e76177ac7e46963
Deleted: sha256:dcbbfc7923099009833213da294a3180273744bf927f5d96d3c19a34a5f81029
Deleted: sha256:c3cf065e6f397881c102076d979b885f44156fa818c8c1b95a6a567a547abb7a
Deleted: sha256:e20b4bfe1d5a452871f450d9f5659da2be10db7fd1b457ae2b143d5b37effa89
Deleted: sha256:8fd5807f521b23e4828a6610fae8be8b96bc25bd7166d640b70e25d3dc62ee66
Deleted: sha256:858ff82e126fdfa21a3adb24064ab54392349553bd7de2dd9707c036dcd04c83
Deleted: sha256:bce2fd851797c3a1cf3e535f00b51de6362d9b94d6403df0c0036b7fe78e3355
Deleted: sha256:dcced095aaf21c7cfd15c5f23c456299b81ed0be2487cf3c7817ed5211df4db2
Deleted: sha256:5676c07cf78900c6554067a52b89b0f7ec8a0de46d5296f7f0196d9c4798a543
Deleted: sha256:2690f3d68b80f0b59660fbc6e8c2b13113ed9b835f900a037a0ff9afa9ca96be
Deleted: sha256:3b83aa95749aa5ef47fcd6df3e9d2de7e9997c1235908d606195c2700d0a4dc4
Build step 'Execute shell' marked build as failure

Mime
View raw message