mesos-builds mailing list archives

Site index · List index
Message view « Date » · « Thread »
Top « Date » · « Thread »
From Apache Jenkins Server <jenk...@builds.apache.org>
Subject Build failed in Jenkins: Mesos-Buildbot » autotools,gcc,--verbose --enable-libevent --enable-ssl,GLOG_v=1 MESOS_VERBOSE=1,centos:7,(ubuntu)&&(!ubuntu-us1)&&(!ubuntu-eu2) #3771
Date Wed, 07 Jun 2017 10:56:44 GMT
See <https://builds.apache.org/job/Mesos-Buildbot/BUILDTOOL=autotools,COMPILER=gcc,CONFIGURATION=--verbose%20--enable-libevent%20--enable-ssl,ENVIRONMENT=GLOG_v=1%20MESOS_VERBOSE=1,OS=centos%3A7,label_exp=(ubuntu)&&(!ubuntu-us1)&&(!ubuntu-eu2)/3771/display/redirect?page=changes>

Changes:

[alexr] Made persistent volume endpoints tests independent from allocator.

[alexr] Made reservation endpoints tests independent from allocator.

[alexr] Removed some unused includes and using declarations.

------------------------------------------
[...truncated 29.15 MB...]
I0607 10:56:38.252847 29074 http.cpp:1115] HTTP GET for /slave(759)/containers from 172.17.0.3:59848
I0607 10:56:38.252955 29074 http.cpp:936] Authorizing principal 'test-principal' to GET the
'/containers' endpoint
I0607 10:56:38.260210 29079 slave.cpp:817] Agent terminating
[       OK ] Endpoint/SlaveEndpointTest.AuthorizedRequest/2 (53 ms)
[ RUN      ] Endpoint/SlaveEndpointTest.UnauthorizedRequest/0
I0607 10:56:38.278194  8720 containerizer.cpp:230] Using isolation: posix/cpu,posix/mem,filesystem/posix,network/cni,environment_secret
W0607 10:56:38.279327  8720 backend.cpp:76] Failed to create 'aufs' backend: AufsBackend requires
root privileges
W0607 10:56:38.279673  8720 backend.cpp:76] Failed to create 'bind' backend: BindBackend requires
root privileges
I0607 10:56:38.279877  8720 provisioner.cpp:255] Using default backend 'copy'
I0607 10:56:38.284463 29069 slave.cpp:248] Mesos agent started on (760)@172.17.0.3:40154
I0607 10:56:38.284523 29069 slave.cpp:249] Flags at startup: --acls="" --appc_simple_discovery_uri_prefix="http://"
--appc_store_dir="/tmp/Endpoint_SlaveEndpointTest_UnauthorizedRequest_0_F0Vs5H/store/appc"
--authenticate_http_executors="true" --authenticate_http_readonly="true" --authenticate_http_readwrite="true"
--authenticatee="crammd5" --authentication_backoff_factor="1secs" --authorizer="local" --cgroups_cpu_enable_pids_and_tids_count="false"
--cgroups_enable_cfs="false" --cgroups_hierarchy="/sys/fs/cgroup" --cgroups_limit_swap="false"
--cgroups_root="mesos" --container_disk_watch_interval="15secs" --containerizers="mesos" --credential="/tmp/Endpoint_SlaveEndpointTest_UnauthorizedRequest_0_F0Vs5H/credential"
--default_role="*" --disk_watch_interval="1mins" --docker="docker" --docker_kill_orphans="true"
--docker_registry="https://registry-1.docker.io" --docker_remove_delay="6hrs" --docker_socket="/var/run/docker.sock"
--docker_stop_timeout="0ns" --docker_store_dir="/tmp/Endpoint_SlaveEndpointTest_UnauthorizedRequest_0_F0Vs5H/store/docker"
--docker_volume_checkpoint_dir="/var/run/mesos/isolators/docker/volume" --enforce_container_disk_quota="false"
--executor_registration_timeout="1mins" --executor_reregistration_timeout="2secs" --executor_secret_key="/tmp/Endpoint_SlaveEndpointTest_UnauthorizedRequest_0_F0Vs5H/executor_secret_key"
--executor_shutdown_grace_period="5secs" --fetcher_cache_dir="/tmp/Endpoint_SlaveEndpointTest_UnauthorizedRequest_0_F0Vs5H/fetch"
--fetcher_cache_size="2GB" --frameworks_home="" --gc_delay="1weeks" --gc_disk_headroom="0.1"
--hadoop_home="" --help="false" --hostname_lookup="true" --http_command_executor="false" --http_credentials="/tmp/Endpoint_SlaveEndpointTest_UnauthorizedRequest_0_F0Vs5H/http_credentials"
--http_heartbeat_interval="30secs" --initialize_driver_logging="true" --isolation="posix/cpu,posix/mem"
--launcher="posix" --launcher_dir="/mesos/mesos-1.4.0/_build/src" --logbufsecs="0" --logging_level="INFO"
--max_completed_executors_per_framework="150" --oversubscribed_resources_interval="15secs"
--perf_duration="10secs" --perf_interval="1mins" --port="5051" --qos_correction_interval_min="0ns"
--quiet="false" --recover="reconnect" --recovery_timeout="15mins" --registration_backoff_factor="10ms"
--resources="cpus:2;gpus:0;mem:1024;disk:1024;ports:[31000-32000]" --revocable_cpu_low_priority="true"
--runtime_dir="/tmp/Endpoint_SlaveEndpointTest_UnauthorizedRequest_0_F0Vs5H" --sandbox_directory="/mnt/mesos/sandbox"
--strict="true" --switch_user="true" --systemd_enable_support="true" --systemd_runtime_directory="/run/systemd/system"
--version="false" --work_dir="/tmp/Endpoint_SlaveEndpointTest_UnauthorizedRequest_0_VQfkHu"
I0607 10:56:38.285171 29069 credentials.hpp:86] Loading credential for authentication from
'/tmp/Endpoint_SlaveEndpointTest_UnauthorizedRequest_0_F0Vs5H/credential'
I0607 10:56:38.285464 29069 slave.cpp:281] Agent using credential for: test-principal
I0607 10:56:38.285486 29069 credentials.hpp:37] Loading credentials for authentication from
'/tmp/Endpoint_SlaveEndpointTest_UnauthorizedRequest_0_F0Vs5H/http_credentials'
I0607 10:56:38.285847 29069 http.cpp:975] Creating default 'basic' HTTP authenticator for
realm 'mesos-agent-executor'
I0607 10:56:38.286010 29069 http.cpp:996] Creating default 'jwt' HTTP authenticator for realm
'mesos-agent-executor'
I0607 10:56:38.286201 29069 http.cpp:975] Creating default 'basic' HTTP authenticator for
realm 'mesos-agent-readonly'
I0607 10:56:38.286280 29069 http.cpp:996] Creating default 'jwt' HTTP authenticator for realm
'mesos-agent-readonly'
I0607 10:56:38.286434 29069 http.cpp:975] Creating default 'basic' HTTP authenticator for
realm 'mesos-agent-readwrite'
I0607 10:56:38.286523 29069 http.cpp:996] Creating default 'jwt' HTTP authenticator for realm
'mesos-agent-readwrite'
I0607 10:56:38.288187 29069 slave.cpp:552] Agent resources: cpus(*):2; mem(*):1024; disk(*):1024;
ports(*):[31000-32000]
I0607 10:56:38.288293 29069 slave.cpp:560] Agent attributes: [  ]
I0607 10:56:38.288337 29069 slave.cpp:565] Agent hostname: 6e77e3cff047
I0607 10:56:38.288596 29066 status_update_manager.cpp:177] Pausing sending status updates
I0607 10:56:38.290681 29066 state.cpp:62] Recovering state from '/tmp/Endpoint_SlaveEndpointTest_UnauthorizedRequest_0_VQfkHu/meta'
I0607 10:56:38.291358 29062 status_update_manager.cpp:203] Recovering status update manager
I0607 10:56:38.291590 29061 containerizer.cpp:582] Recovering containerizer
I0607 10:56:38.293545 29072 provisioner.cpp:416] Provisioner recovery complete
I0607 10:56:38.293926 29070 slave.cpp:6127] Finished recovery
I0607 10:56:38.294594 29070 slave.cpp:6309] Querying resource estimator for oversubscribable
resources
I0607 10:56:38.294947 29072 slave.cpp:6323] Received oversubscribable resources {} from the
resource estimator
I0607 10:56:38.297420 29062 process.cpp:3778] Handling HTTP event for process 'slave(760)'
with path: '/slave(760)/monitor/statistics'
I0607 10:56:38.299510 29071 http.cpp:1115] HTTP GET for /slave(760)/monitor/statistics from
172.17.0.3:59850
I0607 10:56:38.299624 29071 http.cpp:936] Authorizing principal 'test-principal' to GET the
'/monitor/statistics' endpoint
I0607 10:56:38.302038 29066 slave.cpp:817] Agent terminating
[       OK ] Endpoint/SlaveEndpointTest.UnauthorizedRequest/0 (38 ms)
[ RUN      ] Endpoint/SlaveEndpointTest.UnauthorizedRequest/1
I0607 10:56:38.317832  8720 containerizer.cpp:230] Using isolation: posix/cpu,posix/mem,filesystem/posix,network/cni,environment_secret
W0607 10:56:38.318737  8720 backend.cpp:76] Failed to create 'aufs' backend: AufsBackend requires
root privileges
W0607 10:56:38.318883  8720 backend.cpp:76] Failed to create 'bind' backend: BindBackend requires
root privileges
I0607 10:56:38.318934  8720 provisioner.cpp:255] Using default backend 'copy'
I0607 10:56:38.323173 29061 slave.cpp:248] Mesos agent started on (761)@172.17.0.3:40154
I0607 10:56:38.323202 29061 slave.cpp:249] Flags at startup: --acls="" --appc_simple_discovery_uri_prefix="http://"
--appc_store_dir="/tmp/Endpoint_SlaveEndpointTest_UnauthorizedRequest_1_KcS2Xz/store/appc"
--authenticate_http_executors="true" --authenticate_http_readonly="true" --authenticate_http_readwrite="true"
--authenticatee="crammd5" --authentication_backoff_factor="1secs" --authorizer="local" --cgroups_cpu_enable_pids_and_tids_count="false"
--cgroups_enable_cfs="false" --cgroups_hierarchy="/sys/fs/cgroup" --cgroups_limit_swap="false"
--cgroups_root="mesos" --container_disk_watch_interval="15secs" --containerizers="mesos" --credential="/tmp/Endpoint_SlaveEndpointTest_UnauthorizedRequest_1_KcS2Xz/credential"
--default_role="*" --disk_watch_interval="1mins" --docker="docker" --docker_kill_orphans="true"
--docker_registry="https://registry-1.docker.io" --docker_remove_delay="6hrs" --docker_socket="/var/run/docker.sock"
--docker_stop_timeout="0ns" --docker_store_dir="/tmp/Endpoint_SlaveEndpointTest_UnauthorizedRequest_1_KcS2Xz/store/docker"
--docker_volume_checkpoint_dir="/var/run/mesos/isolators/docker/volume" --enforce_container_disk_quota="false"
--executor_registration_timeout="1mins" --executor_reregistration_timeout="2secs" --executor_secret_key="/tmp/Endpoint_SlaveEndpointTest_UnauthorizedRequest_1_KcS2Xz/executor_secret_key"
--executor_shutdown_grace_period="5secs" --fetcher_cache_dir="/tmp/Endpoint_SlaveEndpointTest_UnauthorizedRequest_1_KcS2Xz/fetch"
--fetcher_cache_size="2GB" --frameworks_home="" --gc_delay="1weeks" --gc_disk_headroom="0.1"
--hadoop_home="" --help="false" --hostname_lookup="true" --http_command_executor="false" --http_credentials="/tmp/Endpoint_SlaveEndpointTest_UnauthorizedRequest_1_KcS2Xz/http_credentials"
--http_heartbeat_interval="30secs" --initialize_driver_logging="true" --isolation="posix/cpu,posix/mem"
--launcher="posix" --launcher_dir="/mesos/mesos-1.4.0/_build/src" --logbufsecs="0" --logging_level="INFO"
--max_completed_executors_per_framework="150" --oversubscribed_resources_interval="15secs"
--perf_duration="10secs" --perf_interval="1mins" --port="5051" --qos_correction_interval_min="0ns"
--quiet="false" --recover="reconnect" --recovery_timeout="15mins" --registration_backoff_factor="10ms"
--resources="cpus:2;gpus:0;mem:1024;disk:1024;ports:[31000-32000]" --revocable_cpu_low_priority="true"
--runtime_dir="/tmp/Endpoint_SlaveEndpointTest_UnauthorizedRequest_1_KcS2Xz" --sandbox_directory="/mnt/mesos/sandbox"
--strict="true" --switch_user="true" --systemd_enable_support="true" --systemd_runtime_directory="/run/systemd/system"
--version="false" --work_dir="/tmp/Endpoint_SlaveEndpointTest_UnauthorizedRequest_1_7cB2tm"
I0607 10:56:38.323765 29061 credentials.hpp:86] Loading credential for authentication from
'/tmp/Endpoint_SlaveEndpointTest_UnauthorizedRequest_1_KcS2Xz/credential'
I0607 10:56:38.324013 29061 slave.cpp:281] Agent using credential for: test-principal
I0607 10:56:38.324040 29061 credentials.hpp:37] Loading credentials for authentication from
'/tmp/Endpoint_SlaveEndpointTest_UnauthorizedRequest_1_KcS2Xz/http_credentials'
I0607 10:56:38.324378 29061 http.cpp:975] Creating default 'basic' HTTP authenticator for
realm 'mesos-agent-executor'
I0607 10:56:38.324538 29061 http.cpp:996] Creating default 'jwt' HTTP authenticator for realm
'mesos-agent-executor'
I0607 10:56:38.324790 29061 http.cpp:975] Creating default 'basic' HTTP authenticator for
realm 'mesos-agent-readonly'
I0607 10:56:38.324904 29061 http.cpp:996] Creating default 'jwt' HTTP authenticator for realm
'mesos-agent-readonly'
I0607 10:56:38.325112 29061 http.cpp:975] Creating default 'basic' HTTP authenticator for
realm 'mesos-agent-readwrite'
I0607 10:56:38.325209 29061 http.cpp:996] Creating default 'jwt' HTTP authenticator for realm
'mesos-agent-readwrite'
I0607 10:56:38.327069 29061 slave.cpp:552] Agent resources: cpus(*):2; mem(*):1024; disk(*):1024;
ports(*):[31000-32000]
I0607 10:56:38.330739 29061 slave.cpp:560] Agent attributes: [  ]
I0607 10:56:38.330762 29061 slave.cpp:565] Agent hostname: 6e77e3cff047
I0607 10:56:38.331148 29079 status_update_manager.cpp:177] Pausing sending status updates
I0607 10:56:38.333108 29080 state.cpp:62] Recovering state from '/tmp/Endpoint_SlaveEndpointTest_UnauthorizedRequest_1_7cB2tm/meta'
I0607 10:56:38.333570 29079 status_update_manager.cpp:203] Recovering status update manager
I0607 10:56:38.333848 29076 containerizer.cpp:582] Recovering containerizer
I0607 10:56:38.336287 29067 provisioner.cpp:416] Provisioner recovery complete
I0607 10:56:38.336748 29067 slave.cpp:6127] Finished recovery
I0607 10:56:38.337337 29067 slave.cpp:6309] Querying resource estimator for oversubscribable
resources
I0607 10:56:38.337641 29062 slave.cpp:6323] Received oversubscribable resources {} from the
resource estimator
I0607 10:56:38.342298 29058 process.cpp:3778] Handling HTTP event for process 'slave(761)'
with path: '/slave(761)/monitor/statistics.json'
I0607 10:56:38.344960 29061 http.cpp:1115] HTTP GET for /slave(761)/monitor/statistics.json
from 172.17.0.3:59852
I0607 10:56:38.345065 29061 http.cpp:936] Authorizing principal 'test-principal' to GET the
'/monitor/statistics.json' endpoint
I0607 10:56:38.348948  8720 slave.cpp:817] Agent terminating
[       OK ] Endpoint/SlaveEndpointTest.UnauthorizedRequest/1 (48 ms)
[ RUN      ] Endpoint/SlaveEndpointTest.UnauthorizedRequest/2
I0607 10:56:38.364188  8720 containerizer.cpp:230] Using isolation: posix/cpu,posix/mem,filesystem/posix,network/cni,environment_secret
W0607 10:56:38.365367  8720 backend.cpp:76] Failed to create 'aufs' backend: AufsBackend requires
root privileges
W0607 10:56:38.365764  8720 backend.cpp:76] Failed to create 'bind' backend: BindBackend requires
root privileges
I0607 10:56:38.366044  8720 provisioner.cpp:255] Using default backend 'copy'
I0607 10:56:38.372540 29075 slave.cpp:248] Mesos agent started on (762)@172.17.0.3:40154
I0607 10:56:38.372598 29075 slave.cpp:249] Flags at startup: --acls="" --appc_simple_discovery_uri_prefix="http://"
--appc_store_dir="/tmp/Endpoint_SlaveEndpointTest_UnauthorizedRequest_2_SdLpis/store/appc"
--authenticate_http_executors="true" --authenticate_http_readonly="true" --authenticate_http_readwrite="true"
--authenticatee="crammd5" --authentication_backoff_factor="1secs" --authorizer="local" --cgroups_cpu_enable_pids_and_tids_count="false"
--cgroups_enable_cfs="false" --cgroups_hierarchy="/sys/fs/cgroup" --cgroups_limit_swap="false"
--cgroups_root="mesos" --container_disk_watch_interval="15secs" --containerizers="mesos" --credential="/tmp/Endpoint_SlaveEndpointTest_UnauthorizedRequest_2_SdLpis/credential"
--default_role="*" --disk_watch_interval="1mins" --docker="docker" --docker_kill_orphans="true"
--docker_registry="https://registry-1.docker.io" --docker_remove_delay="6hrs" --docker_socket="/var/run/docker.sock"
--docker_stop_timeout="0ns" --docker_store_dir="/tmp/Endpoint_SlaveEndpointTest_UnauthorizedRequest_2_SdLpis/store/docker"
--docker_volume_checkpoint_dir="/var/run/mesos/isolators/docker/volume" --enforce_container_disk_quota="false"
--executor_registration_timeout="1mins" --executor_reregistration_timeout="2secs" --executor_secret_key="/tmp/Endpoint_SlaveEndpointTest_UnauthorizedRequest_2_SdLpis/executor_secret_key"
--executor_shutdown_grace_period="5secs" --fetcher_cache_dir="/tmp/Endpoint_SlaveEndpointTest_UnauthorizedRequest_2_SdLpis/fetch"
--fetcher_cache_size="2GB" --frameworks_home="" --gc_delay="1weeks" --gc_disk_headroom="0.1"
--hadoop_home="" --help="false" --hostname_lookup="true" --http_command_executor="false" --http_credentials="/tmp/Endpoint_SlaveEndpointTest_UnauthorizedRequest_2_SdLpis/http_credentials"
--http_heartbeat_interval="30secs" --initialize_driver_logging="true" --isolation="posix/cpu,posix/mem"
--launcher="posix" --launcher_dir="/mesos/mesos-1.4.0/_build/src" --logbufsecs="0" --logging_level="INFO"
--max_completed_executors_per_framework="150" --oversubscribed_resources_interval="15secs"
--perf_duration="10secs" --perf_interval="1mins" --port="5051" --qos_correction_interval_min="0ns"
--quiet="false" --recover="reconnect" --recovery_timeout="15mins" --registration_backoff_factor="10ms"
--resources="cpus:2;gpus:0;mem:1024;disk:1024;ports:[31000-32000]" --revocable_cpu_low_priority="true"
--runtime_dir="/tmp/Endpoint_SlaveEndpointTest_UnauthorizedRequest_2_SdLpis" --sandbox_directory="/mnt/mesos/sandbox"
--strict="true" --switch_user="true" --systemd_enable_support="true" --systemd_runtime_directory="/run/systemd/system"
--version="false" --work_dir="/tmp/Endpoint_SlaveEndpointTest_UnauthorizedRequest_2_tYolHe"
I0607 10:56:38.373240 29075 credentials.hpp:86] Loading credential for authentication from
'/tmp/Endpoint_SlaveEndpointTest_UnauthorizedRequest_2_SdLpis/credential'
I0607 10:56:38.373543 29075 slave.cpp:281] Agent using credential for: test-principal
I0607 10:56:38.373563 29075 credentials.hpp:37] Loading credentials for authentication from
'/tmp/Endpoint_SlaveEndpointTest_UnauthorizedRequest_2_SdLpis/http_credentials'
I0607 10:56:38.373865 29075 http.cpp:975] Creating default 'basic' HTTP authenticator for
realm 'mesos-agent-executor'
I0607 10:56:38.374016 29075 http.cpp:996] Creating default 'jwt' HTTP authenticator for realm
'mesos-agent-executor'
I0607 10:56:38.374240 29075 http.cpp:975] Creating default 'basic' HTTP authenticator for
realm 'mesos-agent-readonly'
I0607 10:56:38.374321 29075 http.cpp:996] Creating default 'jwt' HTTP authenticator for realm
'mesos-agent-readonly'
I0607 10:56:38.374464 29075 http.cpp:975] Creating default 'basic' HTTP authenticator for
realm 'mesos-agent-readwrite'
I0607 10:56:38.374528 29075 http.cpp:996] Creating default 'jwt' HTTP authenticator for realm
'mesos-agent-readwrite'
I0607 10:56:38.376098 29075 slave.cpp:552] Agent resources: cpus(*):2; mem(*):1024; disk(*):1024;
ports(*):[31000-32000]
I0607 10:56:38.376186 29075 slave.cpp:560] Agent attributes: [  ]
I0607 10:56:38.376235 29075 slave.cpp:565] Agent hostname: 6e77e3cff047
I0607 10:56:38.376477 29062 status_update_manager.cpp:177] Pausing sending status updates
I0607 10:56:38.378422 29057 state.cpp:62] Recovering state from '/tmp/Endpoint_SlaveEndpointTest_UnauthorizedRequest_2_tYolHe/meta'
I0607 10:56:38.378855 29075 status_update_manager.cpp:203] Recovering status update manager
I0607 10:56:38.379176 29080 containerizer.cpp:582] Recovering containerizer
I0607 10:56:38.381547 29080 provisioner.cpp:416] Provisioner recovery complete
I0607 10:56:38.382154 29080 slave.cpp:6127] Finished recovery
I0607 10:56:38.382753 29080 slave.cpp:6309] Querying resource estimator for oversubscribable
resources
I0607 10:56:38.383551 29080 slave.cpp:6323] Received oversubscribable resources {} from the
resource estimator
I0607 10:56:38.388169 29058 process.cpp:3778] Handling HTTP event for process 'slave(762)'
with path: '/slave(762)/containers'
I0607 10:56:38.390806 29075 http.cpp:1115] HTTP GET for /slave(762)/containers from 172.17.0.3:59854
I0607 10:56:38.390928 29075 http.cpp:936] Authorizing principal 'test-principal' to GET the
'/containers' endpoint
I0607 10:56:38.394623 29059 slave.cpp:817] Agent terminating
[       OK ] Endpoint/SlaveEndpointTest.UnauthorizedRequest/2 (46 ms)
[ RUN      ] Endpoint/SlaveEndpointTest.NoAuthorizer/0
I0607 10:56:38.412928  8720 containerizer.cpp:230] Using isolation: posix/cpu,posix/mem,filesystem/posix,network/cni,environment_secret
W0607 10:56:38.414239  8720 backend.cpp:76] Failed to create 'aufs' backend: AufsBackend requires
root privileges
W0607 10:56:38.414631  8720 backend.cpp:76] Failed to create 'bind' backend: BindBackend requires
root privileges
I0607 10:56:38.414958  8720 provisioner.cpp:255] Using default backend 'copy'
I0607 10:56:38.417363  8720 cluster.cpp:448] Creating default 'local' authorizer
I0607 10:56:38.419860 29070 slave.cpp:248] Mesos agent started on (763)@172.17.0.3:40154
I0607 10:56:38.419905 29070 slave.cpp:249] Flags at startup: --acls="" --appc_simple_discovery_uri_prefix="http://"
--appc_store_dir="/tmp/Endpoint_SlaveEndpointTest_NoAuthorizer_0_rN5Q4k/store/appc" --authenticate_http_executors="true"
--authenticate_http_readonly="true" --authenticate_http_readwrite="true" --authenticatee="crammd5"
--authentication_backoff_factor="1secs" --authorizer="local" --cgroups_cpu_enable_pids_and_tids_count="false"
--cgroups_enable_cfs="false" --cgroups_hierarchy="/sys/fs/cgroup" --cgroups_limit_swap="false"
--cgroups_root="mesos" --container_disk_watch_interval="15secs" --containerizers="mesos" --credential="/tmp/Endpoint_SlaveEndpointTest_NoAuthorizer_0_rN5Q4k/credential"
--default_role="*" --disk_watch_interval="1mins" --docker="docker" --docker_kill_orphans="true"
--docker_registry="https://registry-1.docker.io" --docker_remove_delay="6hrs" --docker_socket="/var/run/docker.sock"
--docker_stop_timeout="0ns" --docker_store_dir="/tmp/Endpoint_SlaveEndpointTest_NoAuthorizer_0_rN5Q4k/store/docker"
--docker_volume_checkpoint_dir="/var/run/mesos/isolators/docker/volume" --enforce_container_disk_quota="false"
--executor_registration_timeout="1mins" --executor_reregistration_timeout="2secs" --executor_secret_key="/tmp/Endpoint_SlaveEndpointTest_NoAuthorizer_0_rN5Q4k/executor_secret_key"
--executor_shutdown_grace_period="5secs" --fetcher_cache_dir="/tmp/Endpoint_SlaveEndpointTest_NoAuthorizer_0_rN5Q4k/fetch"
--fetcher_cache_size="2GB" --frameworks_home="" --gc_delay="1weeks" --gc_disk_headroom="0.1"
--hadoop_home="" --help="false" --hostname_lookup="true" --http_command_executor="false" --http_credentials="/tmp/Endpoint_SlaveEndpointTest_NoAuthorizer_0_rN5Q4k/http_credentials"
--http_heartbeat_interval="30secs" --initialize_driver_logging="true" --isolation="posix/cpu,posix/mem"
--launcher="posix" --launcher_dir="/mesos/mesos-1.4.0/_build/src" --logbufsecs="0" --logging_level="INFO"
--max_completed_executors_per_framework="150" --oversubscribed_resources_interval="15secs"
--perf_duration="10secs" --perf_interval="1mins" --port="5051" --qos_correction_interval_min="0ns"
--quiet="false" --recover="reconnect" --recovery_timeout="15mins" --registration_backoff_factor="10ms"
--resources="cpus:2;gpus:0;mem:1024;disk:1024;ports:[31000-32000]" --revocable_cpu_low_priority="true"
--runtime_dir="/tmp/Endpoint_SlaveEndpointTest_NoAuthorizer_0_rN5Q4k" --sandbox_directory="/mnt/mesos/sandbox"
--strict="true" --switch_user="true" --systemd_enable_support="true" --systemd_runtime_directory="/run/systemd/system"
--version="false" --work_dir="/tmp/Endpoint_SlaveEndpointTest_NoAuthorizer_0_2gQEm7"
I0607 10:56:38.420495 29070 credentials.hpp:86] Loading credential for authentication from
'/tmp/Endpoint_SlaveEndpointTest_NoAuthorizer_0_rN5Q4k/credential'
I0607 10:56:38.420769 29070 slave.cpp:281] Agent using credential for: test-principal
I0607 10:56:38.420790 29070 credentials.hpp:37] Loading credentials for authentication from
'/tmp/Endpoint_SlaveEndpointTest_NoAuthorizer_0_rN5Q4k/http_credentials'
I0607 10:56:38.421149 29070 http.cpp:975] Creating default 'basic' HTTP authenticator for
realm 'mesos-agent-executor'
I0607 10:56:38.421325 29070 http.cpp:996] Creating default 'jwt' HTTP authenticator for realm
'mesos-agent-executor'
I0607 10:56:38.421550 29070 http.cpp:975] Creating default 'basic' HTTP authenticator for
realm 'mesos-agent-readonly'
I0607 10:56:38.421641 29070 http.cpp:996] Creating default 'jwt' HTTP authenticator for realm
'mesos-agent-readonly'
I0607 10:56:38.422081 29070 http.cpp:975] Creating default 'basic' HTTP authenticator for
realm 'mesos-agent-readwrite'
I0607 10:56:38.422190 29070 http.cpp:996] Creating default 'jwt' HTTP authenticator for realm
'mesos-agent-readwrite'
I0607 10:56:38.429044 29070 slave.cpp:552] Agent resources: cpus(*):2; mem(*):1024; disk(*):1024;
ports(*):[31000-32000]
I0607 10:56:38.429136 29070 slave.cpp:560] Agent attributes: [  ]
I0607 10:56:38.429152 29070 slave.cpp:565] Agent hostname: 6e77e3cff047
I0607 10:56:38.429340 29064 status_update_manager.cpp:177] Pausing sending status updates
I0607 10:56:38.432083 29071 state.cpp:62] Recovering state from '/tmp/Endpoint_SlaveEndpointTest_NoAuthorizer_0_2gQEm7/meta'
I0607 10:56:38.432646 29068 status_update_manager.cpp:203] Recovering status update manager
I0607 10:56:38.432912 29069 containerizer.cpp:582] Recovering containerizer
I0607 10:56:38.434567 29078 provisioner.cpp:416] Provisioner recovery complete
I0607 10:56:38.434965 29063 slave.cpp:6127] Finished recovery
I0607 10:56:38.435539 29063 slave.cpp:6309] Querying resource estimator for oversubscribable
resources
I0607 10:56:38.435832 29071 slave.cpp:6323] Received oversubscribable resources {} from the
resource estimator
I0607 10:56:38.438279 29075 process.cpp:3778] Handling HTTP event for process 'slave(763)'
with path: '/slave(763)/monitor/statistics'
I0607 10:56:38.440454 29064 http.cpp:1115] HTTP GET for /slave(763)/monitor/statistics from
172.17.0.3:59856
I0607 10:56:38.440551 29064 http.cpp:936] Authorizing principal 'test-principal' to GET the
'/monitor/statistics' endpoint
I0607 10:56:38.444958 29075 slave.cpp:817] Agent terminating
[       OK ] Endpoint/SlaveEndpointTest.NoAuthorizer/0 (48 ms)
[ RUN      ] Endpoint/SlaveEndpointTest.NoAuthorizer/1
I0607 10:56:38.462352  8720 containerizer.cpp:230] Using isolation: posix/cpu,posix/mem,filesystem/posix,network/cni,environment_secret
W0607 10:56:38.463502  8720 backend.cpp:76] Failed to create 'aufs' backend: AufsBackend requires
root privileges
W0607 10:56:38.463817  8720 backend.cpp:76] Failed to create 'bind' backend: BindBackend requires
root privileges
I0607 10:56:38.464025  8720 provisioner.cpp:255] Using default backend 'copy'
I0607 10:56:38.466449  8720 cluster.cpp:448] Creating default 'local' authorizer
I0607 10:56:38.470230 29066 slave.cpp:248] Mesos agent started on (764)@172.17.0.3:40154
I0607 10:56:38.470288 29066 slave.cpp:249] Flags at startup: --acls="" --appc_simple_discovery_uri_prefix="http://"
--appc_store_dir="/tmp/Endpoint_SlaveEndpointTest_NoAuthorizer_1_8Jv1ke/store/appc" --authenticate_http_executors="true"
--authenticate_http_readonly="true" --authenticate_http_readwrite="true" --authenticatee="crammd5"
--authentication_backoff_factor="1secs" --authorizer="local" --cgroups_cpu_enable_pids_and_tids_count="false"
--cgroups_enable_cfs="false" --cgroups_hierarchy="/sys/fs/cgroup" --cgroups_limit_swap="false"
--cgroups_root="mesos" --container_disk_watch_interval="15secs" --containerizers="mesos" --credential="/tmp/Endpoint_SlaveEndpointTest_NoAuthorizer_1_8Jv1ke/credential"
--default_role="*" --disk_watch_interval="1mins" --docker="docker" --docker_kill_orphans="true"
--docker_registry="https://registry-1.docker.io" --docker_remove_delay="6hrs" --docker_socket="/var/run/docker.sock"
--docker_stop_timeout="0ns" --docker_store_dir="/tmp/Endpoint_SlaveEndpointTest_NoAuthorizer_1_8Jv1ke/store/docker"
--docker_volume_checkpoint_dir="/var/run/mesos/isolators/docker/volume" --enforce_container_disk_quota="false"
--executor_registration_timeout="1mins" --executor_reregistration_timeout="2secs" --executor_secret_key="/tmp/Endpoint_SlaveEndpointTest_NoAuthorizer_1_8Jv1ke/executor_secret_key"
--executor_shutdown_grace_period="5secs" --fetcher_cache_dir="/tmp/Endpoint_SlaveEndpointTest_NoAuthorizer_1_8Jv1ke/fetch"
--fetcher_cache_size="2GB" --frameworks_home="" --gc_delay="1weeks" --gc_disk_headroom="0.1"
--hadoop_home="" --help="false" --hostname_lookup="true" --http_command_executor="false" --http_credentials="/tmp/Endpoint_SlaveEndpointTest_NoAuthorizer_1_8Jv1ke/http_credentials"
--http_heartbeat_interval="30secs" --initialize_driver_logging="true" --isolation="posix/cpu,posix/mem"
--launcher="posix" --launcher_dir="/mesos/mesos-1.4.0/_build/src" --logbufsecs="0" --logging_level="INFO"
--max_completed_executors_per_framework="150" --oversubscribed_resources_interval="15secs"
--perf_duration="10secs" --perf_interval="1mins" --port="5051" --qos_correction_interval_min="0ns"
--quiet="false" --recover="reconnect" --recovery_timeout="15mins" --registration_backoff_factor="10ms"
--resources="cpus:2;gpus:0;mem:1024;disk:1024;ports:[31000-32000]" --revocable_cpu_low_priority="true"
--runtime_dir="/tmp/Endpoint_SlaveEndpointTest_NoAuthorizer_1_8Jv1ke" --sandbox_directory="/mnt/mesos/sandbox"
--strict="true" --switch_user="true" --systemd_enable_support="true" --systemd_runtime_directory="/run/systemd/system"
--version="false" --work_dir="/tmp/Endpoint_SlaveEndpointTest_NoAuthorizer_1_eUCwv0"
I0607 10:56:38.470752 29066 credentials.hpp:86] Loading credential for authentication from
'/tmp/Endpoint_SlaveEndpointTest_NoAuthorizer_1_8Jv1ke/credential'
I0607 10:56:38.471029 29066 slave.cpp:281] Agent using credential for: test-principal
I0607 10:56:38.471053 29066 credentials.hpp:37] Loading credentials for authentication from
'/tmp/Endpoint_SlaveEndpointTest_NoAuthorizer_1_8Jv1ke/http_credentials'
I0607 10:56:38.471364 29066 http.cpp:975] Creating default 'basic' HTTP authenticator for
realm 'mesos-agent-executor'
I0607 10:56:38.471521 29066 http.cpp:996] Creating default 'jwt' HTTP authenticator for realm
'mesos-agent-executor'
I0607 10:56:38.471778 29066 http.cpp:975] Creating default 'basic' HTTP authenticator for
realm 'mesos-agent-readonly'
I0607 10:56:38.472018 29066 http.cpp:996] Creating default 'jwt' HTTP authenticator for realm
'mesos-agent-readonly'
I0607 10:56:38.472229 29066 http.cpp:975] Creating default 'basic' HTTP authenticator for
realm 'mesos-agent-readwrite'
I0607 10:56:38.472406 29066 http.cpp:996] Creating default 'jwt' HTTP authenticator for realm
'mesos-agent-readwrite'
I0607 10:56:38.473906 29066 slave.cpp:552] Agent resources: cpus(*):2; mem(*):1024; disk(*):1024;
ports(*):[31000-32000]
I0607 10:56:38.473983 29066 slave.cpp:560] Agent attributes: [  ]
I0607 10:56:38.473997 29066 slave.cpp:565] Agent hostname: 6e77e3cff047
I0607 10:56:38.474170 29080 status_update_manager.cpp:177] Pausing sending status updates
I0607 10:56:38.475872 29065 state.cpp:62] Recovering state from '/tmp/Endpoint_SlaveEndpointTest_NoAuthorizer_1_eUCwv0/meta'
I0607 10:56:38.476248 29072 status_update_manager.cpp:203] Recovering status update manager
I0607 10:56:38.476469 29074 containerizer.cpp:582] Recovering containerizer
I0607 10:56:38.478090 29060 provisioner.cpp:416] Provisioner recovery complete
I0607 10:56:38.478590 29062 slave.cpp:6127] Finished recovery
I0607 10:56:38.479195 29062 slave.cpp:6309] Querying resource estimator for oversubscribable
resources
I0607 10:56:38.479516 29060 slave.cpp:6323] Received oversubscribable resources {} from the
resource estimator
I0607 10:56:38.482208 29060 process.cpp:3778] Handling HTTP event for process 'slave(764)'
with path: '/slave(764)/monitor/statistics.json'
I0607 10:56:38.484208 29066 http.cpp:1115] HTTP GET for /slave(764)/monitor/statistics.json
from 172.17.0.3:59858
I0607 10:56:38.484287 29066 http.cpp:936] Authorizing principal 'test-principal' to GET the
'/monitor/statistics.json' endpoint
I0607 10:56:38.492130 29057 slave.cpp:817] Agent terminating
[       OK ] Endpoint/SlaveEndpointTest.NoAuthorizer/1 (44 ms)
[ RUN      ] Endpoint/SlaveEndpointTest.NoAuthorizer/2
I0607 10:56:38.505162  8720 containerizer.cpp:230] Using isolation: posix/cpu,posix/mem,filesystem/posix,network/cni,environment_secret
W0607 10:56:38.505877  8720 backend.cpp:76] Failed to create 'aufs' backend: AufsBackend requires
root privileges
W0607 10:56:38.506001  8720 backend.cpp:76] Failed to create 'bind' backend: BindBackend requires
root privileges
I0607 10:56:38.506041  8720 provisioner.cpp:255] Using default backend 'copy'
I0607 10:56:38.508448  8720 cluster.cpp:448] Creating default 'local' authorizer
I0607 10:56:38.510560 29061 slave.cpp:248] Mesos agent started on (765)@172.17.0.3:40154
I0607 10:56:38.510957 29061 slave.cpp:249] Flags at startup: --acls="" --appc_simple_discovery_uri_prefix="http://"
--appc_store_dir="/tmp/Endpoint_SlaveEndpointTest_NoAuthorizer_2_oPij17/store/appc" --authenticate_http_executors="true"
--authenticate_http_readonly="true" --authenticate_http_readwrite="true" --authenticatee="crammd5"
--authentication_backoff_factor="1secs" --authorizer="local" --cgroups_cpu_enable_pids_and_tids_count="false"
--cgroups_enable_cfs="false" --cgroups_hierarchy="/sys/fs/cgroup" --cgroups_limit_swap="false"
--cgroups_root="mesos" --container_disk_watch_interval="15secs" --containerizers="mesos" --credential="/tmp/Endpoint_SlaveEndpointTest_NoAuthorizer_2_oPij17/credential"
--default_role="*" --disk_watch_interval="1mins" --docker="docker" --docker_kill_orphans="true"
--docker_registry="https://registry-1.docker.io" --docker_remove_delay="6hrs" --docker_socket="/var/run/docker.sock"
--docker_stop_timeout="0ns" --docker_store_dir="/tmp/Endpoint_SlaveEndpointTest_NoAuthorizer_2_oPij17/store/docker"
--docker_volume_checkpoint_dir="/var/run/mesos/isolators/docker/volume" --enforce_container_disk_quota="false"
--executor_registration_timeout="1mins" --executor_reregistration_timeout="2secs" --executor_secret_key="/tmp/Endpoint_SlaveEndpointTest_NoAuthorizer_2_oPij17/executor_secret_key"
--executor_shutdown_grace_period="5secs" --fetcher_cache_dir="/tmp/Endpoint_SlaveEndpointTest_NoAuthorizer_2_oPij17/fetch"
--fetcher_cache_size="2GB" --frameworks_home="" --gc_delay="1weeks" --gc_disk_headroom="0.1"
--hadoop_home="" --help="false" --hostname_lookup="true" --http_command_executor="false" --http_credentials="/tmp/Endpoint_SlaveEndpointTest_NoAuthorizer_2_oPij17/http_credentials"
--http_heartbeat_interval="30secs" --initialize_driver_logging="true" --isolation="posix/cpu,posix/mem"
--launcher="posix" --launcher_dir="/mesos/mesos-1.4.0/_build/src" --logbufsecs="0" --logging_level="INFO"
--max_completed_executors_per_framework="150" --oversubscribed_resources_interval="15secs"
--perf_duration="10secs" --perf_interval="1mins" --port="5051" --qos_correction_interval_min="0ns"
--quiet="false" --recover="reconnect" --recovery_timeout="15mins" --registration_backoff_factor="10ms"
--resources="cpus:2;gpus:0;mem:1024;disk:1024;ports:[31000-32000]" --revocable_cpu_low_priority="true"
--runtime_dir="/tmp/Endpoint_SlaveEndpointTest_NoAuthorizer_2_oPij17" --sandbox_directory="/mnt/mesos/sandbox"
--strict="true" --switch_user="true" --systemd_enable_support="true" --systemd_runtime_directory="/run/systemd/system"
--version="false" --work_dir="/tmp/Endpoint_SlaveEndpointTest_NoAuthorizer_2_MHri5T"
I0607 10:56:38.511785 29061 credentials.hpp:86] Loading credential for authentication from
'/tmp/Endpoint_SlaveEndpointTest_NoAuthorizer_2_oPij17/credential'
I0607 10:56:38.512171 29061 slave.cpp:281] Agent using credential for: test-principal
I0607 10:56:38.512332 29061 credentials.hpp:37] Loading credentials for authentication from
'/tmp/Endpoint_SlaveEndpointTest_NoAuthorizer_2_oPij17/http_credentials'
I0607 10:56:38.512810 29061 http.cpp:975] Creating default 'basic' HTTP authenticator for
realm 'mesos-agent-executor'
I0607 10:56:38.513104 29061 http.cpp:996] Creating default 'jwt' HTTP authenticator for realm
'mesos-agent-executor'
I0607 10:56:38.513454 29061 http.cpp:975] Creating default 'basic' HTTP authenticator for
realm 'mesos-agent-readonly'
I0607 10:56:38.513810 29061 http.cpp:996] Creating default 'jwt' HTTP authenticator for realm
'mesos-agent-readonly'
I0607 10:56:38.514127 29061 http.cpp:975] Creating default 'basic' HTTP authenticator for
realm 'mesos-agent-readwrite'
I0607 10:56:38.514406 29061 http.cpp:996] Creating default 'jwt' HTTP authenticator for realm
'mesos-agent-readwrite'
I0607 10:56:38.516288 29061 slave.cpp:552] Agent resources: cpus(*):2; mem(*):1024; disk(*):1024;
ports(*):[31000-32000]
I0607 10:56:38.516548 29061 slave.cpp:560] Agent attributes: [  ]
I0607 10:56:38.516690 29061 slave.cpp:565] Agent hostname: 6e77e3cff047
I0607 10:56:38.516976 29072 status_update_manager.cpp:177] Pausing sending status updates
I0607 10:56:38.518699 29062 state.cpp:62] Recovering state from '/tmp/Endpoint_SlaveEndpointTest_NoAuthorizer_2_MHri5T/meta'
I0607 10:56:38.519215 29067 status_update_manager.cpp:203] Recovering status update manager
I0607 10:56:38.519487 29080 containerizer.cpp:582] Recovering containerizer
I0607 10:56:38.521227 29068 provisioner.cpp:416] Provisioner recovery complete
I0607 10:56:38.521735 29063 slave.cpp:6127] Finished recovery
I0607 10:56:38.522352 29063 slave.cpp:6309] Querying resource estimator for oversubscribable
resources
I0607 10:56:38.522706 29072 slave.cpp:6323] Received oversubscribable resources {} from the
resource estimator
I0607 10:56:38.525599 29069 process.cpp:3778] Handling HTTP event for process 'slave(765)'
with path: '/slave(765)/containers'
I0607 10:56:38.527539 29078 http.cpp:1115] HTTP GET for /slave(765)/containers from 172.17.0.3:59860
I0607 10:56:38.527637 29078 http.cpp:936] Authorizing principal 'test-principal' to GET the
'/containers' endpoint
I0607 10:56:38.531713  8720 slave.cpp:817] Agent terminating
[       OK ] Endpoint/SlaveEndpointTest.NoAuthorizer/2 (39 ms)
[----------] 9 tests from Endpoint/SlaveEndpointTest (405 ms total)

[----------] Global test environment tear-down
[==========] 1593 tests from 178 test cases ran. (585434 ms total)
[  PASSED  ] 1592 tests.
[  FAILED  ] 1 test, listed below:
[  FAILED  ] CommandExecutorCheckTest.CommandCheckDeliveredAndReconciled

 1 FAILED TEST
  YOU HAVE 22 DISABLED TESTS

E0607 10:56:38.619017 29081 process.cpp:968] Failed to accept socket: future discarded
make[4]: *** [check-local] Error 1
make[4]: Leaving directory `/mesos/mesos-1.4.0/_build/src'
make[3]: *** [check-am] Error 2
make[3]: Leaving directory `/mesos/mesos-1.4.0/_build/src'
make[2]: *** [check] Error 2
make[2]: Leaving directory `/mesos/mesos-1.4.0/_build/src'
make[1]: *** [check-recursive] Error 1
make[1]: Leaving directory `/mesos/mesos-1.4.0/_build'
make: *** [distcheck] Error 1
+ docker rmi mesos-1496830055-15962
Untagged: mesos-1496830055-15962:latest
Deleted: sha256:b9c28f53f0a117171c7810880606dc9234962cde384cbad4ee8d5484d0740909
Deleted: sha256:52945feb47f3a74d0c23396c314d4a5d1b4bb1892d96b7cee88de82e1e5c72ff
Deleted: sha256:1e37cb9e2ef76fb621e774a9fc1face4ac159ccf72200766f33351a8a3eec55d
Deleted: sha256:cd4b318953c30727582954c5a48149f2a1ce4f01e00c9a3bd71f1f59b455af24
Deleted: sha256:c645ab939a2e6a773b9e763f77071f2fe5f1eaafb610a36b3bb1d4c2ebf16668
Deleted: sha256:e74948df1f866b15c642ef3c6b73843a0929135a96156a9c16bc541d58cfe904
Deleted: sha256:e7d2870c58f9d4cbec49355da4b746c3bdcd04e3acc2250e0d01f305ad0d7996
Deleted: sha256:7c55abfa1274733fb057675d2574ce80043eefb0ee5a52615079b93b4b79f2e3
Deleted: sha256:6a555818cdb067bb809c125e38b394d793c05863c8d00d08a3bd3d9faa940f33
Deleted: sha256:777092ba0f77720c56c4ae39aef2dff0d69f55b70c8fb926d2a02e985af4250e
Deleted: sha256:fb09b4885c1d1592990c4487332b8c466a5ca86e184b12aff860c3067051ac06
Deleted: sha256:5863841fb7a17d9c75ae7397b81b80f7824aaae760b18ecde3d17947c388d37f
Deleted: sha256:fb200dbfd8cc2f2ab0a4c9e8711e0e753bff4b7b9f5d3adda73b926c049fc274
Deleted: sha256:7635939a567e89fb7829a545f6536ce80fadb6b06bd0c43e6792026e9bf38329
Deleted: sha256:bd51f716ff4ee2f3b3adbeedf8743ca91bdb3fee716ce811c785bafbf814319a
Deleted: sha256:4ad155fbdb5307f54294225423ab3ec6adb435f60181509696f33a480cc575b2
Deleted: sha256:d6a96553c7d21177f041eb8563984409c2692a9349963472bb068ee667b06707
Deleted: sha256:0d28d2b70f3cc50e6c84294233dbf36db159bdc08c9d7e0b2b0b13691c712382
Deleted: sha256:88e209d869464b75a6fe6e54a7ff36eb3a25aa804627a574fd20bb7399d5241c
Deleted: sha256:892f21828bd781e4fcd27aa3d738a83c9d07de5990cce9539d5483425671aff3
Deleted: sha256:9f1db6d2d302a60565b6a971d62fed17c44ecbdb14d982c4d778ab8bbcc7db3e
Deleted: sha256:549aedf646d58c230746dfdb484effffbde1599a26011334531862de6b9b7670
Deleted: sha256:d95cff53de5a2e083244644b4e0acbfd0cf71a6a0e7c46cff9c684720cadc516
Deleted: sha256:1ecdd384ac6dad7e85fc3884f99ed733e820fa241692aafdb3350052eb68beb8
Deleted: sha256:6d87d390f960f2399b8226cada68e4ef8c16faa61f30fc12a9604ad203b124e7
Build step 'Execute shell' marked build as failure
Not sending mail to unregistered user xujyan@apple.com

Mime
View raw message