mesos-builds mailing list archives

Site index · List index
Message view « Date » · « Thread »
Top « Date » · « Thread »
From Apache Jenkins Server <jenk...@builds.apache.org>
Subject Build failed in Jenkins: Mesos-Buildbot » cmake,gcc,--verbose,GLOG_v=1 MESOS_VERBOSE=1,ubuntu:14.04,(ubuntu)&&(!ubuntu-us1)&&(!ubuntu-eu2) #3762
Date Sun, 04 Jun 2017 01:11:14 GMT
See <https://builds.apache.org/job/Mesos-Buildbot/BUILDTOOL=cmake,COMPILER=gcc,CONFIGURATION=--verbose,ENVIRONMENT=GLOG_v=1%20MESOS_VERBOSE=1,OS=ubuntu%3A14.04,label_exp=(ubuntu)&&(!ubuntu-us1)&&(!ubuntu-eu2)/3762/display/redirect?page=changes>

Changes:

[yujie.jay] Removed out-dated working groups.

[yujie.jay] Added working groups guidance.

[yujie.jay] Added a table for the active working groups.

------------------------------------------
[...truncated 25.82 MB...]
I0604 01:11:10.112502 32355 http.cpp:936] Authorizing principal 'test-principal' to GET the
'/monitor/statistics.json' endpoint
I0604 01:11:10.113868 32335 slave.cpp:817] Agent terminating
[       OK ] Endpoint/SlaveEndpointTest.AuthorizedRequest/1 (12 ms)
[ RUN      ] Endpoint/SlaveEndpointTest.AuthorizedRequest/2
I0604 01:11:10.119132 32335 containerizer.cpp:230] Using isolation: posix/cpu,posix/mem,filesystem/posix,network/cni,environment_secret
W0604 01:11:10.119463 32335 backend.cpp:76] Failed to create 'aufs' backend: AufsBackend requires
root privileges
W0604 01:11:10.119508 32335 backend.cpp:76] Failed to create 'bind' backend: BindBackend requires
root privileges
I0604 01:11:10.119524 32335 provisioner.cpp:255] Using default backend 'copy'
I0604 01:11:10.120748 32336 slave.cpp:248] Mesos agent started on (751)@172.17.0.4:42385
I0604 01:11:10.120765 32336 slave.cpp:249] Flags at startup: --acls="" --appc_simple_discovery_uri_prefix="http://"
--appc_store_dir="/tmp/Endpoint_SlaveEndpointTest_AuthorizedRequest_2_5Jbhwa/store/appc" --authenticate_http_readonly="true"
--authenticate_http_readwrite="true" --authenticatee="crammd5" --authentication_backoff_factor="1secs"
--authorizer="local" --cgroups_cpu_enable_pids_and_tids_count="false" --cgroups_enable_cfs="false"
--cgroups_hierarchy="/sys/fs/cgroup" --cgroups_limit_swap="false" --cgroups_root="mesos" --container_disk_watch_interval="15secs"
--containerizers="mesos" --credential="/tmp/Endpoint_SlaveEndpointTest_AuthorizedRequest_2_5Jbhwa/credential"
--default_role="*" --disk_watch_interval="1mins" --docker="docker" --docker_kill_orphans="true"
--docker_registry="https://registry-1.docker.io" --docker_remove_delay="6hrs" --docker_socket="/var/run/docker.sock"
--docker_stop_timeout="0ns" --docker_store_dir="/tmp/Endpoint_SlaveEndpointTest_AuthorizedRequest_2_5Jbhwa/store/docker"
--docker_volume_checkpoint_dir="/var/run/mesos/isolators/docker/volume" --enforce_container_disk_quota="false"
--executor_registration_timeout="1mins" --executor_reregistration_timeout="2secs" --executor_shutdown_grace_period="5secs"
--fetcher_cache_dir="/tmp/Endpoint_SlaveEndpointTest_AuthorizedRequest_2_5Jbhwa/fetch" --fetcher_cache_size="2GB"
--frameworks_home="" --gc_delay="1weeks" --gc_disk_headroom="0.1" --hadoop_home="" --help="false"
--hostname_lookup="true" --http_command_executor="false" --http_credentials="/tmp/Endpoint_SlaveEndpointTest_AuthorizedRequest_2_5Jbhwa/http_credentials"
--http_heartbeat_interval="30secs" --initialize_driver_logging="true" --isolation="posix/cpu,posix/mem"
--launcher="posix" --launcher_dir="/mesos/build/src" --logbufsecs="0" --logging_level="INFO"
--max_completed_executors_per_framework="150" --oversubscribed_resources_interval="15secs"
--perf_duration="10secs" --perf_interval="1mins" --port="5051" --qos_correction_interval_min="0ns"
--quiet="false" --recover="reconnect" --recovery_timeout="15mins" --registration_backoff_factor="10ms"
--resources="cpus:2;gpus:0;mem:1024;disk:1024;ports:[31000-32000]" --revocable_cpu_low_priority="true"
--runtime_dir="/tmp/Endpoint_SlaveEndpointTest_AuthorizedRequest_2_5Jbhwa" --sandbox_directory="/mnt/mesos/sandbox"
--strict="true" --switch_user="true" --systemd_enable_support="true" --systemd_runtime_directory="/run/systemd/system"
--version="false" --work_dir="/tmp/Endpoint_SlaveEndpointTest_AuthorizedRequest_2_3sMUch"
I0604 01:11:10.121003 32336 credentials.hpp:86] Loading credential for authentication from
'/tmp/Endpoint_SlaveEndpointTest_AuthorizedRequest_2_5Jbhwa/credential'
I0604 01:11:10.121104 32336 slave.cpp:281] Agent using credential for: test-principal
I0604 01:11:10.121135 32336 credentials.hpp:37] Loading credentials for authentication from
'/tmp/Endpoint_SlaveEndpointTest_AuthorizedRequest_2_5Jbhwa/http_credentials'
I0604 01:11:10.121261 32336 http.cpp:975] Creating default 'basic' HTTP authenticator for
realm 'mesos-agent-readonly'
I0604 01:11:10.121321 32336 http.cpp:975] Creating default 'basic' HTTP authenticator for
realm 'mesos-agent-readwrite'
I0604 01:11:10.121713 32336 slave.cpp:552] Agent resources: cpus(*):2; mem(*):1024; disk(*):1024;
ports(*):[31000-32000]
I0604 01:11:10.121744 32336 slave.cpp:560] Agent attributes: [  ]
I0604 01:11:10.121748 32336 slave.cpp:565] Agent hostname: 8e5ca7af7217
I0604 01:11:10.122081 32336 status_update_manager.cpp:177] Pausing sending status updates
I0604 01:11:10.122308 32336 state.cpp:62] Recovering state from '/tmp/Endpoint_SlaveEndpointTest_AuthorizedRequest_2_3sMUch/meta'
I0604 01:11:10.122445 32336 status_update_manager.cpp:203] Recovering status update manager
I0604 01:11:10.122509 32336 containerizer.cpp:582] Recovering containerizer
I0604 01:11:10.122931 32336 provisioner.cpp:416] Provisioner recovery complete
I0604 01:11:10.123054 32336 slave.cpp:6119] Finished recovery
I0604 01:11:10.123399 32336 slave.cpp:6301] Querying resource estimator for oversubscribable
resources
I0604 01:11:10.123543 32336 slave.cpp:6315] Received oversubscribable resources {} from the
resource estimator
I0604 01:11:10.124339 32351 process.cpp:3778] Handling HTTP event for process 'slave(751)'
with path: '/slave(751)/containers'
I0604 01:11:10.124765 32353 http.cpp:1115] HTTP GET for /slave(751)/containers from 172.17.0.4:43720
I0604 01:11:10.124809 32353 http.cpp:936] Authorizing principal 'test-principal' to GET the
'/containers' endpoint
I0604 01:11:10.126061 32343 slave.cpp:817] Agent terminating
[       OK ] Endpoint/SlaveEndpointTest.AuthorizedRequest/2 (12 ms)
[ RUN      ] Endpoint/SlaveEndpointTest.UnauthorizedRequest/0
I0604 01:11:10.131680 32335 containerizer.cpp:230] Using isolation: posix/cpu,posix/mem,filesystem/posix,network/cni,environment_secret
W0604 01:11:10.132004 32335 backend.cpp:76] Failed to create 'aufs' backend: AufsBackend requires
root privileges
W0604 01:11:10.132048 32335 backend.cpp:76] Failed to create 'bind' backend: BindBackend requires
root privileges
I0604 01:11:10.132064 32335 provisioner.cpp:255] Using default backend 'copy'
I0604 01:11:10.133339 32353 slave.cpp:248] Mesos agent started on (752)@172.17.0.4:42385
I0604 01:11:10.133355 32353 slave.cpp:249] Flags at startup: --acls="" --appc_simple_discovery_uri_prefix="http://"
--appc_store_dir="/tmp/Endpoint_SlaveEndpointTest_UnauthorizedRequest_0_XFH0RJ/store/appc"
--authenticate_http_readonly="true" --authenticate_http_readwrite="true" --authenticatee="crammd5"
--authentication_backoff_factor="1secs" --authorizer="local" --cgroups_cpu_enable_pids_and_tids_count="false"
--cgroups_enable_cfs="false" --cgroups_hierarchy="/sys/fs/cgroup" --cgroups_limit_swap="false"
--cgroups_root="mesos" --container_disk_watch_interval="15secs" --containerizers="mesos" --credential="/tmp/Endpoint_SlaveEndpointTest_UnauthorizedRequest_0_XFH0RJ/credential"
--default_role="*" --disk_watch_interval="1mins" --docker="docker" --docker_kill_orphans="true"
--docker_registry="https://registry-1.docker.io" --docker_remove_delay="6hrs" --docker_socket="/var/run/docker.sock"
--docker_stop_timeout="0ns" --docker_store_dir="/tmp/Endpoint_SlaveEndpointTest_UnauthorizedRequest_0_XFH0RJ/store/docker"
--docker_volume_checkpoint_dir="/var/run/mesos/isolators/docker/volume" --enforce_container_disk_quota="false"
--executor_registration_timeout="1mins" --executor_reregistration_timeout="2secs" --executor_shutdown_grace_period="5secs"
--fetcher_cache_dir="/tmp/Endpoint_SlaveEndpointTest_UnauthorizedRequest_0_XFH0RJ/fetch" --fetcher_cache_size="2GB"
--frameworks_home="" --gc_delay="1weeks" --gc_disk_headroom="0.1" --hadoop_home="" --help="false"
--hostname_lookup="true" --http_command_executor="false" --http_credentials="/tmp/Endpoint_SlaveEndpointTest_UnauthorizedRequest_0_XFH0RJ/http_credentials"
--http_heartbeat_interval="30secs" --initialize_driver_logging="true" --isolation="posix/cpu,posix/mem"
--launcher="posix" --launcher_dir="/mesos/build/src" --logbufsecs="0" --logging_level="INFO"
--max_completed_executors_per_framework="150" --oversubscribed_resources_interval="15secs"
--perf_duration="10secs" --perf_interval="1mins" --port="5051" --qos_correction_interval_min="0ns"
--quiet="false" --recover="reconnect" --recovery_timeout="15mins" --registration_backoff_factor="10ms"
--resources="cpus:2;gpus:0;mem:1024;disk:1024;ports:[31000-32000]" --revocable_cpu_low_priority="true"
--runtime_dir="/tmp/Endpoint_SlaveEndpointTest_UnauthorizedRequest_0_XFH0RJ" --sandbox_directory="/mnt/mesos/sandbox"
--strict="true" --switch_user="true" --systemd_enable_support="true" --systemd_runtime_directory="/run/systemd/system"
--version="false" --work_dir="/tmp/Endpoint_SlaveEndpointTest_UnauthorizedRequest_0_zE6LwQ"
I0604 01:11:10.133586 32353 credentials.hpp:86] Loading credential for authentication from
'/tmp/Endpoint_SlaveEndpointTest_UnauthorizedRequest_0_XFH0RJ/credential'
I0604 01:11:10.133688 32353 slave.cpp:281] Agent using credential for: test-principal
I0604 01:11:10.133703 32353 credentials.hpp:37] Loading credentials for authentication from
'/tmp/Endpoint_SlaveEndpointTest_UnauthorizedRequest_0_XFH0RJ/http_credentials'
I0604 01:11:10.133816 32353 http.cpp:975] Creating default 'basic' HTTP authenticator for
realm 'mesos-agent-readonly'
I0604 01:11:10.133898 32353 http.cpp:975] Creating default 'basic' HTTP authenticator for
realm 'mesos-agent-readwrite'
I0604 01:11:10.134393 32353 slave.cpp:552] Agent resources: cpus(*):2; mem(*):1024; disk(*):1024;
ports(*):[31000-32000]
I0604 01:11:10.134431 32353 slave.cpp:560] Agent attributes: [  ]
I0604 01:11:10.134439 32353 slave.cpp:565] Agent hostname: 8e5ca7af7217
I0604 01:11:10.134512 32342 status_update_manager.cpp:177] Pausing sending status updates
I0604 01:11:10.134855 32344 state.cpp:62] Recovering state from '/tmp/Endpoint_SlaveEndpointTest_UnauthorizedRequest_0_zE6LwQ/meta'
I0604 01:11:10.135006 32338 status_update_manager.cpp:203] Recovering status update manager
I0604 01:11:10.135076 32338 containerizer.cpp:582] Recovering containerizer
I0604 01:11:10.135615 32338 provisioner.cpp:416] Provisioner recovery complete
I0604 01:11:10.135749 32338 slave.cpp:6119] Finished recovery
I0604 01:11:10.136104 32338 slave.cpp:6301] Querying resource estimator for oversubscribable
resources
I0604 01:11:10.136252 32338 slave.cpp:6315] Received oversubscribable resources {} from the
resource estimator
I0604 01:11:10.137158 32347 process.cpp:3778] Handling HTTP event for process 'slave(752)'
with path: '/slave(752)/monitor/statistics'
I0604 01:11:10.137523 32347 http.cpp:1115] HTTP GET for /slave(752)/monitor/statistics from
172.17.0.4:43722
I0604 01:11:10.137564 32347 http.cpp:936] Authorizing principal 'test-principal' to GET the
'/monitor/statistics' endpoint
I0604 01:11:10.138602 32341 slave.cpp:817] Agent terminating
[       OK ] Endpoint/SlaveEndpointTest.UnauthorizedRequest/0 (12 ms)
[ RUN      ] Endpoint/SlaveEndpointTest.UnauthorizedRequest/1
I0604 01:11:10.143841 32335 containerizer.cpp:230] Using isolation: posix/cpu,posix/mem,filesystem/posix,network/cni,environment_secret
W0604 01:11:10.144140 32335 backend.cpp:76] Failed to create 'aufs' backend: AufsBackend requires
root privileges
W0604 01:11:10.144187 32335 backend.cpp:76] Failed to create 'bind' backend: BindBackend requires
root privileges
I0604 01:11:10.144207 32335 provisioner.cpp:255] Using default backend 'copy'
I0604 01:11:10.145325 32352 slave.cpp:248] Mesos agent started on (753)@172.17.0.4:42385
I0604 01:11:10.145344 32352 slave.cpp:249] Flags at startup: --acls="" --appc_simple_discovery_uri_prefix="http://"
--appc_store_dir="/tmp/Endpoint_SlaveEndpointTest_UnauthorizedRequest_1_yzAalj/store/appc"
--authenticate_http_readonly="true" --authenticate_http_readwrite="true" --authenticatee="crammd5"
--authentication_backoff_factor="1secs" --authorizer="local" --cgroups_cpu_enable_pids_and_tids_count="false"
--cgroups_enable_cfs="false" --cgroups_hierarchy="/sys/fs/cgroup" --cgroups_limit_swap="false"
--cgroups_root="mesos" --container_disk_watch_interval="15secs" --containerizers="mesos" --credential="/tmp/Endpoint_SlaveEndpointTest_UnauthorizedRequest_1_yzAalj/credential"
--default_role="*" --disk_watch_interval="1mins" --docker="docker" --docker_kill_orphans="true"
--docker_registry="https://registry-1.docker.io" --docker_remove_delay="6hrs" --docker_socket="/var/run/docker.sock"
--docker_stop_timeout="0ns" --docker_store_dir="/tmp/Endpoint_SlaveEndpointTest_UnauthorizedRequest_1_yzAalj/store/docker"
--docker_volume_checkpoint_dir="/var/run/mesos/isolators/docker/volume" --enforce_container_disk_quota="false"
--executor_registration_timeout="1mins" --executor_reregistration_timeout="2secs" --executor_shutdown_grace_period="5secs"
--fetcher_cache_dir="/tmp/Endpoint_SlaveEndpointTest_UnauthorizedRequest_1_yzAalj/fetch" --fetcher_cache_size="2GB"
--frameworks_home="" --gc_delay="1weeks" --gc_disk_headroom="0.1" --hadoop_home="" --help="false"
--hostname_lookup="true" --http_command_executor="false" --http_credentials="/tmp/Endpoint_SlaveEndpointTest_UnauthorizedRequest_1_yzAalj/http_credentials"
--http_heartbeat_interval="30secs" --initialize_driver_logging="true" --isolation="posix/cpu,posix/mem"
--launcher="posix" --launcher_dir="/mesos/build/src" --logbufsecs="0" --logging_level="INFO"
--max_completed_executors_per_framework="150" --oversubscribed_resources_interval="15secs"
--perf_duration="10secs" --perf_interval="1mins" --port="5051" --qos_correction_interval_min="0ns"
--quiet="false" --recover="reconnect" --recovery_timeout="15mins" --registration_backoff_factor="10ms"
--resources="cpus:2;gpus:0;mem:1024;disk:1024;ports:[31000-32000]" --revocable_cpu_low_priority="true"
--runtime_dir="/tmp/Endpoint_SlaveEndpointTest_UnauthorizedRequest_1_yzAalj" --sandbox_directory="/mnt/mesos/sandbox"
--strict="true" --switch_user="true" --systemd_enable_support="true" --systemd_runtime_directory="/run/systemd/system"
--version="false" --work_dir="/tmp/Endpoint_SlaveEndpointTest_UnauthorizedRequest_1_hbV5Xp"
I0604 01:11:10.145567 32352 credentials.hpp:86] Loading credential for authentication from
'/tmp/Endpoint_SlaveEndpointTest_UnauthorizedRequest_1_yzAalj/credential'
I0604 01:11:10.145675 32352 slave.cpp:281] Agent using credential for: test-principal
I0604 01:11:10.145689 32352 credentials.hpp:37] Loading credentials for authentication from
'/tmp/Endpoint_SlaveEndpointTest_UnauthorizedRequest_1_yzAalj/http_credentials'
I0604 01:11:10.145805 32352 http.cpp:975] Creating default 'basic' HTTP authenticator for
realm 'mesos-agent-readonly'
I0604 01:11:10.145865 32352 http.cpp:975] Creating default 'basic' HTTP authenticator for
realm 'mesos-agent-readwrite'
I0604 01:11:10.146355 32352 slave.cpp:552] Agent resources: cpus(*):2; mem(*):1024; disk(*):1024;
ports(*):[31000-32000]
I0604 01:11:10.146396 32352 slave.cpp:560] Agent attributes: [  ]
I0604 01:11:10.146404 32352 slave.cpp:565] Agent hostname: 8e5ca7af7217
I0604 01:11:10.146479 32343 status_update_manager.cpp:177] Pausing sending status updates
I0604 01:11:10.146872 32340 state.cpp:62] Recovering state from '/tmp/Endpoint_SlaveEndpointTest_UnauthorizedRequest_1_hbV5Xp/meta'
I0604 01:11:10.146988 32340 status_update_manager.cpp:203] Recovering status update manager
I0604 01:11:10.147102 32347 containerizer.cpp:582] Recovering containerizer
I0604 01:11:10.147585 32340 provisioner.cpp:416] Provisioner recovery complete
I0604 01:11:10.147794 32341 slave.cpp:6119] Finished recovery
I0604 01:11:10.148252 32341 slave.cpp:6301] Querying resource estimator for oversubscribable
resources
I0604 01:11:10.148356 32351 slave.cpp:6315] Received oversubscribable resources {} from the
resource estimator
I0604 01:11:10.149184 32349 process.cpp:3778] Handling HTTP event for process 'slave(753)'
with path: '/slave(753)/monitor/statistics.json'
I0604 01:11:10.149564 32359 http.cpp:1115] HTTP GET for /slave(753)/monitor/statistics.json
from 172.17.0.4:43726
I0604 01:11:10.149610 32359 http.cpp:936] Authorizing principal 'test-principal' to GET the
'/monitor/statistics.json' endpoint
I0604 01:11:10.150401 32352 slave.cpp:817] Agent terminating
[       OK ] Endpoint/SlaveEndpointTest.UnauthorizedRequest/1 (11 ms)
[ RUN      ] Endpoint/SlaveEndpointTest.UnauthorizedRequest/2
I0604 01:11:10.156162 32335 containerizer.cpp:230] Using isolation: posix/cpu,posix/mem,filesystem/posix,network/cni,environment_secret
W0604 01:11:10.156492 32335 backend.cpp:76] Failed to create 'aufs' backend: AufsBackend requires
root privileges
W0604 01:11:10.156534 32335 backend.cpp:76] Failed to create 'bind' backend: BindBackend requires
root privileges
I0604 01:11:10.156553 32335 provisioner.cpp:255] Using default backend 'copy'
I0604 01:11:10.157716 32359 slave.cpp:248] Mesos agent started on (754)@172.17.0.4:42385
I0604 01:11:10.157755 32359 slave.cpp:249] Flags at startup: --acls="" --appc_simple_discovery_uri_prefix="http://"
--appc_store_dir="/tmp/Endpoint_SlaveEndpointTest_UnauthorizedRequest_2_tbbwVS/store/appc"
--authenticate_http_readonly="true" --authenticate_http_readwrite="true" --authenticatee="crammd5"
--authentication_backoff_factor="1secs" --authorizer="local" --cgroups_cpu_enable_pids_and_tids_count="false"
--cgroups_enable_cfs="false" --cgroups_hierarchy="/sys/fs/cgroup" --cgroups_limit_swap="false"
--cgroups_root="mesos" --container_disk_watch_interval="15secs" --containerizers="mesos" --credential="/tmp/Endpoint_SlaveEndpointTest_UnauthorizedRequest_2_tbbwVS/credential"
--default_role="*" --disk_watch_interval="1mins" --docker="docker" --docker_kill_orphans="true"
--docker_registry="https://registry-1.docker.io" --docker_remove_delay="6hrs" --docker_socket="/var/run/docker.sock"
--docker_stop_timeout="0ns" --docker_store_dir="/tmp/Endpoint_SlaveEndpointTest_UnauthorizedRequest_2_tbbwVS/store/docker"
--docker_volume_checkpoint_dir="/var/run/mesos/isolators/docker/volume" --enforce_container_disk_quota="false"
--executor_registration_timeout="1mins" --executor_reregistration_timeout="2secs" --executor_shutdown_grace_period="5secs"
--fetcher_cache_dir="/tmp/Endpoint_SlaveEndpointTest_UnauthorizedRequest_2_tbbwVS/fetch" --fetcher_cache_size="2GB"
--frameworks_home="" --gc_delay="1weeks" --gc_disk_headroom="0.1" --hadoop_home="" --help="false"
--hostname_lookup="true" --http_command_executor="false" --http_credentials="/tmp/Endpoint_SlaveEndpointTest_UnauthorizedRequest_2_tbbwVS/http_credentials"
--http_heartbeat_interval="30secs" --initialize_driver_logging="true" --isolation="posix/cpu,posix/mem"
--launcher="posix" --launcher_dir="/mesos/build/src" --logbufsecs="0" --logging_level="INFO"
--max_completed_executors_per_framework="150" --oversubscribed_resources_interval="15secs"
--perf_duration="10secs" --perf_interval="1mins" --port="5051" --qos_correction_interval_min="0ns"
--quiet="false" --recover="reconnect" --recovery_timeout="15mins" --registration_backoff_factor="10ms"
--resources="cpus:2;gpus:0;mem:1024;disk:1024;ports:[31000-32000]" --revocable_cpu_low_priority="true"
--runtime_dir="/tmp/Endpoint_SlaveEndpointTest_UnauthorizedRequest_2_tbbwVS" --sandbox_directory="/mnt/mesos/sandbox"
--strict="true" --switch_user="true" --systemd_enable_support="true" --systemd_runtime_directory="/run/systemd/system"
--version="false" --work_dir="/tmp/Endpoint_SlaveEndpointTest_UnauthorizedRequest_2_JJ4DwZ"
I0604 01:11:10.157968 32359 credentials.hpp:86] Loading credential for authentication from
'/tmp/Endpoint_SlaveEndpointTest_UnauthorizedRequest_2_tbbwVS/credential'
I0604 01:11:10.158083 32359 slave.cpp:281] Agent using credential for: test-principal
I0604 01:11:10.158097 32359 credentials.hpp:37] Loading credentials for authentication from
'/tmp/Endpoint_SlaveEndpointTest_UnauthorizedRequest_2_tbbwVS/http_credentials'
I0604 01:11:10.158229 32359 http.cpp:975] Creating default 'basic' HTTP authenticator for
realm 'mesos-agent-readonly'
I0604 01:11:10.158313 32359 http.cpp:975] Creating default 'basic' HTTP authenticator for
realm 'mesos-agent-readwrite'
I0604 01:11:10.158892 32359 slave.cpp:552] Agent resources: cpus(*):2; mem(*):1024; disk(*):1024;
ports(*):[31000-32000]
I0604 01:11:10.158923 32359 slave.cpp:560] Agent attributes: [  ]
I0604 01:11:10.158932 32359 slave.cpp:565] Agent hostname: 8e5ca7af7217
I0604 01:11:10.159019 32336 status_update_manager.cpp:177] Pausing sending status updates
I0604 01:11:10.159339 32355 state.cpp:62] Recovering state from '/tmp/Endpoint_SlaveEndpointTest_UnauthorizedRequest_2_JJ4DwZ/meta'
I0604 01:11:10.159518 32352 status_update_manager.cpp:203] Recovering status update manager
I0604 01:11:10.159756 32354 containerizer.cpp:582] Recovering containerizer
I0604 01:11:10.160277 32354 provisioner.cpp:416] Provisioner recovery complete
I0604 01:11:10.160459 32354 slave.cpp:6119] Finished recovery
I0604 01:11:10.160835 32354 slave.cpp:6301] Querying resource estimator for oversubscribable
resources
I0604 01:11:10.161010 32354 slave.cpp:6315] Received oversubscribable resources {} from the
resource estimator
I0604 01:11:10.161844 32355 process.cpp:3778] Handling HTTP event for process 'slave(754)'
with path: '/slave(754)/containers'
I0604 01:11:10.162206 32355 http.cpp:1115] HTTP GET for /slave(754)/containers from 172.17.0.4:43728
I0604 01:11:10.162248 32355 http.cpp:936] Authorizing principal 'test-principal' to GET the
'/containers' endpoint
I0604 01:11:10.163241 32338 slave.cpp:817] Agent terminating
[       OK ] Endpoint/SlaveEndpointTest.UnauthorizedRequest/2 (12 ms)
[ RUN      ] Endpoint/SlaveEndpointTest.NoAuthorizer/0
I0604 01:11:10.168884 32335 containerizer.cpp:230] Using isolation: posix/cpu,posix/mem,filesystem/posix,network/cni,environment_secret
W0604 01:11:10.169230 32335 backend.cpp:76] Failed to create 'aufs' backend: AufsBackend requires
root privileges
W0604 01:11:10.169276 32335 backend.cpp:76] Failed to create 'bind' backend: BindBackend requires
root privileges
I0604 01:11:10.169293 32335 provisioner.cpp:255] Using default backend 'copy'
I0604 01:11:10.170110 32335 cluster.cpp:448] Creating default 'local' authorizer
I0604 01:11:10.170677 32349 slave.cpp:248] Mesos agent started on (755)@172.17.0.4:42385
I0604 01:11:10.170694 32349 slave.cpp:249] Flags at startup: --acls="" --appc_simple_discovery_uri_prefix="http://"
--appc_store_dir="/tmp/Endpoint_SlaveEndpointTest_NoAuthorizer_0_rBRlDs/store/appc" --authenticate_http_readonly="true"
--authenticate_http_readwrite="true" --authenticatee="crammd5" --authentication_backoff_factor="1secs"
--authorizer="local" --cgroups_cpu_enable_pids_and_tids_count="false" --cgroups_enable_cfs="false"
--cgroups_hierarchy="/sys/fs/cgroup" --cgroups_limit_swap="false" --cgroups_root="mesos" --container_disk_watch_interval="15secs"
--containerizers="mesos" --credential="/tmp/Endpoint_SlaveEndpointTest_NoAuthorizer_0_rBRlDs/credential"
--default_role="*" --disk_watch_interval="1mins" --docker="docker" --docker_kill_orphans="true"
--docker_registry="https://registry-1.docker.io" --docker_remove_delay="6hrs" --docker_socket="/var/run/docker.sock"
--docker_stop_timeout="0ns" --docker_store_dir="/tmp/Endpoint_SlaveEndpointTest_NoAuthorizer_0_rBRlDs/store/docker"
--docker_volume_checkpoint_dir="/var/run/mesos/isolators/docker/volume" --enforce_container_disk_quota="false"
--executor_registration_timeout="1mins" --executor_reregistration_timeout="2secs" --executor_shutdown_grace_period="5secs"
--fetcher_cache_dir="/tmp/Endpoint_SlaveEndpointTest_NoAuthorizer_0_rBRlDs/fetch" --fetcher_cache_size="2GB"
--frameworks_home="" --gc_delay="1weeks" --gc_disk_headroom="0.1" --hadoop_home="" --help="false"
--hostname_lookup="true" --http_command_executor="false" --http_credentials="/tmp/Endpoint_SlaveEndpointTest_NoAuthorizer_0_rBRlDs/http_credentials"
--http_heartbeat_interval="30secs" --initialize_driver_logging="true" --isolation="posix/cpu,posix/mem"
--launcher="posix" --launcher_dir="/mesos/build/src" --logbufsecs="0" --logging_level="INFO"
--max_completed_executors_per_framework="150" --oversubscribed_resources_interval="15secs"
--perf_duration="10secs" --perf_interval="1mins" --port="5051" --qos_correction_interval_min="0ns"
--quiet="false" --recover="reconnect" --recovery_timeout="15mins" --registration_backoff_factor="10ms"
--resources="cpus:2;gpus:0;mem:1024;disk:1024;ports:[31000-32000]" --revocable_cpu_low_priority="true"
--runtime_dir="/tmp/Endpoint_SlaveEndpointTest_NoAuthorizer_0_rBRlDs" --sandbox_directory="/mnt/mesos/sandbox"
--strict="true" --switch_user="true" --systemd_enable_support="true" --systemd_runtime_directory="/run/systemd/system"
--version="false" --work_dir="/tmp/Endpoint_SlaveEndpointTest_NoAuthorizer_0_ztPBcz"
I0604 01:11:10.170967 32349 credentials.hpp:86] Loading credential for authentication from
'/tmp/Endpoint_SlaveEndpointTest_NoAuthorizer_0_rBRlDs/credential'
I0604 01:11:10.171084 32349 slave.cpp:281] Agent using credential for: test-principal
I0604 01:11:10.171102 32349 credentials.hpp:37] Loading credentials for authentication from
'/tmp/Endpoint_SlaveEndpointTest_NoAuthorizer_0_rBRlDs/http_credentials'
I0604 01:11:10.171231 32349 http.cpp:975] Creating default 'basic' HTTP authenticator for
realm 'mesos-agent-readonly'
I0604 01:11:10.171300 32349 http.cpp:975] Creating default 'basic' HTTP authenticator for
realm 'mesos-agent-readwrite'
I0604 01:11:10.171758 32349 slave.cpp:552] Agent resources: cpus(*):2; mem(*):1024; disk(*):1024;
ports(*):[31000-32000]
I0604 01:11:10.171797 32349 slave.cpp:560] Agent attributes: [  ]
I0604 01:11:10.171807 32349 slave.cpp:565] Agent hostname: 8e5ca7af7217
I0604 01:11:10.171874 32336 status_update_manager.cpp:177] Pausing sending status updates
I0604 01:11:10.172317 32345 state.cpp:62] Recovering state from '/tmp/Endpoint_SlaveEndpointTest_NoAuthorizer_0_ztPBcz/meta'
I0604 01:11:10.172523 32353 status_update_manager.cpp:203] Recovering status update manager
I0604 01:11:10.172627 32342 containerizer.cpp:582] Recovering containerizer
I0604 01:11:10.173204 32338 provisioner.cpp:416] Provisioner recovery complete
I0604 01:11:10.173346 32338 slave.cpp:6119] Finished recovery
I0604 01:11:10.173754 32338 slave.cpp:6301] Querying resource estimator for oversubscribable
resources
I0604 01:11:10.173868 32348 slave.cpp:6315] Received oversubscribable resources {} from the
resource estimator
I0604 01:11:10.174571 32340 process.cpp:3778] Handling HTTP event for process 'slave(755)'
with path: '/slave(755)/monitor/statistics'
I0604 01:11:10.174937 32340 http.cpp:1115] HTTP GET for /slave(755)/monitor/statistics from
172.17.0.4:43730
I0604 01:11:10.174981 32340 http.cpp:936] Authorizing principal 'test-principal' to GET the
'/monitor/statistics' endpoint
I0604 01:11:10.176448 32335 slave.cpp:817] Agent terminating
[       OK ] Endpoint/SlaveEndpointTest.NoAuthorizer/0 (12 ms)
[ RUN      ] Endpoint/SlaveEndpointTest.NoAuthorizer/1
I0604 01:11:10.181721 32335 containerizer.cpp:230] Using isolation: posix/cpu,posix/mem,filesystem/posix,network/cni,environment_secret
W0604 01:11:10.181998 32335 backend.cpp:76] Failed to create 'aufs' backend: AufsBackend requires
root privileges
W0604 01:11:10.182031 32335 backend.cpp:76] Failed to create 'bind' backend: BindBackend requires
root privileges
I0604 01:11:10.182056 32335 provisioner.cpp:255] Using default backend 'copy'
I0604 01:11:10.182533 32335 cluster.cpp:448] Creating default 'local' authorizer
I0604 01:11:10.182914 32343 slave.cpp:248] Mesos agent started on (756)@172.17.0.4:42385
I0604 01:11:10.182929 32343 slave.cpp:249] Flags at startup: --acls="" --appc_simple_discovery_uri_prefix="http://"
--appc_store_dir="/tmp/Endpoint_SlaveEndpointTest_NoAuthorizer_1_Nui1s2/store/appc" --authenticate_http_readonly="true"
--authenticate_http_readwrite="true" --authenticatee="crammd5" --authentication_backoff_factor="1secs"
--authorizer="local" --cgroups_cpu_enable_pids_and_tids_count="false" --cgroups_enable_cfs="false"
--cgroups_hierarchy="/sys/fs/cgroup" --cgroups_limit_swap="false" --cgroups_root="mesos" --container_disk_watch_interval="15secs"
--containerizers="mesos" --credential="/tmp/Endpoint_SlaveEndpointTest_NoAuthorizer_1_Nui1s2/credential"
--default_role="*" --disk_watch_interval="1mins" --docker="docker" --docker_kill_orphans="true"
--docker_registry="https://registry-1.docker.io" --docker_remove_delay="6hrs" --docker_socket="/var/run/docker.sock"
--docker_stop_timeout="0ns" --docker_store_dir="/tmp/Endpoint_SlaveEndpointTest_NoAuthorizer_1_Nui1s2/store/docker"
--docker_volume_checkpoint_dir="/var/run/mesos/isolators/docker/volume" --enforce_container_disk_quota="false"
--executor_registration_timeout="1mins" --executor_reregistration_timeout="2secs" --executor_shutdown_grace_period="5secs"
--fetcher_cache_dir="/tmp/Endpoint_SlaveEndpointTest_NoAuthorizer_1_Nui1s2/fetch" --fetcher_cache_size="2GB"
--frameworks_home="" --gc_delay="1weeks" --gc_disk_headroom="0.1" --hadoop_home="" --help="false"
--hostname_lookup="true" --http_command_executor="false" --http_credentials="/tmp/Endpoint_SlaveEndpointTest_NoAuthorizer_1_Nui1s2/http_credentials"
--http_heartbeat_interval="30secs" --initialize_driver_logging="true" --isolation="posix/cpu,posix/mem"
--launcher="posix" --launcher_dir="/mesos/build/src" --logbufsecs="0" --logging_level="INFO"
--max_completed_executors_per_framework="150" --oversubscribed_resources_interval="15secs"
--perf_duration="10secs" --perf_interval="1mins" --port="5051" --qos_correction_interval_min="0ns"
--quiet="false" --recover="reconnect" --recovery_timeout="15mins" --registration_backoff_factor="10ms"
--resources="cpus:2;gpus:0;mem:1024;disk:1024;ports:[31000-32000]" --revocable_cpu_low_priority="true"
--runtime_dir="/tmp/Endpoint_SlaveEndpointTest_NoAuthorizer_1_Nui1s2" --sandbox_directory="/mnt/mesos/sandbox"
--strict="true" --switch_user="true" --systemd_enable_support="true" --systemd_runtime_directory="/run/systemd/system"
--version="false" --work_dir="/tmp/Endpoint_SlaveEndpointTest_NoAuthorizer_1_mluj08"
I0604 01:11:10.183105 32343 credentials.hpp:86] Loading credential for authentication from
'/tmp/Endpoint_SlaveEndpointTest_NoAuthorizer_1_Nui1s2/credential'
I0604 01:11:10.183182 32343 slave.cpp:281] Agent using credential for: test-principal
I0604 01:11:10.183192 32343 credentials.hpp:37] Loading credentials for authentication from
'/tmp/Endpoint_SlaveEndpointTest_NoAuthorizer_1_Nui1s2/http_credentials'
I0604 01:11:10.183276 32343 http.cpp:975] Creating default 'basic' HTTP authenticator for
realm 'mesos-agent-readonly'
I0604 01:11:10.183315 32343 http.cpp:975] Creating default 'basic' HTTP authenticator for
realm 'mesos-agent-readwrite'
I0604 01:11:10.183701 32343 slave.cpp:552] Agent resources: cpus(*):2; mem(*):1024; disk(*):1024;
ports(*):[31000-32000]
I0604 01:11:10.183728 32343 slave.cpp:560] Agent attributes: [  ]
I0604 01:11:10.183733 32343 slave.cpp:565] Agent hostname: 8e5ca7af7217
I0604 01:11:10.183812 32355 status_update_manager.cpp:177] Pausing sending status updates
I0604 01:11:10.184041 32343 state.cpp:62] Recovering state from '/tmp/Endpoint_SlaveEndpointTest_NoAuthorizer_1_mluj08/meta'
I0604 01:11:10.184257 32342 status_update_manager.cpp:203] Recovering status update manager
I0604 01:11:10.184367 32359 containerizer.cpp:582] Recovering containerizer
I0604 01:11:10.184845 32348 provisioner.cpp:416] Provisioner recovery complete
I0604 01:11:10.185135 32344 slave.cpp:6119] Finished recovery
I0604 01:11:10.185446 32344 slave.cpp:6301] Querying resource estimator for oversubscribable
resources
I0604 01:11:10.185526 32341 slave.cpp:6315] Received oversubscribable resources {} from the
resource estimator
I0604 01:11:10.186106 32354 process.cpp:3778] Handling HTTP event for process 'slave(756)'
with path: '/slave(756)/monitor/statistics.json'
I0604 01:11:10.186450 32347 http.cpp:1115] HTTP GET for /slave(756)/monitor/statistics.json
from 172.17.0.4:43732
I0604 01:11:10.186483 32347 http.cpp:936] Authorizing principal 'test-principal' to GET the
'/monitor/statistics.json' endpoint
I0604 01:11:10.187430 32359 slave.cpp:817] Agent terminating
[       OK ] Endpoint/SlaveEndpointTest.NoAuthorizer/1 (10 ms)
[ RUN      ] Endpoint/SlaveEndpointTest.NoAuthorizer/2
I0604 01:11:10.191802 32335 containerizer.cpp:230] Using isolation: posix/cpu,posix/mem,filesystem/posix,network/cni,environment_secret
W0604 01:11:10.192059 32335 backend.cpp:76] Failed to create 'aufs' backend: AufsBackend requires
root privileges
W0604 01:11:10.192090 32335 backend.cpp:76] Failed to create 'bind' backend: BindBackend requires
root privileges
I0604 01:11:10.192106 32335 provisioner.cpp:255] Using default backend 'copy'
I0604 01:11:10.192665 32335 cluster.cpp:448] Creating default 'local' authorizer
I0604 01:11:10.193049 32357 slave.cpp:248] Mesos agent started on (757)@172.17.0.4:42385
I0604 01:11:10.193063 32357 slave.cpp:249] Flags at startup: --acls="" --appc_simple_discovery_uri_prefix="http://"
--appc_store_dir="/tmp/Endpoint_SlaveEndpointTest_NoAuthorizer_2_F315oC/store/appc" --authenticate_http_readonly="true"
--authenticate_http_readwrite="true" --authenticatee="crammd5" --authentication_backoff_factor="1secs"
--authorizer="local" --cgroups_cpu_enable_pids_and_tids_count="false" --cgroups_enable_cfs="false"
--cgroups_hierarchy="/sys/fs/cgroup" --cgroups_limit_swap="false" --cgroups_root="mesos" --container_disk_watch_interval="15secs"
--containerizers="mesos" --credential="/tmp/Endpoint_SlaveEndpointTest_NoAuthorizer_2_F315oC/credential"
--default_role="*" --disk_watch_interval="1mins" --docker="docker" --docker_kill_orphans="true"
--docker_registry="https://registry-1.docker.io" --docker_remove_delay="6hrs" --docker_socket="/var/run/docker.sock"
--docker_stop_timeout="0ns" --docker_store_dir="/tmp/Endpoint_SlaveEndpointTest_NoAuthorizer_2_F315oC/store/docker"
--docker_volume_checkpoint_dir="/var/run/mesos/isolators/docker/volume" --enforce_container_disk_quota="false"
--executor_registration_timeout="1mins" --executor_reregistration_timeout="2secs" --executor_shutdown_grace_period="5secs"
--fetcher_cache_dir="/tmp/Endpoint_SlaveEndpointTest_NoAuthorizer_2_F315oC/fetch" --fetcher_cache_size="2GB"
--frameworks_home="" --gc_delay="1weeks" --gc_disk_headroom="0.1" --hadoop_home="" --help="false"
--hostname_lookup="true" --http_command_executor="false" --http_credentials="/tmp/Endpoint_SlaveEndpointTest_NoAuthorizer_2_F315oC/http_credentials"
--http_heartbeat_interval="30secs" --initialize_driver_logging="true" --isolation="posix/cpu,posix/mem"
--launcher="posix" --launcher_dir="/mesos/build/src" --logbufsecs="0" --logging_level="INFO"
--max_completed_executors_per_framework="150" --oversubscribed_resources_interval="15secs"
--perf_duration="10secs" --perf_interval="1mins" --port="5051" --qos_correction_interval_min="0ns"
--quiet="false" --recover="reconnect" --recovery_timeout="15mins" --registration_backoff_factor="10ms"
--resources="cpus:2;gpus:0;mem:1024;disk:1024;ports:[31000-32000]" --revocable_cpu_low_priority="true"
--runtime_dir="/tmp/Endpoint_SlaveEndpointTest_NoAuthorizer_2_F315oC" --sandbox_directory="/mnt/mesos/sandbox"
--strict="true" --switch_user="true" --systemd_enable_support="true" --systemd_runtime_directory="/run/systemd/system"
--version="false" --work_dir="/tmp/Endpoint_SlaveEndpointTest_NoAuthorizer_2_8bxQUI"
I0604 01:11:10.193264 32357 credentials.hpp:86] Loading credential for authentication from
'/tmp/Endpoint_SlaveEndpointTest_NoAuthorizer_2_F315oC/credential'
I0604 01:11:10.193336 32357 slave.cpp:281] Agent using credential for: test-principal
I0604 01:11:10.193347 32357 credentials.hpp:37] Loading credentials for authentication from
'/tmp/Endpoint_SlaveEndpointTest_NoAuthorizer_2_F315oC/http_credentials'
I0604 01:11:10.193421 32357 http.cpp:975] Creating default 'basic' HTTP authenticator for
realm 'mesos-agent-readonly'
I0604 01:11:10.193461 32357 http.cpp:975] Creating default 'basic' HTTP authenticator for
realm 'mesos-agent-readwrite'
I0604 01:11:10.193805 32357 slave.cpp:552] Agent resources: cpus(*):2; mem(*):1024; disk(*):1024;
ports(*):[31000-32000]
I0604 01:11:10.193831 32357 slave.cpp:560] Agent attributes: [  ]
I0604 01:11:10.193835 32357 slave.cpp:565] Agent hostname: 8e5ca7af7217
I0604 01:11:10.193887 32356 status_update_manager.cpp:177] Pausing sending status updates
I0604 01:11:10.194120 32350 state.cpp:62] Recovering state from '/tmp/Endpoint_SlaveEndpointTest_NoAuthorizer_2_8bxQUI/meta'
I0604 01:11:10.194290 32340 status_update_manager.cpp:203] Recovering status update manager
I0604 01:11:10.194360 32342 containerizer.cpp:582] Recovering containerizer
I0604 01:11:10.194866 32338 provisioner.cpp:416] Provisioner recovery complete
I0604 01:11:10.195065 32339 slave.cpp:6119] Finished recovery
I0604 01:11:10.195325 32339 slave.cpp:6301] Querying resource estimator for oversubscribable
resources
I0604 01:11:10.195399 32345 slave.cpp:6315] Received oversubscribable resources {} from the
resource estimator
I0604 01:11:10.195870 32342 process.cpp:3778] Handling HTTP event for process 'slave(757)'
with path: '/slave(757)/containers'
I0604 01:11:10.196393 32343 http.cpp:1115] HTTP GET for /slave(757)/containers from 172.17.0.4:43734
I0604 01:11:10.196421 32343 http.cpp:936] Authorizing principal 'test-principal' to GET the
'/containers' endpoint
I0604 01:11:10.197458 32352 slave.cpp:817] Agent terminating
[       OK ] Endpoint/SlaveEndpointTest.NoAuthorizer/2 (10 ms)
[----------] 9 tests from Endpoint/SlaveEndpointTest (113 ms total)

[----------] Global test environment tear-down
[==========] 1536 tests from 168 test cases ran. (242147 ms total)
[  PASSED  ] 1535 tests.
[  FAILED  ] 1 test, listed below:
[  FAILED  ] ContentType/AgentAPIStreamingTest.AttachInputToNestedContainerSession/0, where
GetParam() = application/x-protobuf

 1 FAILED TEST
  YOU HAVE 22 DISABLED TESTS

E0604 01:11:10.245213 32360 process.cpp:968] Failed to accept socket: future discarded
make[3]: *** [CMakeFiles/check] Error 1
make[3]: Leaving directory `/mesos/build'
make[2]: *** [CMakeFiles/check.dir/all] Error 2
make[2]: Leaving directory `/mesos/build'
make[1]: *** [CMakeFiles/check.dir/rule] Error 2
make[1]: Leaving directory `/mesos/build'
make: *** [check] Error 2
+ docker rmi mesos-1496534509-24271
Untagged: mesos-1496534509-24271:latest
Deleted: sha256:aa622b0f15a98ebf42ccc115116e2c931af9ff36c8b577497403b227871e2a85
Deleted: sha256:a100e33a7bc2851de7208d85f85ea2057e7889ac924c037127afd63499451129
Deleted: sha256:22e46eb25265091968104f0d38cb06ea689608f5264e86e672dc0f4d9611f505
Deleted: sha256:d553a293d3d68ea6226accbcd5bd1f7d0abf0f3d76fdfb1a29ffd6a1c41fa817
Deleted: sha256:6f0b32053070b517daa8e8879a60951e622f4bccaf31d29dc08bfc43462c60e5
Deleted: sha256:657e045784e8522da232c2fbed8135ab3a7e317220b1dc487a9bea2c1c1b8fdb
Deleted: sha256:c4e42fe799278b244a50e4aa454f7d15f6a8b2846e197a433efcb6376350037f
Deleted: sha256:5f6726884d21e3a81c91668d2be43d2620f4aadc5bbb0b4f62120d7b9388db98
Deleted: sha256:7b13afa9cb9fa0ec715b2fe81eb175a11772cee4c1fcd4b8629cb3a1eba687d3
Deleted: sha256:402aa34d85c914487ffa2715f42b1f1b6b88a41a2675b838d2bbd8f882b998b2
Deleted: sha256:8adf975bdc6613f0018552471d9a06e17c22455d57227c44a17dcb1751f9231f
Deleted: sha256:374ec9d1742946de45d8ad74f9e88ca5fe51af5101d29b4d139e0ac3ddcab065
Deleted: sha256:d47a22ae56aa8c4ea7e78b35b006beb77b570d77efa44d4513e129b14534460b
Deleted: sha256:cc069bf3623fb4d78a472e208f9158a38611f00147f29a91081ea5f401381f9d
Deleted: sha256:68b3515a04948c54dfa5dd2e587a63448ee8c6761e83ec0b70145ea580ff0805
Deleted: sha256:f575c12669115c5cd5600ca90144ab130792a7ef7027fcf2fa93670f42b5e8d6
Deleted: sha256:ae5932a926e836179a1801a9d6dfb4fea07a09d9b3bec6b372d7147a60f4b0b8
Deleted: sha256:ce3ce9791ec562e1a5f6328212e4bc89d656cebd4865036197caf866cd2ec108
Deleted: sha256:3df67b4e7646e0840f9f344b91cf49d25f4418a2ae9fedb6d37034aa00df8460
Deleted: sha256:b610867f503e81bc34c41ab3de7e25881e453e645c944e6049165f7c5d7dd6ea
Deleted: sha256:7fd7c9610500cd654553029a53599614d09bf31a38943a8cdafd496ae26c5620
Deleted: sha256:d306f40cfb50c9206eaea1e7ab1728096599194792c02637a48a06048688ea67
Deleted: sha256:9c207809ab495d09daad9c3b3b47b2c0f33e2a4c63956af41389f55e1bccc2a1
Deleted: sha256:c86e731d662752ceba8b43d19bf6fc665fd105f9c542affc7196522d90dd5351
Build step 'Execute shell' marked build as failure
Not sending mail to unregistered user yujie.jay@gmail.com

Mime
View raw message