mesos-builds mailing list archives

Site index · List index
Message view « Date » · « Thread »
Top « Date » · « Thread »
From Apache Jenkins Server <jenk...@builds.apache.org>
Subject Build failed in Jenkins: Mesos-Buildbot » autotools,gcc,--verbose --enable-libevent --enable-ssl,GLOG_v=1 MESOS_VERBOSE=1,ubuntu:14.04,(ubuntu)&&(!ubuntu-us1)&&(!ubuntu-eu2) #3822
Date Tue, 20 Jun 2017 15:33:50 GMT
See <https://builds.apache.org/job/Mesos-Buildbot/BUILDTOOL=autotools,COMPILER=gcc,CONFIGURATION=--verbose%20--enable-libevent%20--enable-ssl,ENVIRONMENT=GLOG_v=1%20MESOS_VERBOSE=1,OS=ubuntu%3A14.04,label_exp=(ubuntu)&&(!ubuntu-us1)&&(!ubuntu-eu2)/3822/display/redirect?page=changes>

Changes:

[toenshoff] Fixed a signed / unsigned comparison in resources_tests.cpp.

------------------------------------------
[...truncated 29.67 MB...]
[       OK ] Endpoint/SlaveEndpointTest.AuthorizedRequest/2 (46 ms)
[ RUN      ] Endpoint/SlaveEndpointTest.UnauthorizedRequest/0
I0620 15:33:41.977583  6198 containerizer.cpp:230] Using isolation: posix/cpu,posix/mem,filesystem/posix,network/cni,environment_secret
W0620 15:33:41.978500  6198 backend.cpp:76] Failed to create 'overlay' backend: OverlayBackend
requires root privileges
W0620 15:33:41.978806  6198 backend.cpp:76] Failed to create 'bind' backend: BindBackend requires
root privileges
I0620 15:33:41.978930  6198 provisioner.cpp:255] Using default backend 'copy'
I0620 15:33:41.983855 22470 slave.cpp:249] Mesos agent started on (770)@172.17.0.2:33507
I0620 15:33:41.983892 22470 slave.cpp:250] Flags at startup: --acls="" --appc_simple_discovery_uri_prefix="http://"
--appc_store_dir="/tmp/Endpoint_SlaveEndpointTest_UnauthorizedRequest_0_eYlVwA/store/appc"
--authenticate_http_executors="true" --authenticate_http_readonly="true" --authenticate_http_readwrite="true"
--authenticatee="crammd5" --authentication_backoff_factor="1secs" --authorizer="local" --cgroups_cpu_enable_pids_and_tids_count="false"
--cgroups_enable_cfs="false" --cgroups_hierarchy="/sys/fs/cgroup" --cgroups_limit_swap="false"
--cgroups_root="mesos" --container_disk_watch_interval="15secs" --containerizers="mesos" --credential="/tmp/Endpoint_SlaveEndpointTest_UnauthorizedRequest_0_eYlVwA/credential"
--default_role="*" --disk_watch_interval="1mins" --docker="docker" --docker_kill_orphans="true"
--docker_registry="https://registry-1.docker.io" --docker_remove_delay="6hrs" --docker_socket="/var/run/docker.sock"
--docker_stop_timeout="0ns" --docker_store_dir="/tmp/Endpoint_SlaveEndpointTest_UnauthorizedRequest_0_eYlVwA/store/docker"
--docker_volume_checkpoint_dir="/var/run/mesos/isolators/docker/volume" --enforce_container_disk_quota="false"
--executor_registration_timeout="1mins" --executor_reregistration_timeout="2secs" --executor_secret_key="/tmp/Endpoint_SlaveEndpointTest_UnauthorizedRequest_0_eYlVwA/executor_secret_key"
--executor_shutdown_grace_period="5secs" --fetcher_cache_dir="/tmp/Endpoint_SlaveEndpointTest_UnauthorizedRequest_0_eYlVwA/fetch"
--fetcher_cache_size="2GB" --frameworks_home="" --gc_delay="1weeks" --gc_disk_headroom="0.1"
--hadoop_home="" --help="false" --hostname_lookup="true" --http_command_executor="false" --http_credentials="/tmp/Endpoint_SlaveEndpointTest_UnauthorizedRequest_0_eYlVwA/http_credentials"
--http_heartbeat_interval="30secs" --initialize_driver_logging="true" --isolation="posix/cpu,posix/mem"
--launcher="posix" --launcher_dir="/mesos/mesos-1.4.0/_build/src" --logbufsecs="0" --logging_level="INFO"
--max_completed_executors_per_framework="150" --oversubscribed_resources_interval="15secs"
--perf_duration="10secs" --perf_interval="1mins" --port="5051" --qos_correction_interval_min="0ns"
--quiet="false" --recover="reconnect" --recovery_timeout="15mins" --registration_backoff_factor="10ms"
--resources="cpus:2;gpus:0;mem:1024;disk:1024;ports:[31000-32000]" --revocable_cpu_low_priority="true"
--runtime_dir="/tmp/Endpoint_SlaveEndpointTest_UnauthorizedRequest_0_eYlVwA" --sandbox_directory="/mnt/mesos/sandbox"
--strict="true" --switch_user="true" --systemd_enable_support="true" --systemd_runtime_directory="/run/systemd/system"
--version="false" --work_dir="/tmp/Endpoint_SlaveEndpointTest_UnauthorizedRequest_0_Q4hLXk"
I0620 15:33:41.984714 22470 credentials.hpp:86] Loading credential for authentication from
'/tmp/Endpoint_SlaveEndpointTest_UnauthorizedRequest_0_eYlVwA/credential'
I0620 15:33:41.985085 22470 slave.cpp:282] Agent using credential for: test-principal
I0620 15:33:41.985112 22470 credentials.hpp:37] Loading credentials for authentication from
'/tmp/Endpoint_SlaveEndpointTest_UnauthorizedRequest_0_eYlVwA/http_credentials'
I0620 15:33:41.985667 22470 http.cpp:974] Creating default 'basic' HTTP authenticator for
realm 'mesos-agent-executor'
I0620 15:33:41.985940 22470 http.cpp:995] Creating default 'jwt' HTTP authenticator for realm
'mesos-agent-executor'
I0620 15:33:41.986246 22470 http.cpp:974] Creating default 'basic' HTTP authenticator for
realm 'mesos-agent-readonly'
I0620 15:33:41.986430 22470 http.cpp:995] Creating default 'jwt' HTTP authenticator for realm
'mesos-agent-readonly'
I0620 15:33:41.986691 22470 http.cpp:974] Creating default 'basic' HTTP authenticator for
realm 'mesos-agent-readwrite'
I0620 15:33:41.986789 22470 http.cpp:995] Creating default 'jwt' HTTP authenticator for realm
'mesos-agent-readwrite'
I0620 15:33:41.989012 22470 slave.cpp:553] Agent resources: cpus:2; mem:1024; disk:1024; ports:[31000-32000]
I0620 15:33:41.989150 22470 slave.cpp:561] Agent attributes: [  ]
I0620 15:33:41.989171 22470 slave.cpp:566] Agent hostname: 6176b3c01b67
I0620 15:33:41.989503 22473 status_update_manager.cpp:177] Pausing sending status updates
I0620 15:33:41.991561 22470 state.cpp:64] Recovering state from '/tmp/Endpoint_SlaveEndpointTest_UnauthorizedRequest_0_Q4hLXk/meta'
I0620 15:33:41.992032 22471 status_update_manager.cpp:203] Recovering status update manager
I0620 15:33:41.992342 22476 containerizer.cpp:582] Recovering containerizer
I0620 15:33:41.994745 22471 provisioner.cpp:416] Provisioner recovery complete
I0620 15:33:41.995491 22473 slave.cpp:6162] Finished recovery
I0620 15:33:41.996188 22473 slave.cpp:6344] Querying resource estimator for oversubscribable
resources
I0620 15:33:41.996630 22472 slave.cpp:6358] Received oversubscribable resources {} from the
resource estimator
I0620 15:33:42.000010 22474 process.cpp:3779] Handling HTTP event for process 'slave(770)'
with path: '/slave(770)/monitor/statistics'
I0620 15:33:42.002684 22470 http.cpp:1114] HTTP GET for /slave(770)/monitor/statistics from
172.17.0.2:35062
I0620 15:33:42.002805 22470 http.cpp:935] Authorizing principal 'test-principal' to GET the
'/monitor/statistics' endpoint
I0620 15:33:42.007062 22476 slave.cpp:818] Agent terminating
[       OK ] Endpoint/SlaveEndpointTest.UnauthorizedRequest/0 (44 ms)
[ RUN      ] Endpoint/SlaveEndpointTest.UnauthorizedRequest/1
I0620 15:33:42.022686  6198 containerizer.cpp:230] Using isolation: posix/cpu,posix/mem,filesystem/posix,network/cni,environment_secret
W0620 15:33:42.023648  6198 backend.cpp:76] Failed to create 'overlay' backend: OverlayBackend
requires root privileges
W0620 15:33:42.023991  6198 backend.cpp:76] Failed to create 'bind' backend: BindBackend requires
root privileges
I0620 15:33:42.024049  6198 provisioner.cpp:255] Using default backend 'copy'
I0620 15:33:42.029053 22472 slave.cpp:249] Mesos agent started on (771)@172.17.0.2:33507
I0620 15:33:42.029129 22472 slave.cpp:250] Flags at startup: --acls="" --appc_simple_discovery_uri_prefix="http://"
--appc_store_dir="/tmp/Endpoint_SlaveEndpointTest_UnauthorizedRequest_1_4GNAcB/store/appc"
--authenticate_http_executors="true" --authenticate_http_readonly="true" --authenticate_http_readwrite="true"
--authenticatee="crammd5" --authentication_backoff_factor="1secs" --authorizer="local" --cgroups_cpu_enable_pids_and_tids_count="false"
--cgroups_enable_cfs="false" --cgroups_hierarchy="/sys/fs/cgroup" --cgroups_limit_swap="false"
--cgroups_root="mesos" --container_disk_watch_interval="15secs" --containerizers="mesos" --credential="/tmp/Endpoint_SlaveEndpointTest_UnauthorizedRequest_1_4GNAcB/credential"
--default_role="*" --disk_watch_interval="1mins" --docker="docker" --docker_kill_orphans="true"
--docker_registry="https://registry-1.docker.io" --docker_remove_delay="6hrs" --docker_socket="/var/run/docker.sock"
--docker_stop_timeout="0ns" --docker_store_dir="/tmp/Endpoint_SlaveEndpointTest_UnauthorizedRequest_1_4GNAcB/store/docker"
--docker_volume_checkpoint_dir="/var/run/mesos/isolators/docker/volume" --enforce_container_disk_quota="false"
--executor_registration_timeout="1mins" --executor_reregistration_timeout="2secs" --executor_secret_key="/tmp/Endpoint_SlaveEndpointTest_UnauthorizedRequest_1_4GNAcB/executor_secret_key"
--executor_shutdown_grace_period="5secs" --fetcher_cache_dir="/tmp/Endpoint_SlaveEndpointTest_UnauthorizedRequest_1_4GNAcB/fetch"
--fetcher_cache_size="2GB" --frameworks_home="" --gc_delay="1weeks" --gc_disk_headroom="0.1"
--hadoop_home="" --help="false" --hostname_lookup="true" --http_command_executor="false" --http_credentials="/tmp/Endpoint_SlaveEndpointTest_UnauthorizedRequest_1_4GNAcB/http_credentials"
--http_heartbeat_interval="30secs" --initialize_driver_logging="true" --isolation="posix/cpu,posix/mem"
--launcher="posix" --launcher_dir="/mesos/mesos-1.4.0/_build/src" --logbufsecs="0" --logging_level="INFO"
--max_completed_executors_per_framework="150" --oversubscribed_resources_interval="15secs"
--perf_duration="10secs" --perf_interval="1mins" --port="5051" --qos_correction_interval_min="0ns"
--quiet="false" --recover="reconnect" --recovery_timeout="15mins" --registration_backoff_factor="10ms"
--resources="cpus:2;gpus:0;mem:1024;disk:1024;ports:[31000-32000]" --revocable_cpu_low_priority="true"
--runtime_dir="/tmp/Endpoint_SlaveEndpointTest_UnauthorizedRequest_1_4GNAcB" --sandbox_directory="/mnt/mesos/sandbox"
--strict="true" --switch_user="true" --systemd_enable_support="true" --systemd_runtime_directory="/run/systemd/system"
--version="false" --work_dir="/tmp/Endpoint_SlaveEndpointTest_UnauthorizedRequest_1_SZQ7vl"
I0620 15:33:42.029891 22472 credentials.hpp:86] Loading credential for authentication from
'/tmp/Endpoint_SlaveEndpointTest_UnauthorizedRequest_1_4GNAcB/credential'
I0620 15:33:42.030238 22472 slave.cpp:282] Agent using credential for: test-principal
I0620 15:33:42.030305 22472 credentials.hpp:37] Loading credentials for authentication from
'/tmp/Endpoint_SlaveEndpointTest_UnauthorizedRequest_1_4GNAcB/http_credentials'
I0620 15:33:42.030750 22472 http.cpp:974] Creating default 'basic' HTTP authenticator for
realm 'mesos-agent-executor'
I0620 15:33:42.030959 22472 http.cpp:995] Creating default 'jwt' HTTP authenticator for realm
'mesos-agent-executor'
I0620 15:33:42.031507 22472 http.cpp:974] Creating default 'basic' HTTP authenticator for
realm 'mesos-agent-readonly'
I0620 15:33:42.031658 22472 http.cpp:995] Creating default 'jwt' HTTP authenticator for realm
'mesos-agent-readonly'
I0620 15:33:42.031855 22472 http.cpp:974] Creating default 'basic' HTTP authenticator for
realm 'mesos-agent-readwrite'
I0620 15:33:42.031971 22472 http.cpp:995] Creating default 'jwt' HTTP authenticator for realm
'mesos-agent-readwrite'
I0620 15:33:42.034164 22472 slave.cpp:553] Agent resources: cpus:2; mem:1024; disk:1024; ports:[31000-32000]
I0620 15:33:42.034571 22472 slave.cpp:561] Agent attributes: [  ]
I0620 15:33:42.034618 22472 slave.cpp:566] Agent hostname: 6176b3c01b67
I0620 15:33:42.034966 22470 status_update_manager.cpp:177] Pausing sending status updates
I0620 15:33:42.036798 22473 state.cpp:64] Recovering state from '/tmp/Endpoint_SlaveEndpointTest_UnauthorizedRequest_1_SZQ7vl/meta'
I0620 15:33:42.037474 22476 status_update_manager.cpp:203] Recovering status update manager
I0620 15:33:42.037739 22474 containerizer.cpp:582] Recovering containerizer
I0620 15:33:42.039769 22470 provisioner.cpp:416] Provisioner recovery complete
I0620 15:33:42.040400 22477 slave.cpp:6162] Finished recovery
I0620 15:33:42.041146 22477 slave.cpp:6344] Querying resource estimator for oversubscribable
resources
I0620 15:33:42.041532 22476 slave.cpp:6358] Received oversubscribable resources {} from the
resource estimator
I0620 15:33:42.045123 22470 process.cpp:3779] Handling HTTP event for process 'slave(771)'
with path: '/slave(771)/monitor/statistics.json'
I0620 15:33:42.048074 22476 http.cpp:1114] HTTP GET for /slave(771)/monitor/statistics.json
from 172.17.0.2:35064
I0620 15:33:42.048195 22476 http.cpp:935] Authorizing principal 'test-principal' to GET the
'/monitor/statistics.json' endpoint
I0620 15:33:42.050992  6198 slave.cpp:818] Agent terminating
[       OK ] Endpoint/SlaveEndpointTest.UnauthorizedRequest/1 (44 ms)
[ RUN      ] Endpoint/SlaveEndpointTest.UnauthorizedRequest/2
I0620 15:33:42.066493  6198 containerizer.cpp:230] Using isolation: posix/cpu,posix/mem,filesystem/posix,network/cni,environment_secret
W0620 15:33:42.067332  6198 backend.cpp:76] Failed to create 'overlay' backend: OverlayBackend
requires root privileges
W0620 15:33:42.067561  6198 backend.cpp:76] Failed to create 'bind' backend: BindBackend requires
root privileges
I0620 15:33:42.067651  6198 provisioner.cpp:255] Using default backend 'copy'
I0620 15:33:42.072480 22475 slave.cpp:249] Mesos agent started on (772)@172.17.0.2:33507
I0620 15:33:42.072521 22475 slave.cpp:250] Flags at startup: --acls="" --appc_simple_discovery_uri_prefix="http://"
--appc_store_dir="/tmp/Endpoint_SlaveEndpointTest_UnauthorizedRequest_2_IZcPkC/store/appc"
--authenticate_http_executors="true" --authenticate_http_readonly="true" --authenticate_http_readwrite="true"
--authenticatee="crammd5" --authentication_backoff_factor="1secs" --authorizer="local" --cgroups_cpu_enable_pids_and_tids_count="false"
--cgroups_enable_cfs="false" --cgroups_hierarchy="/sys/fs/cgroup" --cgroups_limit_swap="false"
--cgroups_root="mesos" --container_disk_watch_interval="15secs" --containerizers="mesos" --credential="/tmp/Endpoint_SlaveEndpointTest_UnauthorizedRequest_2_IZcPkC/credential"
--default_role="*" --disk_watch_interval="1mins" --docker="docker" --docker_kill_orphans="true"
--docker_registry="https://registry-1.docker.io" --docker_remove_delay="6hrs" --docker_socket="/var/run/docker.sock"
--docker_stop_timeout="0ns" --docker_store_dir="/tmp/Endpoint_SlaveEndpointTest_UnauthorizedRequest_2_IZcPkC/store/docker"
--docker_volume_checkpoint_dir="/var/run/mesos/isolators/docker/volume" --enforce_container_disk_quota="false"
--executor_registration_timeout="1mins" --executor_reregistration_timeout="2secs" --executor_secret_key="/tmp/Endpoint_SlaveEndpointTest_UnauthorizedRequest_2_IZcPkC/executor_secret_key"
--executor_shutdown_grace_period="5secs" --fetcher_cache_dir="/tmp/Endpoint_SlaveEndpointTest_UnauthorizedRequest_2_IZcPkC/fetch"
--fetcher_cache_size="2GB" --frameworks_home="" --gc_delay="1weeks" --gc_disk_headroom="0.1"
--hadoop_home="" --help="false" --hostname_lookup="true" --http_command_executor="false" --http_credentials="/tmp/Endpoint_SlaveEndpointTest_UnauthorizedRequest_2_IZcPkC/http_credentials"
--http_heartbeat_interval="30secs" --initialize_driver_logging="true" --isolation="posix/cpu,posix/mem"
--launcher="posix" --launcher_dir="/mesos/mesos-1.4.0/_build/src" --logbufsecs="0" --logging_level="INFO"
--max_completed_executors_per_framework="150" --oversubscribed_resources_interval="15secs"
--perf_duration="10secs" --perf_interval="1mins" --port="5051" --qos_correction_interval_min="0ns"
--quiet="false" --recover="reconnect" --recovery_timeout="15mins" --registration_backoff_factor="10ms"
--resources="cpus:2;gpus:0;mem:1024;disk:1024;ports:[31000-32000]" --revocable_cpu_low_priority="true"
--runtime_dir="/tmp/Endpoint_SlaveEndpointTest_UnauthorizedRequest_2_IZcPkC" --sandbox_directory="/mnt/mesos/sandbox"
--strict="true" --switch_user="true" --systemd_enable_support="true" --systemd_runtime_directory="/run/systemd/system"
--version="false" --work_dir="/tmp/Endpoint_SlaveEndpointTest_UnauthorizedRequest_2_EWghxm"
I0620 15:33:42.073385 22475 credentials.hpp:86] Loading credential for authentication from
'/tmp/Endpoint_SlaveEndpointTest_UnauthorizedRequest_2_IZcPkC/credential'
I0620 15:33:42.073817 22475 slave.cpp:282] Agent using credential for: test-principal
I0620 15:33:42.073851 22475 credentials.hpp:37] Loading credentials for authentication from
'/tmp/Endpoint_SlaveEndpointTest_UnauthorizedRequest_2_IZcPkC/http_credentials'
I0620 15:33:42.074431 22475 http.cpp:974] Creating default 'basic' HTTP authenticator for
realm 'mesos-agent-executor'
I0620 15:33:42.074704 22475 http.cpp:995] Creating default 'jwt' HTTP authenticator for realm
'mesos-agent-executor'
I0620 15:33:42.075031 22475 http.cpp:974] Creating default 'basic' HTTP authenticator for
realm 'mesos-agent-readonly'
I0620 15:33:42.075152 22475 http.cpp:995] Creating default 'jwt' HTTP authenticator for realm
'mesos-agent-readonly'
I0620 15:33:42.075476 22475 http.cpp:974] Creating default 'basic' HTTP authenticator for
realm 'mesos-agent-readwrite'
I0620 15:33:42.075587 22475 http.cpp:995] Creating default 'jwt' HTTP authenticator for realm
'mesos-agent-readwrite'
I0620 15:33:42.077865 22475 slave.cpp:553] Agent resources: cpus:2; mem:1024; disk:1024; ports:[31000-32000]
I0620 15:33:42.078006 22475 slave.cpp:561] Agent attributes: [  ]
I0620 15:33:42.078027 22475 slave.cpp:566] Agent hostname: 6176b3c01b67
I0620 15:33:42.078354 22470 status_update_manager.cpp:177] Pausing sending status updates
I0620 15:33:42.080373 22477 state.cpp:64] Recovering state from '/tmp/Endpoint_SlaveEndpointTest_UnauthorizedRequest_2_EWghxm/meta'
I0620 15:33:42.080974 22471 status_update_manager.cpp:203] Recovering status update manager
I0620 15:33:42.081359 22470 containerizer.cpp:582] Recovering containerizer
I0620 15:33:42.083464 22475 provisioner.cpp:416] Provisioner recovery complete
I0620 15:33:42.084134 22470 slave.cpp:6162] Finished recovery
I0620 15:33:42.084874 22470 slave.cpp:6344] Querying resource estimator for oversubscribable
resources
I0620 15:33:42.085242 22470 slave.cpp:6358] Received oversubscribable resources {} from the
resource estimator
I0620 15:33:42.088775 22471 process.cpp:3779] Handling HTTP event for process 'slave(772)'
with path: '/slave(772)/containers'
I0620 15:33:42.091778 22473 http.cpp:1114] HTTP GET for /slave(772)/containers from 172.17.0.2:35066
I0620 15:33:42.091902 22473 http.cpp:935] Authorizing principal 'test-principal' to GET the
'/containers' endpoint
I0620 15:33:42.096313 22477 slave.cpp:818] Agent terminating
[       OK ] Endpoint/SlaveEndpointTest.UnauthorizedRequest/2 (46 ms)
[ RUN      ] Endpoint/SlaveEndpointTest.NoAuthorizer/0
I0620 15:33:42.113137  6198 containerizer.cpp:230] Using isolation: posix/cpu,posix/mem,filesystem/posix,network/cni,environment_secret
W0620 15:33:42.113981  6198 backend.cpp:76] Failed to create 'overlay' backend: OverlayBackend
requires root privileges
W0620 15:33:42.114209  6198 backend.cpp:76] Failed to create 'bind' backend: BindBackend requires
root privileges
I0620 15:33:42.114295  6198 provisioner.cpp:255] Using default backend 'copy'
I0620 15:33:42.116762  6198 cluster.cpp:448] Creating default 'local' authorizer
I0620 15:33:42.119374 22477 slave.cpp:249] Mesos agent started on (773)@172.17.0.2:33507
I0620 15:33:42.119415 22477 slave.cpp:250] Flags at startup: --acls="" --appc_simple_discovery_uri_prefix="http://"
--appc_store_dir="/tmp/Endpoint_SlaveEndpointTest_NoAuthorizer_0_QRKBWD/store/appc" --authenticate_http_executors="true"
--authenticate_http_readonly="true" --authenticate_http_readwrite="true" --authenticatee="crammd5"
--authentication_backoff_factor="1secs" --authorizer="local" --cgroups_cpu_enable_pids_and_tids_count="false"
--cgroups_enable_cfs="false" --cgroups_hierarchy="/sys/fs/cgroup" --cgroups_limit_swap="false"
--cgroups_root="mesos" --container_disk_watch_interval="15secs" --containerizers="mesos" --credential="/tmp/Endpoint_SlaveEndpointTest_NoAuthorizer_0_QRKBWD/credential"
--default_role="*" --disk_watch_interval="1mins" --docker="docker" --docker_kill_orphans="true"
--docker_registry="https://registry-1.docker.io" --docker_remove_delay="6hrs" --docker_socket="/var/run/docker.sock"
--docker_stop_timeout="0ns" --docker_store_dir="/tmp/Endpoint_SlaveEndpointTest_NoAuthorizer_0_QRKBWD/store/docker"
--docker_volume_checkpoint_dir="/var/run/mesos/isolators/docker/volume" --enforce_container_disk_quota="false"
--executor_registration_timeout="1mins" --executor_reregistration_timeout="2secs" --executor_secret_key="/tmp/Endpoint_SlaveEndpointTest_NoAuthorizer_0_QRKBWD/executor_secret_key"
--executor_shutdown_grace_period="5secs" --fetcher_cache_dir="/tmp/Endpoint_SlaveEndpointTest_NoAuthorizer_0_QRKBWD/fetch"
--fetcher_cache_size="2GB" --frameworks_home="" --gc_delay="1weeks" --gc_disk_headroom="0.1"
--hadoop_home="" --help="false" --hostname_lookup="true" --http_command_executor="false" --http_credentials="/tmp/Endpoint_SlaveEndpointTest_NoAuthorizer_0_QRKBWD/http_credentials"
--http_heartbeat_interval="30secs" --initialize_driver_logging="true" --isolation="posix/cpu,posix/mem"
--launcher="posix" --launcher_dir="/mesos/mesos-1.4.0/_build/src" --logbufsecs="0" --logging_level="INFO"
--max_completed_executors_per_framework="150" --oversubscribed_resources_interval="15secs"
--perf_duration="10secs" --perf_interval="1mins" --port="5051" --qos_correction_interval_min="0ns"
--quiet="false" --recover="reconnect" --recovery_timeout="15mins" --registration_backoff_factor="10ms"
--resources="cpus:2;gpus:0;mem:1024;disk:1024;ports:[31000-32000]" --revocable_cpu_low_priority="true"
--runtime_dir="/tmp/Endpoint_SlaveEndpointTest_NoAuthorizer_0_QRKBWD" --sandbox_directory="/mnt/mesos/sandbox"
--strict="true" --switch_user="true" --systemd_enable_support="true" --systemd_runtime_directory="/run/systemd/system"
--version="false" --work_dir="/tmp/Endpoint_SlaveEndpointTest_NoAuthorizer_0_qxTz1n"
I0620 15:33:42.120235 22477 credentials.hpp:86] Loading credential for authentication from
'/tmp/Endpoint_SlaveEndpointTest_NoAuthorizer_0_QRKBWD/credential'
I0620 15:33:42.120787 22477 slave.cpp:282] Agent using credential for: test-principal
I0620 15:33:42.120823 22477 credentials.hpp:37] Loading credentials for authentication from
'/tmp/Endpoint_SlaveEndpointTest_NoAuthorizer_0_QRKBWD/http_credentials'
I0620 15:33:42.121387 22477 http.cpp:974] Creating default 'basic' HTTP authenticator for
realm 'mesos-agent-executor'
I0620 15:33:42.121670 22477 http.cpp:995] Creating default 'jwt' HTTP authenticator for realm
'mesos-agent-executor'
I0620 15:33:42.121973 22477 http.cpp:974] Creating default 'basic' HTTP authenticator for
realm 'mesos-agent-readonly'
I0620 15:33:42.122088 22477 http.cpp:995] Creating default 'jwt' HTTP authenticator for realm
'mesos-agent-readonly'
I0620 15:33:42.122349 22477 http.cpp:974] Creating default 'basic' HTTP authenticator for
realm 'mesos-agent-readwrite'
I0620 15:33:42.122453 22477 http.cpp:995] Creating default 'jwt' HTTP authenticator for realm
'mesos-agent-readwrite'
I0620 15:33:42.124699 22477 slave.cpp:553] Agent resources: cpus:2; mem:1024; disk:1024; ports:[31000-32000]
I0620 15:33:42.124840 22477 slave.cpp:561] Agent attributes: [  ]
I0620 15:33:42.124858 22477 slave.cpp:566] Agent hostname: 6176b3c01b67
I0620 15:33:42.125244 22475 status_update_manager.cpp:177] Pausing sending status updates
I0620 15:33:42.127269 22472 state.cpp:64] Recovering state from '/tmp/Endpoint_SlaveEndpointTest_NoAuthorizer_0_qxTz1n/meta'
I0620 15:33:42.127799 22470 status_update_manager.cpp:203] Recovering status update manager
I0620 15:33:42.128159 22477 containerizer.cpp:582] Recovering containerizer
I0620 15:33:42.130271 22471 provisioner.cpp:416] Provisioner recovery complete
I0620 15:33:42.130950 22476 slave.cpp:6162] Finished recovery
I0620 15:33:42.131580 22476 slave.cpp:6344] Querying resource estimator for oversubscribable
resources
I0620 15:33:42.131968 22477 slave.cpp:6358] Received oversubscribable resources {} from the
resource estimator
I0620 15:33:42.136095 22476 process.cpp:3779] Handling HTTP event for process 'slave(773)'
with path: '/slave(773)/monitor/statistics'
I0620 15:33:42.138698 22476 http.cpp:1114] HTTP GET for /slave(773)/monitor/statistics from
172.17.0.2:35068
I0620 15:33:42.138818 22476 http.cpp:935] Authorizing principal 'test-principal' to GET the
'/monitor/statistics' endpoint
I0620 15:33:42.143426 22474 slave.cpp:818] Agent terminating
[       OK ] Endpoint/SlaveEndpointTest.NoAuthorizer/0 (45 ms)
[ RUN      ] Endpoint/SlaveEndpointTest.NoAuthorizer/1
I0620 15:33:42.159395  6198 containerizer.cpp:230] Using isolation: posix/cpu,posix/mem,filesystem/posix,network/cni,environment_secret
W0620 15:33:42.160260  6198 backend.cpp:76] Failed to create 'overlay' backend: OverlayBackend
requires root privileges
W0620 15:33:42.160485  6198 backend.cpp:76] Failed to create 'bind' backend: BindBackend requires
root privileges
I0620 15:33:42.160537  6198 provisioner.cpp:255] Using default backend 'copy'
I0620 15:33:42.163334  6198 cluster.cpp:448] Creating default 'local' authorizer
I0620 15:33:42.165925 22476 slave.cpp:249] Mesos agent started on (774)@172.17.0.2:33507
I0620 15:33:42.165966 22476 slave.cpp:250] Flags at startup: --acls="" --appc_simple_discovery_uri_prefix="http://"
--appc_store_dir="/tmp/Endpoint_SlaveEndpointTest_NoAuthorizer_1_MPSs2F/store/appc" --authenticate_http_executors="true"
--authenticate_http_readonly="true" --authenticate_http_readwrite="true" --authenticatee="crammd5"
--authentication_backoff_factor="1secs" --authorizer="local" --cgroups_cpu_enable_pids_and_tids_count="false"
--cgroups_enable_cfs="false" --cgroups_hierarchy="/sys/fs/cgroup" --cgroups_limit_swap="false"
--cgroups_root="mesos" --container_disk_watch_interval="15secs" --containerizers="mesos" --credential="/tmp/Endpoint_SlaveEndpointTest_NoAuthorizer_1_MPSs2F/credential"
--default_role="*" --disk_watch_interval="1mins" --docker="docker" --docker_kill_orphans="true"
--docker_registry="https://registry-1.docker.io" --docker_remove_delay="6hrs" --docker_socket="/var/run/docker.sock"
--docker_stop_timeout="0ns" --docker_store_dir="/tmp/Endpoint_SlaveEndpointTest_NoAuthorizer_1_MPSs2F/store/docker"
--docker_volume_checkpoint_dir="/var/run/mesos/isolators/docker/volume" --enforce_container_disk_quota="false"
--executor_registration_timeout="1mins" --executor_reregistration_timeout="2secs" --executor_secret_key="/tmp/Endpoint_SlaveEndpointTest_NoAuthorizer_1_MPSs2F/executor_secret_key"
--executor_shutdown_grace_period="5secs" --fetcher_cache_dir="/tmp/Endpoint_SlaveEndpointTest_NoAuthorizer_1_MPSs2F/fetch"
--fetcher_cache_size="2GB" --frameworks_home="" --gc_delay="1weeks" --gc_disk_headroom="0.1"
--hadoop_home="" --help="false" --hostname_lookup="true" --http_command_executor="false" --http_credentials="/tmp/Endpoint_SlaveEndpointTest_NoAuthorizer_1_MPSs2F/http_credentials"
--http_heartbeat_interval="30secs" --initialize_driver_logging="true" --isolation="posix/cpu,posix/mem"
--launcher="posix" --launcher_dir="/mesos/mesos-1.4.0/_build/src" --logbufsecs="0" --logging_level="INFO"
--max_completed_executors_per_framework="150" --oversubscribed_resources_interval="15secs"
--perf_duration="10secs" --perf_interval="1mins" --port="5051" --qos_correction_interval_min="0ns"
--quiet="false" --recover="reconnect" --recovery_timeout="15mins" --registration_backoff_factor="10ms"
--resources="cpus:2;gpus:0;mem:1024;disk:1024;ports:[31000-32000]" --revocable_cpu_low_priority="true"
--runtime_dir="/tmp/Endpoint_SlaveEndpointTest_NoAuthorizer_1_MPSs2F" --sandbox_directory="/mnt/mesos/sandbox"
--strict="true" --switch_user="true" --systemd_enable_support="true" --systemd_runtime_directory="/run/systemd/system"
--version="false" --work_dir="/tmp/Endpoint_SlaveEndpointTest_NoAuthorizer_1_u5lVZp"
I0620 15:33:42.166692 22476 credentials.hpp:86] Loading credential for authentication from
'/tmp/Endpoint_SlaveEndpointTest_NoAuthorizer_1_MPSs2F/credential'
I0620 15:33:42.166950 22476 slave.cpp:282] Agent using credential for: test-principal
I0620 15:33:42.166978 22476 credentials.hpp:37] Loading credentials for authentication from
'/tmp/Endpoint_SlaveEndpointTest_NoAuthorizer_1_MPSs2F/http_credentials'
I0620 15:33:42.167392 22476 http.cpp:974] Creating default 'basic' HTTP authenticator for
realm 'mesos-agent-executor'
I0620 15:33:42.167575 22476 http.cpp:995] Creating default 'jwt' HTTP authenticator for realm
'mesos-agent-executor'
I0620 15:33:42.167870 22476 http.cpp:974] Creating default 'basic' HTTP authenticator for
realm 'mesos-agent-readonly'
I0620 15:33:42.167980 22476 http.cpp:995] Creating default 'jwt' HTTP authenticator for realm
'mesos-agent-readonly'
I0620 15:33:42.168164 22476 http.cpp:974] Creating default 'basic' HTTP authenticator for
realm 'mesos-agent-readwrite'
I0620 15:33:42.168258 22476 http.cpp:995] Creating default 'jwt' HTTP authenticator for realm
'mesos-agent-readwrite'
I0620 15:33:42.170419 22476 slave.cpp:553] Agent resources: cpus:2; mem:1024; disk:1024; ports:[31000-32000]
I0620 15:33:42.170560 22476 slave.cpp:561] Agent attributes: [  ]
I0620 15:33:42.170581 22476 slave.cpp:566] Agent hostname: 6176b3c01b67
I0620 15:33:42.170917 22477 status_update_manager.cpp:177] Pausing sending status updates
I0620 15:33:42.172590 22472 state.cpp:64] Recovering state from '/tmp/Endpoint_SlaveEndpointTest_NoAuthorizer_1_u5lVZp/meta'
I0620 15:33:42.173127 22475 status_update_manager.cpp:203] Recovering status update manager
I0620 15:33:42.173470 22471 containerizer.cpp:582] Recovering containerizer
I0620 15:33:42.175722 22475 provisioner.cpp:416] Provisioner recovery complete
I0620 15:33:42.176399 22477 slave.cpp:6162] Finished recovery
I0620 15:33:42.177162 22477 slave.cpp:6344] Querying resource estimator for oversubscribable
resources
I0620 15:33:42.178638 22471 slave.cpp:6358] Received oversubscribable resources {} from the
resource estimator
I0620 15:33:42.182009 22477 process.cpp:3779] Handling HTTP event for process 'slave(774)'
with path: '/slave(774)/monitor/statistics.json'
I0620 15:33:42.184782 22470 http.cpp:1114] HTTP GET for /slave(774)/monitor/statistics.json
from 172.17.0.2:35070
I0620 15:33:42.184906 22470 http.cpp:935] Authorizing principal 'test-principal' to GET the
'/monitor/statistics.json' endpoint
I0620 15:33:42.189955 22472 slave.cpp:818] Agent terminating
[       OK ] Endpoint/SlaveEndpointTest.NoAuthorizer/1 (46 ms)
[ RUN      ] Endpoint/SlaveEndpointTest.NoAuthorizer/2
I0620 15:33:42.206872  6198 containerizer.cpp:230] Using isolation: posix/cpu,posix/mem,filesystem/posix,network/cni,environment_secret
W0620 15:33:42.207708  6198 backend.cpp:76] Failed to create 'overlay' backend: OverlayBackend
requires root privileges
W0620 15:33:42.207893  6198 backend.cpp:76] Failed to create 'bind' backend: BindBackend requires
root privileges
I0620 15:33:42.207943  6198 provisioner.cpp:255] Using default backend 'copy'
I0620 15:33:42.210328  6198 cluster.cpp:448] Creating default 'local' authorizer
I0620 15:33:42.212838 22474 slave.cpp:249] Mesos agent started on (775)@172.17.0.2:33507
I0620 15:33:42.212877 22474 slave.cpp:250] Flags at startup: --acls="" --appc_simple_discovery_uri_prefix="http://"
--appc_store_dir="/tmp/Endpoint_SlaveEndpointTest_NoAuthorizer_2_uCkoCI/store/appc" --authenticate_http_executors="true"
--authenticate_http_readonly="true" --authenticate_http_readwrite="true" --authenticatee="crammd5"
--authentication_backoff_factor="1secs" --authorizer="local" --cgroups_cpu_enable_pids_and_tids_count="false"
--cgroups_enable_cfs="false" --cgroups_hierarchy="/sys/fs/cgroup" --cgroups_limit_swap="false"
--cgroups_root="mesos" --container_disk_watch_interval="15secs" --containerizers="mesos" --credential="/tmp/Endpoint_SlaveEndpointTest_NoAuthorizer_2_uCkoCI/credential"
--default_role="*" --disk_watch_interval="1mins" --docker="docker" --docker_kill_orphans="true"
--docker_registry="https://registry-1.docker.io" --docker_remove_delay="6hrs" --docker_socket="/var/run/docker.sock"
--docker_stop_timeout="0ns" --docker_store_dir="/tmp/Endpoint_SlaveEndpointTest_NoAuthorizer_2_uCkoCI/store/docker"
--docker_volume_checkpoint_dir="/var/run/mesos/isolators/docker/volume" --enforce_container_disk_quota="false"
--executor_registration_timeout="1mins" --executor_reregistration_timeout="2secs" --executor_secret_key="/tmp/Endpoint_SlaveEndpointTest_NoAuthorizer_2_uCkoCI/executor_secret_key"
--executor_shutdown_grace_period="5secs" --fetcher_cache_dir="/tmp/Endpoint_SlaveEndpointTest_NoAuthorizer_2_uCkoCI/fetch"
--fetcher_cache_size="2GB" --frameworks_home="" --gc_delay="1weeks" --gc_disk_headroom="0.1"
--hadoop_home="" --help="false" --hostname_lookup="true" --http_command_executor="false" --http_credentials="/tmp/Endpoint_SlaveEndpointTest_NoAuthorizer_2_uCkoCI/http_credentials"
--http_heartbeat_interval="30secs" --initialize_driver_logging="true" --isolation="posix/cpu,posix/mem"
--launcher="posix" --launcher_dir="/mesos/mesos-1.4.0/_build/src" --logbufsecs="0" --logging_level="INFO"
--max_completed_executors_per_framework="150" --oversubscribed_resources_interval="15secs"
--perf_duration="10secs" --perf_interval="1mins" --port="5051" --qos_correction_interval_min="0ns"
--quiet="false" --recover="reconnect" --recovery_timeout="15mins" --registration_backoff_factor="10ms"
--resources="cpus:2;gpus:0;mem:1024;disk:1024;ports:[31000-32000]" --revocable_cpu_low_priority="true"
--runtime_dir="/tmp/Endpoint_SlaveEndpointTest_NoAuthorizer_2_uCkoCI" --sandbox_directory="/mnt/mesos/sandbox"
--strict="true" --switch_user="true" --systemd_enable_support="true" --systemd_runtime_directory="/run/systemd/system"
--version="false" --work_dir="/tmp/Endpoint_SlaveEndpointTest_NoAuthorizer_2_cm5hss"
I0620 15:33:42.213642 22474 credentials.hpp:86] Loading credential for authentication from
'/tmp/Endpoint_SlaveEndpointTest_NoAuthorizer_2_uCkoCI/credential'
I0620 15:33:42.213919 22474 slave.cpp:282] Agent using credential for: test-principal
I0620 15:33:42.213948 22474 credentials.hpp:37] Loading credentials for authentication from
'/tmp/Endpoint_SlaveEndpointTest_NoAuthorizer_2_uCkoCI/http_credentials'
I0620 15:33:42.214377 22474 http.cpp:974] Creating default 'basic' HTTP authenticator for
realm 'mesos-agent-executor'
I0620 15:33:42.214572 22474 http.cpp:995] Creating default 'jwt' HTTP authenticator for realm
'mesos-agent-executor'
I0620 15:33:42.214807 22474 http.cpp:974] Creating default 'basic' HTTP authenticator for
realm 'mesos-agent-readonly'
I0620 15:33:42.214910 22474 http.cpp:995] Creating default 'jwt' HTTP authenticator for realm
'mesos-agent-readonly'
I0620 15:33:42.215104 22474 http.cpp:974] Creating default 'basic' HTTP authenticator for
realm 'mesos-agent-readwrite'
I0620 15:33:42.215229 22474 http.cpp:995] Creating default 'jwt' HTTP authenticator for realm
'mesos-agent-readwrite'
I0620 15:33:42.218261 22474 slave.cpp:553] Agent resources: cpus:2; mem:1024; disk:1024; ports:[31000-32000]
I0620 15:33:42.218405 22474 slave.cpp:561] Agent attributes: [  ]
I0620 15:33:42.218427 22474 slave.cpp:566] Agent hostname: 6176b3c01b67
I0620 15:33:42.218660 22473 status_update_manager.cpp:177] Pausing sending status updates
I0620 15:33:42.220613 22473 state.cpp:64] Recovering state from '/tmp/Endpoint_SlaveEndpointTest_NoAuthorizer_2_cm5hss/meta'
I0620 15:33:42.221122 22470 status_update_manager.cpp:203] Recovering status update manager
I0620 15:33:42.221482 22474 containerizer.cpp:582] Recovering containerizer
I0620 15:33:42.223556 22474 provisioner.cpp:416] Provisioner recovery complete
I0620 15:33:42.224205 22473 slave.cpp:6162] Finished recovery
I0620 15:33:42.224836 22473 slave.cpp:6344] Querying resource estimator for oversubscribable
resources
I0620 15:33:42.225371 22471 slave.cpp:6358] Received oversubscribable resources {} from the
resource estimator
I0620 15:33:42.228970 22473 process.cpp:3779] Handling HTTP event for process 'slave(775)'
with path: '/slave(775)/containers'
I0620 15:33:42.231655 22474 http.cpp:1114] HTTP GET for /slave(775)/containers from 172.17.0.2:35072
I0620 15:33:42.231783 22474 http.cpp:935] Authorizing principal 'test-principal' to GET the
'/containers' endpoint
I0620 15:33:42.237251  6198 slave.cpp:818] Agent terminating
[       OK ] Endpoint/SlaveEndpointTest.NoAuthorizer/2 (46 ms)
[----------] 9 tests from Endpoint/SlaveEndpointTest (411 ms total)

[----------] Global test environment tear-down
[==========] 1619 tests from 179 test cases ran. (748033 ms total)
[  PASSED  ] 1614 tests.
[  FAILED  ] 5 tests, listed below:
[  FAILED  ] CommandExecutorCheckTest.CommandCheckDeliveredAndReconciled
[  FAILED  ] DefaultExecutorCheckTest.CommandCheckDeliveredAndReconciled
[  FAILED  ] DefaultExecutorCheckTest.CommandCheckStatusChange
[  FAILED  ] DefaultExecutorCheckTest.CommandCheckSeesParentsEnv
[  FAILED  ] DefaultExecutorCheckTest.CommandCheckSharesWorkDirWithTask

 5 FAILED TESTS
  YOU HAVE 20 DISABLED TESTS

E0620 15:33:42.379840 22478 process.cpp:968] Failed to accept socket: future discarded
make[4]: *** [check-local] Error 1
make[4]: Leaving directory `/mesos/mesos-1.4.0/_build/src'
make[3]: *** [check-am] Error 2
make[3]: Leaving directory `/mesos/mesos-1.4.0/_build/src'
make[2]: *** [check] Error 2
make[2]: Leaving directory `/mesos/mesos-1.4.0/_build/src'
make[1]: *** [check-recursive] Error 1
make[1]: Leaving directory `/mesos/mesos-1.4.0/_build'
make: *** [distcheck] Error 1
+ docker rmi mesos-1497966814-6403
Untagged: mesos-1497966814-6403:latest
Deleted: sha256:d35ac3827cedad033a25aef177e04c93228ed40f21fa0a4ec02271b4041b088c
Deleted: sha256:5eacb7d17b01e006eb9be6ce1b208698a1641711b1138e3fea276459cdfee8b2
Deleted: sha256:818369e04c8646609e560b4385b392e73847c6b11c2ffa7ab49d797472db5d29
Deleted: sha256:82a727f73752c7d5982e29a886793a3925afc53f3679cbf80b7430fbf155f230
Deleted: sha256:dfb817786a741fa30a491ceaf02a84536237972751ff9be18ca8c98bcd44f4ba
Deleted: sha256:a73e3c8fed3b457bb26c89cd38fc2d2b02c39c82529d3ed34773861138258d60
Deleted: sha256:c56c417fa01aa581ec9a6fe1d8fa762cdc6bc9f0b4b63dc57006691b51fb69dc
Deleted: sha256:a823871eb42f05b907f92d425977bfd3abdc215fc23edca4391c6cfc1304f15c
Deleted: sha256:8b9d555c76174fc6ab57eee0f6afb32901d0e488db4a1d53d04869147bdc5dfa
Deleted: sha256:2f24ada44f72856909386c249b68359ca681a2d05f1b01acc96b7a192f6f0662
Deleted: sha256:52a5c48179641694a38da267f14ff4d39e50e95b762410b57fa6422b1b8e45fe
Deleted: sha256:c583261df4caf99e5f0e0f4be02504a7fced9073cd23e9d66fc41b4a67d94fce
Deleted: sha256:43177023715cc7a2fc6b552aeca876a877ac08f9314e24b168a9dd1a3d7e5362
Deleted: sha256:d3a7fdc95837dfcc3e4f4cd7a37f005dc9cfe6f28f18c436dfbf6ad956ce3f09
Deleted: sha256:e5869b6add7c4a20aa82d821c9daceed0bbb22dc83ea087b8ef8fa8fbe6a4993
Deleted: sha256:1c09b149b2cb59eeb22b4204f1d46798dea5f50e749b2a9055742dbcf6e6523e
Deleted: sha256:d705d193004ae75618e39984c5adfecc3437f2114e6fb4a33211db4510cbb343
Deleted: sha256:d87797587e80ebe2b8998310b24dc1827e0aa0c144109e8105a57f9043d6c2ba
Deleted: sha256:e4c3c502f1d09f945552ec3545e1ae5558f478bbb91613311ec22b3329ea2b88
Deleted: sha256:0ad1eaf8476c2b08656b5e571884a84b9950727b4250529029fa62423ea08421
Deleted: sha256:6070a8893a4491420f62a960f6c589962a54678c7c2c7c59531c033afd88c6d7
Deleted: sha256:bc72cfba966f196dc3b58acea3a5dd3a57a026c4d5bb4debec460e3b863a58b3
Deleted: sha256:dbedbc8b217dd0ba91dcdc6ed8fc8a17808ced7ddee3509033456738bea45350
Deleted: sha256:a8a5920a9a821baa7c56c554ddb86c100455d1b631e48114dacae51a9493f538
Build step 'Execute shell' marked build as failure
Not sending mail to unregistered user toenshoff@me.com

Mime
View raw message